G04 EAGLE Gerber RS-274X export*
G75*
%MOMM*%
%FSLAX34Y34*%
%LPD*%
%INSoldermask Bottom*%
%IPPOS*%
%AMOC8*
5,1,8,0,0,1.08239X$1,22.5*%
G01*
%ADD10R,1.203200X1.953200*%
%ADD11R,1.953200X1.203200*%
%ADD12R,2.023200X1.223200*%
%ADD13R,1.223200X2.023200*%
%ADD14C,1.625600*%
%ADD15R,1.153200X1.503200*%
%ADD16R,3.453200X1.503200*%
%ADD17R,1.603200X1.603200*%
%ADD18R,1.653200X1.153200*%
%ADD19R,1.153200X1.653200*%
%ADD20C,0.809600*%
%ADD21C,0.959600*%


D10*
X-850760Y937478D03*
X-820760Y937478D03*
D11*
G36*
X-329544Y945885D02*
X-315734Y932075D01*
X-324242Y923567D01*
X-338052Y937377D01*
X-329544Y945885D01*
G37*
G36*
X-350757Y924672D02*
X-336947Y910862D01*
X-345455Y902354D01*
X-359265Y916164D01*
X-350757Y924672D01*
G37*
D12*
G36*
X-353084Y970212D02*
X-338779Y955907D01*
X-347428Y947258D01*
X-361733Y961563D01*
X-353084Y970212D01*
G37*
G36*
X-372883Y950413D02*
X-358578Y936108D01*
X-367227Y927459D01*
X-381532Y941764D01*
X-372883Y950413D01*
G37*
D13*
X-851093Y903554D03*
X-823093Y903554D03*
D14*
X-675279Y885016D03*
X-657318Y902976D03*
X-639358Y920937D03*
X-621397Y938897D03*
X-603437Y956858D03*
X-585476Y974818D03*
X-567516Y992779D03*
X-549555Y1010739D03*
X-854318Y1065187D03*
X-836358Y1083147D03*
X-818397Y1101108D03*
X-800437Y1119068D03*
X-782476Y1137029D03*
X-764516Y1154989D03*
X-746555Y1172950D03*
X-728595Y1190910D03*
X-654559Y739080D03*
X-679959Y739080D03*
X-705359Y739080D03*
X-730759Y739080D03*
X-756159Y739080D03*
X-781559Y739080D03*
X-338405Y1052687D03*
X-356366Y1070647D03*
X-374326Y1088608D03*
X-392287Y1106568D03*
X-410247Y1124529D03*
X-428208Y1142489D03*
X-446168Y1160450D03*
X-464129Y1178410D03*
X-416701Y742312D03*
X-442101Y742312D03*
X-467501Y742312D03*
X-492901Y742312D03*
X-518301Y742312D03*
X-431800Y900700D03*
X-431800Y851900D03*
X-762000Y864600D03*
X-762000Y913400D03*
X-812800Y774700D03*
X-812800Y800100D03*
X-812800Y825500D03*
X-863600Y825500D03*
X-863600Y800100D03*
X-863600Y774700D03*
X-330200Y774700D03*
X-330200Y800100D03*
X-330200Y825500D03*
X-381000Y825500D03*
X-381000Y800100D03*
X-381000Y774700D03*
X-718200Y691792D03*
X-698743Y675465D03*
X-679285Y659138D03*
X-558800Y1206500D03*
X-584200Y1206500D03*
X-609600Y1206500D03*
X-635000Y1206500D03*
X-635000Y1155700D03*
X-609600Y1155700D03*
X-584200Y1155700D03*
X-558800Y1155700D03*
D15*
X-485100Y1109500D03*
X-508000Y1109500D03*
X-530900Y1109500D03*
D16*
X-508000Y1176500D03*
D17*
X-724388Y895490D03*
X-713312Y916919D03*
X-900144Y991360D03*
X-889709Y1023468D03*
X-863546Y1038573D03*
X-761527Y962071D03*
X-812956Y1044729D03*
X-838393Y1045850D03*
X-817316Y1069468D03*
X-411373Y936076D03*
X-402306Y990288D03*
X-371531Y1053923D03*
X-340628Y1025919D03*
X-307701Y1028935D03*
X-311552Y997140D03*
X-292336Y978903D03*
X-282946Y926316D03*
X-283071Y909100D03*
X-481077Y825487D03*
X-395080Y869636D03*
X-287145Y871931D03*
D18*
G36*
X-450061Y790421D02*
X-461750Y802110D01*
X-453595Y810265D01*
X-441906Y798576D01*
X-450061Y790421D01*
G37*
G36*
X-435919Y804563D02*
X-447608Y816252D01*
X-439453Y824407D01*
X-427764Y812718D01*
X-435919Y804563D01*
G37*
G36*
X-436011Y775128D02*
X-447700Y786817D01*
X-439545Y794972D01*
X-427856Y783283D01*
X-436011Y775128D01*
G37*
G36*
X-421869Y789270D02*
X-433558Y800959D01*
X-425403Y809114D01*
X-413714Y797425D01*
X-421869Y789270D01*
G37*
D19*
X-607000Y627000D03*
X-587000Y627000D03*
X-607000Y607000D03*
X-587000Y607000D03*
D20*
X-893000Y923000D03*
X-808000Y915000D03*
X-808000Y931000D03*
X-300000Y931000D03*
X-385000Y923000D03*
X-862000Y902000D03*
X-863000Y926000D03*
D21*
X-331000Y901000D03*
X-428000Y1115000D03*
D20*
X-609000Y923000D03*
X-583000Y909000D03*
X-602000Y848000D03*
X-782500Y872500D03*
X-642500Y1012500D03*
X-300000Y907000D03*
X-385000Y915000D03*
X-385000Y931000D03*
X-893000Y947000D03*
X-808000Y939000D03*
X-808000Y923000D03*
X-529000Y1113000D03*
X-610000Y985000D03*
X-893462Y955364D03*
X-846906Y884225D03*
X-870877Y971386D03*
X-346900Y957500D03*
X-854900Y884600D03*
X-705000Y845000D03*
X-675000Y845000D03*
X-482500Y1005000D03*
X-457500Y1030000D03*
X-862900Y884600D03*
X-720000Y837500D03*
X-455000Y1050000D03*
X-424534Y949589D03*
X-800000Y1012500D03*
X-822500Y884907D03*
X-782500Y975000D03*
X-782500Y1012500D03*
X-788000Y900000D03*
X-768000Y900000D03*
X-788000Y922000D03*
X-746000Y929000D03*
X-825000Y992198D03*
X-813000Y1014000D03*
X-839000Y988000D03*
X-823000Y1008000D03*
X-851000Y986000D03*
X-838000Y1014000D03*
X-893400Y915100D03*
X-893400Y931100D03*
X-893400Y939100D03*
X-385400Y955100D03*
X-314900Y969600D03*
X-322900Y969600D03*
X-300400Y955100D03*
X-338900Y884600D03*
X-360000Y865000D03*
X-347000Y872000D03*
X-903000Y875000D03*
X-893400Y907100D03*
M02*
