G04 EAGLE Gerber RS-274X export*
G75*
%MOMM*%
%FSLAX34Y34*%
%LPD*%
%IN*%
%IPPOS*%
%AMOC8*
5,1,8,0,0,1.08239X$1,22.5*%
G01*
%ADD10C,0.152400*%
%ADD11C,0.254000*%


D10*
X-936900Y914400D02*
X-936798Y922744D01*
X-936490Y931083D01*
X-935979Y939412D01*
X-935263Y947726D01*
X-934343Y956020D01*
X-933220Y964288D01*
X-931894Y972527D01*
X-930367Y980731D01*
X-928639Y988894D01*
X-926711Y997013D01*
X-924584Y1005082D01*
X-922260Y1013097D01*
X-919740Y1021052D01*
X-917025Y1028943D01*
X-914118Y1036764D01*
X-911019Y1044512D01*
X-907731Y1052182D01*
X-904256Y1059769D01*
X-900596Y1067268D01*
X-896753Y1074675D01*
X-892730Y1081985D01*
X-888528Y1089195D01*
X-884150Y1096299D01*
X-879600Y1103294D01*
X-874879Y1110175D01*
X-869991Y1116938D01*
X-864938Y1123579D01*
X-859724Y1130094D01*
X-854351Y1136479D01*
X-848823Y1142730D01*
X-843144Y1148844D01*
X-837316Y1154816D01*
X-831344Y1160644D01*
X-825230Y1166323D01*
X-818979Y1171851D01*
X-812594Y1177224D01*
X-806079Y1182438D01*
X-799438Y1187491D01*
X-792675Y1192379D01*
X-785794Y1197100D01*
X-778799Y1201650D01*
X-771695Y1206028D01*
X-764485Y1210230D01*
X-757175Y1214253D01*
X-749768Y1218096D01*
X-742269Y1221756D01*
X-734682Y1225231D01*
X-727012Y1228519D01*
X-719264Y1231618D01*
X-711443Y1234525D01*
X-703552Y1237240D01*
X-695597Y1239760D01*
X-687582Y1242084D01*
X-679513Y1244211D01*
X-671394Y1246139D01*
X-663231Y1247867D01*
X-655027Y1249394D01*
X-646788Y1250720D01*
X-638520Y1251843D01*
X-630226Y1252763D01*
X-621912Y1253479D01*
X-613583Y1253990D01*
X-605244Y1254298D01*
X-596900Y1254400D01*
X-588556Y1254298D01*
X-580217Y1253990D01*
X-571888Y1253479D01*
X-563574Y1252763D01*
X-555280Y1251843D01*
X-547012Y1250720D01*
X-538773Y1249394D01*
X-530569Y1247867D01*
X-522406Y1246139D01*
X-514287Y1244211D01*
X-506218Y1242084D01*
X-498203Y1239760D01*
X-490248Y1237240D01*
X-482357Y1234525D01*
X-474536Y1231618D01*
X-466788Y1228519D01*
X-459118Y1225231D01*
X-451531Y1221756D01*
X-444032Y1218096D01*
X-436625Y1214253D01*
X-429315Y1210230D01*
X-422105Y1206028D01*
X-415001Y1201650D01*
X-408006Y1197100D01*
X-401125Y1192379D01*
X-394362Y1187491D01*
X-387721Y1182438D01*
X-381206Y1177224D01*
X-374821Y1171851D01*
X-368570Y1166323D01*
X-362456Y1160644D01*
X-356484Y1154816D01*
X-350656Y1148844D01*
X-344977Y1142730D01*
X-339449Y1136479D01*
X-334076Y1130094D01*
X-328862Y1123579D01*
X-323809Y1116938D01*
X-318921Y1110175D01*
X-314200Y1103294D01*
X-309650Y1096299D01*
X-305272Y1089195D01*
X-301070Y1081985D01*
X-297047Y1074675D01*
X-293204Y1067268D01*
X-289544Y1059769D01*
X-286069Y1052182D01*
X-282781Y1044512D01*
X-279682Y1036764D01*
X-276775Y1028943D01*
X-274060Y1021052D01*
X-271540Y1013097D01*
X-269216Y1005082D01*
X-267089Y997013D01*
X-265161Y988894D01*
X-263433Y980731D01*
X-261906Y972527D01*
X-260580Y964288D01*
X-259457Y956020D01*
X-258537Y947726D01*
X-257821Y939412D01*
X-257310Y931083D01*
X-257002Y922744D01*
X-256900Y914400D01*
X-257002Y906056D01*
X-257310Y897717D01*
X-257821Y889388D01*
X-258537Y881074D01*
X-259457Y872780D01*
X-260580Y864512D01*
X-261906Y856273D01*
X-263433Y848069D01*
X-265161Y839906D01*
X-267089Y831787D01*
X-269216Y823718D01*
X-271540Y815703D01*
X-274060Y807748D01*
X-276775Y799857D01*
X-279682Y792036D01*
X-282781Y784288D01*
X-286069Y776618D01*
X-289544Y769031D01*
X-293204Y761532D01*
X-297047Y754125D01*
X-301070Y746815D01*
X-305272Y739605D01*
X-309650Y732501D01*
X-314200Y725506D01*
X-318921Y718625D01*
X-323809Y711862D01*
X-328862Y705221D01*
X-334076Y698706D01*
X-339449Y692321D01*
X-344977Y686070D01*
X-350656Y679956D01*
X-356484Y673984D01*
X-362456Y668156D01*
X-368570Y662477D01*
X-374821Y656949D01*
X-381206Y651576D01*
X-387721Y646362D01*
X-394362Y641309D01*
X-401125Y636421D01*
X-408006Y631700D01*
X-415001Y627150D01*
X-422105Y622772D01*
X-429315Y618570D01*
X-436625Y614547D01*
X-444032Y610704D01*
X-451531Y607044D01*
X-459118Y603569D01*
X-466788Y600281D01*
X-474536Y597182D01*
X-482357Y594275D01*
X-490248Y591560D01*
X-498203Y589040D01*
X-506218Y586716D01*
X-514287Y584589D01*
X-522406Y582661D01*
X-530569Y580933D01*
X-538773Y579406D01*
X-547012Y578080D01*
X-555280Y576957D01*
X-563574Y576037D01*
X-571888Y575321D01*
X-580217Y574810D01*
X-588556Y574502D01*
X-596900Y574400D01*
X-605244Y574502D01*
X-613583Y574810D01*
X-621912Y575321D01*
X-630226Y576037D01*
X-638520Y576957D01*
X-646788Y578080D01*
X-655027Y579406D01*
X-663231Y580933D01*
X-671394Y582661D01*
X-679513Y584589D01*
X-687582Y586716D01*
X-695597Y589040D01*
X-703552Y591560D01*
X-711443Y594275D01*
X-719264Y597182D01*
X-727012Y600281D01*
X-734682Y603569D01*
X-742269Y607044D01*
X-749768Y610704D01*
X-757175Y614547D01*
X-764485Y618570D01*
X-771695Y622772D01*
X-778799Y627150D01*
X-785794Y631700D01*
X-792675Y636421D01*
X-799438Y641309D01*
X-806079Y646362D01*
X-812594Y651576D01*
X-818979Y656949D01*
X-825230Y662477D01*
X-831344Y668156D01*
X-837316Y673984D01*
X-843144Y679956D01*
X-848823Y686070D01*
X-854351Y692321D01*
X-859724Y698706D01*
X-864938Y705221D01*
X-869991Y711862D01*
X-874879Y718625D01*
X-879600Y725506D01*
X-884150Y732501D01*
X-888528Y739605D01*
X-892730Y746815D01*
X-896753Y754125D01*
X-900596Y761532D01*
X-904256Y769031D01*
X-907731Y776618D01*
X-911019Y784288D01*
X-914118Y792036D01*
X-917025Y799857D01*
X-919740Y807748D01*
X-922260Y815703D01*
X-924584Y823718D01*
X-926711Y831787D01*
X-928639Y839906D01*
X-930367Y848069D01*
X-931894Y856273D01*
X-933220Y864512D01*
X-934343Y872780D01*
X-935263Y881074D01*
X-935979Y889388D01*
X-936490Y897717D01*
X-936798Y906056D01*
X-936900Y914400D01*
D11*
X-256900Y910227D02*
X-256900Y918573D01*
X-257105Y926915D01*
X-257514Y935251D01*
X-258128Y943573D01*
X-258946Y951878D01*
X-259968Y960161D01*
X-261192Y968416D01*
X-262619Y976638D01*
X-264247Y984823D01*
X-266076Y992966D01*
X-268103Y1001061D01*
X-270329Y1009104D01*
X-272752Y1017090D01*
X-275369Y1025014D01*
X-278181Y1032871D01*
X-281184Y1040657D01*
X-284378Y1048367D01*
X-287760Y1055997D01*
X-291328Y1063541D01*
X-295080Y1070995D01*
X-299014Y1078355D01*
X-303127Y1085616D01*
X-307417Y1092774D01*
X-311882Y1099824D01*
X-316519Y1106763D01*
X-321324Y1113586D01*
X-326295Y1120289D01*
X-331429Y1126868D01*
X-336724Y1133319D01*
X-342174Y1139638D01*
X-347779Y1145822D01*
X-353533Y1151866D01*
X-359434Y1157767D01*
X-365478Y1163521D01*
X-371662Y1169126D01*
X-377981Y1174576D01*
X-384432Y1179871D01*
X-391011Y1185005D01*
X-397714Y1189976D01*
X-404537Y1194781D01*
X-411476Y1199418D01*
X-418526Y1203883D01*
X-425684Y1208173D01*
X-432945Y1212286D01*
X-440305Y1216220D01*
X-447759Y1219972D01*
X-455303Y1223540D01*
X-462933Y1226922D01*
X-470643Y1230116D01*
X-478429Y1233119D01*
X-486286Y1235931D01*
X-494210Y1238548D01*
X-502196Y1240971D01*
X-510239Y1243197D01*
X-518334Y1245225D01*
X-526477Y1247053D01*
X-534662Y1248681D01*
X-542884Y1250108D01*
X-551139Y1251332D01*
X-559422Y1252354D01*
X-567727Y1253172D01*
X-576049Y1253786D01*
X-584385Y1254195D01*
X-592727Y1254400D01*
X-601073Y1254400D01*
X-609415Y1254195D01*
X-617751Y1253786D01*
X-626073Y1253172D01*
X-634378Y1252354D01*
X-642661Y1251332D01*
X-650916Y1250108D01*
X-659138Y1248681D01*
X-667323Y1247053D01*
X-675466Y1245225D01*
X-683561Y1243197D01*
X-691604Y1240971D01*
X-699590Y1238548D01*
X-707514Y1235931D01*
X-715371Y1233119D01*
X-723157Y1230116D01*
X-730867Y1226922D01*
X-738497Y1223540D01*
X-746041Y1219972D01*
X-753495Y1216220D01*
X-760855Y1212286D01*
X-768116Y1208173D01*
X-775274Y1203883D01*
X-782324Y1199418D01*
X-789263Y1194781D01*
X-796086Y1189976D01*
X-802789Y1185005D01*
X-809368Y1179871D01*
X-815819Y1174576D01*
X-822138Y1169126D01*
X-828322Y1163521D01*
X-834366Y1157767D01*
X-840267Y1151866D01*
X-846021Y1145822D01*
X-851626Y1139638D01*
X-857076Y1133319D01*
X-862371Y1126868D01*
X-867505Y1120289D01*
X-872476Y1113586D01*
X-877281Y1106763D01*
X-881918Y1099824D01*
X-886383Y1092774D01*
X-890673Y1085616D01*
X-894786Y1078355D01*
X-898720Y1070995D01*
X-902472Y1063541D01*
X-906040Y1055997D01*
X-909422Y1048367D01*
X-912616Y1040657D01*
X-915619Y1032871D01*
X-918431Y1025014D01*
X-921048Y1017090D01*
X-923471Y1009104D01*
X-925697Y1001061D01*
X-927725Y992966D01*
X-929553Y984823D01*
X-931181Y976638D01*
X-932608Y968416D01*
X-933832Y960161D01*
X-934854Y951878D01*
X-935672Y943573D01*
X-936286Y935251D01*
X-936695Y926915D01*
X-936900Y918573D01*
X-936900Y910227D01*
X-936695Y901885D01*
X-936286Y893549D01*
X-935672Y885227D01*
X-934854Y876922D01*
X-933832Y868639D01*
X-932608Y860384D01*
X-931181Y852162D01*
X-929553Y843977D01*
X-927725Y835834D01*
X-925697Y827739D01*
X-923471Y819696D01*
X-921048Y811710D01*
X-918431Y803786D01*
X-915619Y795929D01*
X-912616Y788143D01*
X-909422Y780433D01*
X-906040Y772803D01*
X-902472Y765259D01*
X-898720Y757805D01*
X-894786Y750445D01*
X-890673Y743184D01*
X-886383Y736026D01*
X-881918Y728976D01*
X-877281Y722037D01*
X-872476Y715214D01*
X-867505Y708511D01*
X-862371Y701932D01*
X-857076Y695481D01*
X-851626Y689162D01*
X-846021Y682978D01*
X-840267Y676934D01*
X-834366Y671033D01*
X-828322Y665279D01*
X-822138Y659674D01*
X-815819Y654224D01*
X-809368Y648929D01*
X-802789Y643795D01*
X-796086Y638824D01*
X-789263Y634019D01*
X-782324Y629382D01*
X-775274Y624917D01*
X-768116Y620627D01*
X-760855Y616514D01*
X-753495Y612580D01*
X-746041Y608828D01*
X-738497Y605260D01*
X-730867Y601878D01*
X-723157Y598684D01*
X-715371Y595681D01*
X-707514Y592869D01*
X-699590Y590252D01*
X-691604Y587829D01*
X-683561Y585603D01*
X-675466Y583576D01*
X-667323Y581747D01*
X-659138Y580119D01*
X-650916Y578692D01*
X-642661Y577468D01*
X-634378Y576446D01*
X-626073Y575628D01*
X-617751Y575014D01*
X-609415Y574605D01*
X-601073Y574400D01*
X-592727Y574400D01*
X-584385Y574605D01*
X-576049Y575014D01*
X-567727Y575628D01*
X-559422Y576446D01*
X-551139Y577468D01*
X-542884Y578692D01*
X-534662Y580119D01*
X-526477Y581747D01*
X-518334Y583576D01*
X-510239Y585603D01*
X-502196Y587829D01*
X-494210Y590252D01*
X-486286Y592869D01*
X-478429Y595681D01*
X-470643Y598684D01*
X-462933Y601878D01*
X-455303Y605260D01*
X-447759Y608828D01*
X-440305Y612580D01*
X-432945Y616514D01*
X-425684Y620627D01*
X-418526Y624917D01*
X-411476Y629382D01*
X-404537Y634019D01*
X-397714Y638824D01*
X-391011Y643795D01*
X-384432Y648929D01*
X-377981Y654224D01*
X-371662Y659674D01*
X-365478Y665279D01*
X-359434Y671033D01*
X-353533Y676934D01*
X-347779Y682978D01*
X-342174Y689162D01*
X-336724Y695481D01*
X-331429Y701932D01*
X-326295Y708511D01*
X-321324Y715214D01*
X-316519Y722037D01*
X-311882Y728976D01*
X-307417Y736026D01*
X-303127Y743184D01*
X-299014Y750445D01*
X-295080Y757805D01*
X-291328Y765259D01*
X-287760Y772803D01*
X-284378Y780433D01*
X-281184Y788143D01*
X-278181Y795929D01*
X-275369Y803786D01*
X-272752Y811710D01*
X-270329Y819696D01*
X-268103Y827739D01*
X-266076Y835834D01*
X-264247Y843977D01*
X-262619Y852162D01*
X-261192Y860384D01*
X-259968Y868639D01*
X-258946Y876922D01*
X-258128Y885227D01*
X-257514Y893549D01*
X-257105Y901885D01*
X-256900Y910227D01*
M02*
