flake8==4.0.1
flake8-assertive==2.1.0
flake8-bandit==3.0.0
flake8-blind-except==0.2.1
flake8-broken-line==0.4.0
flake8-bugbear==22.6.22
flake8-builtins==1.5.3
flake8-commas==2.1.0
flake8-comprehensions==3.10.0
flake8-debugger==4.1.2
flake8-deprecated==1.3
flake8-docstrings==1.6.0
flake8-logging-format==0.6.0
flake8-quotes==3.3.1
flake8-rst-docstrings==0.2.6
flake8-string-format==0.3.0
flake8-tidy-imports==4.8.0
flake8-tuple==0.4.1
pep8-naming==0.12.1
pycodestyle==2.8.0
pylint==2.14.3
wemake-python-styleguide==0.16.1
isort==5.10.1
bandit==1.7.4
