// Copyright (C) 2012 - N. O. Strelkov, NRU MPEI
//
// comparison with tables from E. T. Kirkpatrick
// 'Tables of Values of the modified Mathieu Functions'.
// online at http://www.ams.org/journals/mcom/1960-14-070/S0025-5718-1960-0113288-4/S0025-5718-1960-0113288-4.pdf
// tolerance
tol = 1.e-4;
abstol = 5e-6;
// Ce0, table 1
Ce0_table  =[0.38010,0.36588,0.34209,0.30864,0.26555,0.21309,0.15200,0.083780,0.01098,-0.062420;0.19704,0.18047,0.15341,0.11679,0.072240,0.022230,-0.029620,-0.078360,-0.11775,-0.14075;0.10989,0.095050,0.071420,0.040760,0.0057700,-0.029840,-0.061290,-0.083090,-0.089810,-0.077540;0.065640,0.053290,0.034120,0.010340,-0.014920,-0.037650,-0.053330,-0.057670,-0.047930,-0.024650;0.041300,0.031270,0.016120,-0.0018000,-0.019330,-0.032750,-0.038430,-0.033830,-0.018870,0.0026700;0.027020,0.018950,0.0071000,-0.0062300,-0.018080,-0.025290,-0.025280,-0.017120,-0.0027100,0.012690;0.018220,0.011740,0.0025000,-0.0073400,-0.015160,-0.018410,-0.015510,-0.0067800,0.0047900,0.013790;0.012590,0.0073900,0.00018000,-0.0070600,-0.012060,-0.012900,-0.0088000,-0.00094000,0.0072800,0.011220;0.0088800,0.0046900,-0.00094000,-0.0062400,-0.0093200,-0.0087600,-0.0044400,0.0020000,0.0072300,0.0077400;0.0063700,0.0029800,-0.0014200,-0.0052900,-0.0070600,-0.0057700,-0.0017300,0.0031900,0.0060700,0.0045800;0.0034100,0.0011800,-0.0015300,-0.0035600,-0.0038800,-0.0021900,0.00074000,0.0031400,0.0031900,0.00055000;0.0019100,0.00042000,-0.0012700,-0.0022900,-0.0020400,-0.00056000,0.0012700,0.0021100,0.0011300,-0.00092000;0.0011000,0.00010000,-0.00096000,-0.0014400,-0.0010100,0.00011000,0.0011300,0.0011600,7.0000e-05,-0.0010600;0.00066000,-3.0000e-05,-0.00069000,-0.00089000,-0.00046000,0.00033000,0.00082000,0.00052000,-0.00033000,-0.00074;0.0004,-7.0000e-05,-0.00049000,-0.00055000,-0.00017000,0.00035000,0.00053000,0.00015,-0.00039000,-0.00038];
// Ce1, table 2
Ce1_table = [0.85597,0.85373,0.84884,0.83955,0.82334,0.79698,0.75653,0.69759,0.61571,0.50717;0.67800,0.66081,0.63071,0.58568,0.52324,0.44103,0.33754,0.21334,0.072680,-0.074680;0.50012,0.47318,0.42747,0.36216,0.27704,0.17349,0.055840,-0.067120,-0.18088,-0.26516;0.35310,0.32216,0.27089,0.20034,0.11324,0.015120,-0.084420,-0.17103,-0.22623,-0.23096;0.24613,0.21525,0.16523,0.098890,0.021440,-0.058580,-0.12880,-0.17366,-0.17746,-0.13069;0.17252,0.14384,0.098410,0.040400,-0.023330,-0.082770,-0.12515,-0.13706,-0.10918,-0.043510;0.12249,0.096860,0.057170,0.0084800,-0.041540,-0.082640,-0.10328,-0.093880,-0.052170,0.010540;0.088240,0.065820,0.031920,-0.0079600,-0.045940,-0.072380,-0.077850,-0.056960,-0.013490,0.035730;0.064460,0.045100,0.016530,-0.015620,-0.043700,-0.059140,-0.054940,-0.029540,0.0090000,0.041940;0.047690,0.031100,0.0072200,-0.018400,-0.038630,-0.046220,-0.036480,-0.010970,0.019750,0.037850;0.026980,0.014930,-0.0015200,-0.017390,-0.026970,-0.025640,-0.012540,0.0070500,0.021850,0.020250;0.015820,0.0071400,-0.0040900,-0.013660,-0.017320,-0.012650,-0.0011300,0.010890,0.014640,0.0057200;0.0095600,0.0032900,-0.0043400,-0.0099500,-0.010550,-0.0052700,0.0032600,0.0092300,0.0072800,-0.0017300;0.0059100,0.0013800,-0.0038000,-0.0069600,-0.0061300,-0.0014200,0.0042100,0.0062600,0.0023100,-0.0040200;0.0037300,0.00045000,-0.0030700,-0.0047500,-0.0033700,0.00038000,0.0037500,0.0036000,-0.00032000,-0.0036900];
// Ce2, table 3
Ce2_table = [1.09880,1.13730,1.20080,1.28830,1.39740,1.52430,1.66240,1.80110,1.92530,2.01340;1.05490,1.07240,1.09880,1.12970,1.15850,1.17530,1.16760,1.11970,1.01430,0.835940;0.963790,0.962990,0.957740,0.942050,0.907540,0.843790,0.739480,0.584910,0.376240,0.121810;0.850720,0.834060,0.802030,0.748580,0.666150,0.547180,0.386890,0.187490,-0.0362400,-0.251760;0.725810,0.696180,0.643010,0.561500,0.446940,0.297230,0.116780,-0.0787800,-0.258530,-0.376650;0.599250,0.560220,0.492570,0.393760,0.263160,0.105320,-0.0660200,-0.224360,-0.330440,-0.340560;0.481470,0.436890,0.361590,0.255820,0.123410,-0.0248100,-0.167740,-0.273100,-0.302680,-0.228070;0.379740,0.333040,0.255940,0.151460,0.0275300,-0.100130,-0.206210,-0.258180,-0.226490,-0.104650;0.296570,0.250320,0.175610,0.0779100,-0.0316600,-0.134270,-0.203580,-0.211190,-0.140390,-0.00653000;0.230860,0.186750,0.117000,0.0290300,-0.0638600,-0.141500,-0.179010,-0.154830,-0.0658900,0.0553100;0.140630,0.103140,0.0463700,-0.0199500,-0.0808700,-0.117440,-0.111980,-0.0585400,0.0244000,0.0898500;0.0871700,0.0568600,0.0129800,-0.0341200,-0.0702900,-0.0805700,-0.0559400,-0.00280000,0.0508600,0.0647900;0.0551100,0.0312400,-0.00175000,-0.0339400,-0.0532000,-0.0492200,-0.0202100,0.0204400,0.0452000,0.0299900;0.0355000,0.0169400,-0.00746000,-0.0288000,-0.0373600,-0.0270300,-0.000990000,0.0251100,0.0297300,0.00505000;0.0232400,0.00892000,-0.00894000,-0.0226800,-0.0249200,-0.0128400,0.00754000,0.0214800,0.0151200,-0.00746000];
// Ce3, table 4
Ce3_table = [1.10520,1.22130,1.42220,1.71890,2.12580,2.66020,3.33950,4.17750,5.17770,6.32330;1.15860,1.25040,1.40520,1.62500,1.90970,2.25480,2.64660,3.05690,3.43620,3.70800;1.18120,1.24860,1.35850,1.50610,1.68160,1.86710,2.03370,2.13830,2.12340,1.92380;1.16540,1.20970,1.27800,1.36090,1.44280,1.49980,1.49890,1.39990,1.16300,0.764450;1.11970,1.14280,1.17400,1.20100,1.20550,1.16290,1.04410,0.822480,0.486770,0.0608500;1.05380,1.05800,1.05630,1.03560,0.977500,0.860350,0.664440,0.382110,0.0329500,-0.320040;0.973930,0.961130,0.930840,0.870110,0.762710,0.593060,0.353970,0.0584400,-0.246800,-0.475380;0.884030,0.856350,0.801670,0.708520,0.564590,0.362490,0.108950,-0.163680,-0.389560,-0.477870;0.787630,0.747430,0.672970,0.555330,0.387480,0.171290,-0.0728200,-0.297110,-0.427220,-0.386340;0.688810,0.638760,0.549560,0.415620,0.235940,0.0218100,-0.194590,-0.355930,-0.390570,-0.250260;0.501470,0.440240,0.336780,0.193150,0.0203300,-0.154990,-0.287050,-0.318890,-0.210980,0.0105000;0.348990,0.286340,0.185030,0.0539300,-0.0871300,-0.203950,-0.251650,-0.193100,-0.0341700,0.142680;0.238160,0.180140,0.0901200,-0.0183100,-0.120980,-0.183680,-0.172060,-0.0750000,0.0659300,0.151840;0.162060,0.111310,0.0357800,-0.0484800,-0.116700,-0.139460,-0.0963600,0.00146000,0.0953400,0.102680;0.110840,0.0679300,0.00673000,-0.0560300,-0.0973900,-0.0948300,-0.0410900,0.0383500,0.0842900,0.0459800];
// Ce4, table 5
Ce4_table = [1.10860,1.33890,1.75690,2.41730,3.40360,4.83400,6.86830,9.71220,13.6152,18.8543;1.14020,1.34470,1.70940,2.27010,3.07670,4.19050,5.67630,7.58660,9.93210,12.6332;1.17500,1.35390,1.66680,2.13370,2.77770,3.61700,4.65100,5.83880,7.06880,8.12490;1.20900,1.36220,1.62460,2.00300,2.49950,3.10120,3.76600,4.40430,4.86170,4.91660;1.23570,1.36330,1.57640,1.87120,2.23410,2.63160,2.99890,3.23040,3.17990,2.68940;1.24850,1.35080,1.51610,1.73290,1.97640,2.20110,2.33460,2.27730,1.92150,1.19910;1.24360,1.32120,1.44150,1.58680,1.72570,1.80780,1.76360,1.51470,1.00450,0.254830;1.22090,1.27530,1.35390,1.43510,1.48430,1.45180,1.27880,0.915630,0.359430,-0.294410;1.18300,1.21590,1.25640,1.28120,1.25490,1.13300,0.872240,0.454900,-0.0730300,-0.566210;1.13300,1.14600,1.15230,1.12770,1.03910,0.849960,0.535530,0.109880,-0.341460,-0.648990;1.00560,0.984000,0.932530,0.829700,0.651840,0.384690,0.0432500,-0.304990,-0.532160,-0.492670;0.853440,0.804510,0.710060,0.555340,0.331200,0.0488900,-0.241850,-0.444080,-0.440160,-0.178270;0.691340,0.623460,0.502140,0.321930,0.0899400,-0.159730,-0.355760,-0.401450,-0.231440,0.0909700;0.536660,0.458850,0.326770,0.144850,-0.0652900,-0.254220,-0.345930,-0.269290,-0.0288700,0.225180;0.403540,0.323740,0.194070,0.0275300,-0.143990,-0.265110,-0.269800,-0.125430,0.102030,0.230610];
// Ce5, table 6
Ce5_table = [1.14120,1.52820,2.27100,3.53740,5.60770,8.92800,14.1878,22.4276,35.1766,54.6063;1.15620,1.51510,2.19350,3.32450,5.12020,7.89480,12.0901,18.2885,27.1920,39.5195;1.17310,1.50420,2.12020,3.12390,4.66830,6.96050,10.2507,14.7937,20.7544,28.0285;1.19210,1.49570,2.05160,2.93530,4.25040,6.11730,8.64260,11.8561,15.6014,19.3790;1.21320,1.48970,1.98730,2.75810,3.86410,5.35720,7.23980,9.39760,11.5090,12.9574;1.23590,1.48550,1.92670,2.59100,3.50620,4.67190,6.01810,7.34910,8.28730,8.26760;1.25900,1.48170,1.86800,2.43180,3.17310,4.05270,4.95510,5.64990,5.77660,4.91210;1.28020,1.47630,1.80910,2.27780,2.86090,3.49180,4.03110,4.24790,3.84460,2.57540;1.29700,1.46650,1.74720,2.12630,2.56590,2.98240,3.22930,3.09940,2.38200,1.00820;1.30640,1.44960,1.68000,1.97520,2.28560,2.51950,2.53610,2.16780,1.29890,0.0141700;1.29550,1.38840,1.52500,1.67100,1.76610,1.72150,1.43390,0.835230,-0.0164400,-0.840480;1.24360,1.29060,1.34550,1.36920,1.30350,1.08000,0.650070,0.0427900,-0.567690,-0.860180;1.15820,1.16500,1.15120,1.07880,0.900420,0.577670,0.118710,-0.371970,-0.674360,-0.547400;1.04800,1.02050,0.950630,0.806290,0.556750,0.197270,-0.213830,-0.527960,-0.544120,-0.172040;0.920290,0.864720,0.751640,0.558420,0.274270,-0.0727600,-0.387500,-0.511690,-0.313710,0.127660];
// orders
rs = 0:5;
// comparison
for ri=1:length(rs)
    r = rs(ri);
    table_ = evstr(sprintf('Ce%1d%s', r, '_table'));
    calc_ = zeros(size(table_));
        i = 1;
        for z=0.1:0.1:1.0
            j = 1;
            for q=1:20
                if (q <= 10) | ((q > 10) & (modulo(q, 2) == 0)) then                            
                   calc_(j, i) = mathieu_rad_ce( r, q, z, 1 );
                   j = j + 1;
                end
            end
            i = i + 1;
        end
        
        assert_checkalmostequal(table_, calc_, tol, abstol);
end
// Example: Ce0 and Ce1 (for comparison with Fig. 4a, p. 236 of the article J. C. Gutiérrez-Vega, et al. Mathieu functions, a visual approach [4]) with first derivative
    f=scf(); mrgn = 50; font_sz = 4;
    sz = get(0, 'screensize_px') + [-1 mrgn-1 0 -2*mrgn ] ;
    f.figure_name = 'Ce0 and Ce1 (for comparison with Fig. 4a, p. 236 of the article J. C. Gutiérrez-Vega, et al. Mathieu functions, a visual approach) with first derivative';
    z = linspace(0, 2, 100);
    fun = 1; der = 0;
    m = 0;
    subplot(2,2,1)
        plot(z, mathieu_rad_ce(m, 1, z, fun), 'r', z, mathieu_rad_ce(m, 2, z, fun), 'b', z, mathieu_rad_ce(m, 3, z, fun), 'g')
        xgrid
        ty1 = '$Ce_0(z,q)$'; xlabel('$z$'); ylabel(ty1);
        legend('$q = 1$', '$q = 2$', '$q = 3$');
        h = gca(); h.margins=[0.15 0.05 0.05 0.2]; h.font_size = font_sz - 1;
        h.x_label.font_size=font_sz; h.y_label.font_size=font_sz;
        h.children(1).font_size = font_sz;
    subplot(2,2,3)
        plot(z, mathieu_rad_ce(m, 1, z, der), 'r-.', z, mathieu_rad_ce(m, 2, z, der), 'b-.', z, mathieu_rad_ce(m, 3, z, der), 'g-.')
        xgrid
        ty2 = '$Ce^{\ \prime}_0(z,q)$'; xlabel('$z$'); ylabel(ty2);
        legend('$q = 1$', '$q = 2$', '$q = 3$',pos=2);
        h = gca(); h.margins=[0.15 0.05 0.05 0.2]; h.font_size = font_sz - 1;
        h.x_label.font_size=font_sz; h.y_label.font_size=font_sz;
        h.children(1).font_size = font_sz;
    m = 1;
    subplot(2,2,2)
        plot(z, mathieu_rad_ce(m, 1, z, fun), 'r', z, mathieu_rad_ce(m, 2, z, fun), 'b', z, mathieu_rad_ce(m, 3, z, fun), 'g')
        xgrid
        ty1 = '$Ce_1(z,q)$'; xlabel('$z$'); ylabel(ty1);
        legend('$q = 1$', '$q = 2$', '$q = 3$');
        h = gca(); h.margins=[0.15 0.05 0.05 0.2]; h.font_size = font_sz - 1;
        h.x_label.font_size=font_sz; h.y_label.font_size=font_sz;
        h.children(1).font_size = font_sz;
    subplot(2,2,4)
        plot(z, mathieu_rad_ce(m, 1, z, der), 'r-.', z, mathieu_rad_ce(m, 2, z, der), 'b-.', z, mathieu_rad_ce(m, 3, z, der), 'g-.')
        xgrid
        ty2 = '$Ce^{\ \prime}_1(z,q)$'; xlabel('$z$'); ylabel(ty2);
        legend('$q = 1$', '$q = 2$', '$q = 3$',pos=2);
        h = gca(); h.margins=[0.15 0.05 0.05 0.2]; h.font_size = font_sz - 1;
        h.x_label.font_size=font_sz; h.y_label.font_size=font_sz;
        h.children(1).font_size = font_sz;
    f.figure_position=[sz(1) sz(2)]; f.figure_size=[sz(3) sz(4)];
