{
    "pose_backends": [
        {
            "name": "posenet",
            "params": {
                "device_id": 0,
                "draw_skeleton_edges": true,
                "input_resolution": [
                    257,
                    257
                ],
                "multi_pose_detection": true
            }
        }
    ],
    "cameras": {
        "input_paths": [
            "/dev/video0"
        ],
        "params": {
            "/dev/video0": {
                "resolution": [
                    640,
                    480
                ],
                "framerate": 30
            }
        },
        "intrinsics": {}
    },
    "filters": {
        "hubs": {}
    },
    "outputs": {
        "websocket": {
            "host": "localhost",
            "port": 8765
        }
    }
}
