<svg
  width="22"
  height="22"
  viewBox="0 0 22 22"
  fill="none"
  xmlns="http://www.w3.org/2000/svg"
>
  <path
    fill-rule="evenodd"
    clip-rule="evenodd"
    d="M20.8875 3.29027C21.375 3.77772 21.375 4.56513 20.8875 5.05258L18.4375 7.50233L13.75 2.81532L16.2 0.365569C16.4335 0.131528 16.7506 0 17.0812 0C17.4119 0 17.7289 0.131528 17.9625 0.365569L20.8875 3.29027ZM12.5 4.06518L17.1875 8.7522L4.8625 21.0634C4.75 21.1884 4.5875 21.2509 4.425 21.2509H0.625C0.275 21.2509 0 20.9759 0 20.626V16.8264C0 16.6514 0.0625 16.5014 0.1875 16.3764L12.5 4.06518Z"
    fill="#C4C4C4"
  />
</svg>
