module pg-vector-example

go 1.22.3

require (
	github.com/AssemblyAI/assemblyai-go-sdk v1.3.0 // indirect
	github.com/Masterminds/goutils v1.1.1 // indirect
	github.com/Masterminds/semver/v3 v3.2.0 // indirect
	github.com/Masterminds/sprig/v3 v3.2.3 // indirect
	github.com/PuerkitoBio/goquery v1.8.1 // indirect
	github.com/andybalholm/cascadia v1.3.2 // indirect
	github.com/aymerick/douceur v0.2.0 // indirect
	github.com/cenkalti/backoff v2.2.1+incompatible // indirect
	github.com/dlclark/regexp2 v1.10.0 // indirect
	github.com/dustin/go-humanize v1.0.1 // indirect
	github.com/google/go-querystring v1.1.0 // indirect
	github.com/google/uuid v1.6.0 // indirect
	github.com/goph/emperror v0.17.2 // indirect
	github.com/gorilla/css v1.0.0 // indirect
	github.com/huandu/xstrings v1.3.3 // indirect
	github.com/imdario/mergo v0.3.13 // indirect
	github.com/jackc/pgpassfile v1.0.0 // indirect
	github.com/jackc/pgservicefile v0.0.0-20221227161230-091c0ba34f0a // indirect
	github.com/jackc/pgx/v5 v5.5.5 // indirect
	github.com/json-iterator/go v1.1.12 // indirect
	github.com/klauspost/compress v1.17.6 // indirect
	github.com/ledongthuc/pdf v0.0.0-20220302134840-0c2507a12d80 // indirect
	github.com/microcosm-cc/bluemonday v1.0.26 // indirect
	github.com/mitchellh/copystructure v1.0.0 // indirect
	github.com/mitchellh/reflectwalk v1.0.0 // indirect
	github.com/modern-go/concurrent v0.0.0-20180306012644-bacd9c7ef1dd // indirect
	github.com/modern-go/reflect2 v1.0.2 // indirect
	github.com/nikolalohinski/gonja v1.5.3 // indirect
	github.com/pelletier/go-toml/v2 v2.0.9 // indirect
	github.com/pgvector/pgvector-go v0.1.1 // indirect
	github.com/pkg/errors v0.9.1 // indirect
	github.com/pkoukk/tiktoken-go v0.1.6 // indirect
	github.com/shopspring/decimal v1.2.0 // indirect
	github.com/sirupsen/logrus v1.9.3 // indirect
	github.com/spf13/cast v1.3.1 // indirect
	github.com/tmc/langchaingo v0.1.12 // indirect
	github.com/yargevad/filepathx v1.0.0 // indirect
	gitlab.com/golang-commonmark/html v0.0.0-20191124015941-a22733972181 // indirect
	gitlab.com/golang-commonmark/linkify v0.0.0-20191026162114-a0c2df6c8f82 // indirect
	gitlab.com/golang-commonmark/markdown v0.0.0-20211110145824-bf3e522c626a // indirect
	gitlab.com/golang-commonmark/mdurl v0.0.0-20191124015652-932350d1cb84 // indirect
	gitlab.com/golang-commonmark/puny v0.0.0-20191124015043-9f83538fa04f // indirect
	go.starlark.net v0.0.0-20230302034142-4b1e35fe2254 // indirect
	golang.org/x/crypto v0.23.0 // indirect
	golang.org/x/exp v0.0.0-20230713183714-613f0c0eb8a1 // indirect
	golang.org/x/net v0.25.0 // indirect
	golang.org/x/sys v0.20.0 // indirect
	golang.org/x/text v0.15.0 // indirect
	gopkg.in/yaml.v3 v3.0.1 // indirect
	nhooyr.io/websocket v1.8.7 // indirect
)
