#acc	name_of_level1	name_of_level2	name_of_level3
KZK33282.1	Bacteria	Firmicutes	Bacilli
NP_268346.1	Bacteria	Firmicutes	Bacilli
WP_003131952.1	Bacteria	Firmicutes	Bacilli
PKC80086.1	Bacteria	Actinobacteria	Bifidobacteriales
XP_963622.1	Eukaryota	Ascomycota	Sordariomycetes
WP_000665196.1	Bacteria	Proteobacteria	Gammaproteobacteria
WP_000665196.1	Bacteria	Proteobacteria	Gammaproteobacteria group
