{
  "builders": [
		{
      "headless": "{{ user `headless` }}",
      "boot_command": "",
      "boot_wait": "60s",
      "vm_name": "{{ user `vm_name` }}",
      "type": "virtualbox-ovf",
      "guest_additions_mode": "disable",
      "source_path": "{{user `iso_url`}}",
      "communicator": "ssh",
      "ssh_port": 22,
      "ssh_username": "{{ user `username` }}",
      "ssh_password": "{{ user `username` }}",
      "ssh_wait_timeout": "10000s",
      "vboxmanage": [
        ["modifyvm", "{{.Name}}", "--ostype","MacOS_64" ],
        ["modifyvm", "{{.Name}}", "--cpus","2" ],
        ["modifyvm", "{{.Name}}", "--vram","128" ],
        ["modifyvm", "{{.Name}}", "--graphicscontroller","vboxvga" ],
        ["modifyvm", "{{.Name}}", "--accelerate3d","off" ],
        ["modifyvm", "{{.Name}}", "--apic","on" ],
        ["modifyvm", "{{.Name}}", "--pae","on" ],
        ["modifyvm", "{{.Name}}", "--audiocontroller", "hda"],
        ["modifyvm", "{{.Name}}", "--chipset", "ICH9"],
        ["modifyvm", "{{.Name}}", "--firmware", "EFI"],
        ["modifyvm", "{{.Name}}", "--hpet", "on"],
        ["modifyvm", "{{.Name}}", "--usbxhci", "on"],
        ["modifyvm", "{{.Name}}", "--keyboard", "usb"],
        ["modifyvm", "{{.Name}}", "--mouse", "usbtablet"]
      ],
      "shutdown_command": "echo {{ user `username` }} | sudo -S shutdown -h now"
    }
  ],
	"variables": {
    "_comment": "This variables have to be set",
    "iso_url": "",
    "input_dir": ".",
    "vagrantcloud_token": "",
    "headless": "true",
    "version": "1.0.{{timestamp}}",
    "username": "vagrant",
    "vm_name": "MacOS_Catalina-R",
    "boxtag": "",
    "version_description": "MacOs + R"
  },
  "post-processors": [
    [
      { 
        "type": "vagrant",
	"compression_level": 9,
	"output": "{{.Provider}}_{{user `vm_name`}}.box",
        "keep_input_artifact": true
      }
    ]
  ],
	"provisioners": [
		{
			"type": "file",
			"source": "{{user `input_dir`}}/Command_Line_Tools_for_Xcode_12.dmg",
			"destination": "~/Command_Line_Tools_for_Xcode.dmg"
		},
		{
			"type": "file",
			"source": "{{user `input_dir`}}/Xcode_12.4.xip",
			"destination": "~/Xcode.xip"
		},
		{
			"type": "shell",
			"script": "./scripts/add-sudouser.sh",
      "execute_command": "echo {{ user `username` }} | sudo -S sh -c '{{ .Vars }} {{ .Path }}'"
		},
		{
			"type": "shell",
			"script": "./scripts/install-xcode.sh",
      "execute_command": "echo {{ user `username` }} | sudo -S sh -c '{{ .Vars }} {{ .Path }}'"
		},
		{
			"type": "shell",
			"script": "./scripts/install-homebrew.sh"
		},
    		{
			"type": "shell",
			"script": "./scripts/conf-ssh-vagrant.sh"
		},
		{
			"type": "ansible",
			"playbook_file": "playbook.yml",
			"user": "vagrant",
			"extra_arguments": [
				"-vvv"
			]
		},
		{
			"type": "shell",
			"script": "./scripts/clean-space.sh"
		}
	]
}
