{
  "data": [
    {
      "id": 3784500,
      "gameId": 432,
      "modId": 74924,
      "isAvailable": true,
      "displayName": "Mantle 1.9.20 for 1.18.2",
      "fileName": "Mantle-1.18.2-1.9.20.jar",
      "releaseType": 3,
      "fileStatus": 4,
      "hashes": [
        {
          "value": "669698109b979cf01a26b88fbf3fab85710a8b82",
          "algo": 1
        },
        {
          "value": "9a98f8737c9d2c3f067cb85f1d169719",
          "algo": 2
        }
      ],
      "fileDate": "2022-05-08T21:12:35.427Z",
      "fileLength": 855271,
      "downloadCount": 14,
      "downloadUrl": "https://edge.forgecdn.net/files/3784/500/Mantle-1.18.2-1.9.20.jar",
      "gameVersions": [
        "1.18.2",
        "Forge"
      ],
      "sortableGameVersions": [
        {
          "gameVersionName": "1.18.2",
          "gameVersionPadded": "0000000001.0000000018.0000000002",
          "gameVersion": "1.18.2",
          "gameVersionReleaseDate": "2022-02-28T14:23:37.723Z",
          "gameVersionTypeId": 73250
        },
        {
          "gameVersionName": "Forge",
          "gameVersionPadded": "0",
          "gameVersion": "",
          "gameVersionReleaseDate": "2019-08-01T00:00:00Z",
          "gameVersionTypeId": 68441
        }
      ],
      "dependencies": [],
      "alternateFileId": 0,
      "isServerPack": false,
      "fileFingerprint": 347134356,
      "modules": [
        {
          "name": "META-INF",
          "fingerprint": 2208166108
        },
        {
          "name": "slimeknights",
          "fingerprint": 1938396921
        },
        {
          "name": "pack.mcmeta",
          "fingerprint": 3720854501
        },
        {
          "name": "Mantle.png",
          "fingerprint": 3296224890
        },
        {
          "name": "assets",
          "fingerprint": 2362304992
        }
      ]
    },
    {
      "id": 3693897,
      "gameId": 432,
      "modId": 74924,
      "isAvailable": true,
      "displayName": "Mantle 1.8.37 for 1.18.1",
      "fileName": "Mantle-1.18.1-1.8.37.jar",
      "releaseType": 2,
      "fileStatus": 4,
      "hashes": [
        {
          "value": "72f851cf2ca35b5dff82d6e91566012a90e624b4",
          "algo": 1
        },
        {
          "value": "4fb44e2d9bffbf70969315781a4d6526",
          "algo": 2
        }
      ],
      "fileDate": "2022-03-15T01:38:18.61Z",
      "fileLength": 861969,
      "downloadCount": 127,
      "downloadUrl": "https://edge.forgecdn.net/files/3693/897/Mantle-1.18.1-1.8.37.jar",
      "gameVersions": [
        "1.18.1",
        "Forge"
      ],
      "sortableGameVersions": [
        {
          "gameVersionName": "1.18.1",
          "gameVersionPadded": "0000000001.0000000018.0000000001",
          "gameVersion": "1.18.1",
          "gameVersionReleaseDate": "2021-12-10T10:37:38.06Z",
          "gameVersionTypeId": 73250
        },
        {
          "gameVersionName": "Forge",
          "gameVersionPadded": "0",
          "gameVersion": "",
          "gameVersionReleaseDate": "2019-08-01T00:00:00Z",
          "gameVersionTypeId": 68441
        }
      ],
      "dependencies": [],
      "alternateFileId": 0,
      "isServerPack": false,
      "fileFingerprint": 2407223882,
      "modules": [
        {
          "name": "META-INF",
          "fingerprint": 1696169712
        },
        {
          "name": "slimeknights",
          "fingerprint": 3526254717
        },
        {
          "name": "pack.mcmeta",
          "fingerprint": 3720854501
        },
        {
          "name": "Mantle.png",
          "fingerprint": 3296224890
        },
        {
          "name": "assets",
          "fingerprint": 2537747934
        }
      ]
    },
    {
      "id": 3634761,
      "gameId": 432,
      "modId": 74924,
      "isAvailable": true,
      "displayName": "Mantle 1.8.31 for 1.18.1",
      "fileName": "Mantle-1.18.1-1.8.31.jar",
      "releaseType": 3,
      "fileStatus": 4,
      "hashes": [
        {
          "value": "718ac166a5031c1bdacedf1127170fc80877af6c",
          "algo": 1
        },
        {
          "value": "a5c07c05241f9f48d03e97f084d7c34e",
          "algo": 2
        }
      ],
      "fileDate": "2022-02-03T03:08:56.05Z",
      "fileLength": 856634,
      "downloadCount": 12,
      "downloadUrl": "https://edge.forgecdn.net/files/3634/761/Mantle-1.18.1-1.8.31.jar",
      "gameVersions": [
        "1.18.1",
        "Forge"
      ],
      "sortableGameVersions": [
        {
          "gameVersionName": "1.18.1",
          "gameVersionPadded": "0000000001.0000000018.0000000001",
          "gameVersion": "1.18.1",
          "gameVersionReleaseDate": "2021-12-10T10:37:38.06Z",
          "gameVersionTypeId": 73250
        },
        {
          "gameVersionName": "Forge",
          "gameVersionPadded": "0",
          "gameVersion": "",
          "gameVersionReleaseDate": "2019-08-01T00:00:00Z",
          "gameVersionTypeId": 68441
        }
      ],
      "dependencies": [],
      "alternateFileId": 0,
      "isServerPack": false,
      "fileFingerprint": 2291529354,
      "modules": [
        {
          "name": "META-INF",
          "fingerprint": 1080092146
        },
        {
          "name": "slimeknights",
          "fingerprint": 3397950726
        },
        {
          "name": "pack.mcmeta",
          "fingerprint": 3720854501
        },
        {
          "name": "Mantle.png",
          "fingerprint": 3296224890
        },
        {
          "name": "assets",
          "fingerprint": 2639019779
        }
      ]
    },
    {
      "id": 3631982,
      "gameId": 432,
      "modId": 74924,
      "isAvailable": true,
      "displayName": "Mantle 1.6.157 for 1.16.5",
      "fileName": "Mantle-1.16.5-1.6.157.jar",
      "releaseType": 2,
      "fileStatus": 4,
      "hashes": [
        {
          "value": "61cd1d256a29445d153bd076e090f6172eff2aff",
          "algo": 1
        },
        {
          "value": "e5ee7cb043a90615d0fdacffbc1f6790",
          "algo": 2
        }
      ],
      "fileDate": "2022-01-31T18:33:36Z",
      "fileLength": 806737,
      "downloadCount": 11680,
      "downloadUrl": "https://edge.forgecdn.net/files/3631/982/Mantle-1.16.5-1.6.157.jar",
      "gameVersions": [
        "1.16.5",
        "Forge"
      ],
      "sortableGameVersions": [
        {
          "gameVersionName": "1.16.5",
          "gameVersionPadded": "0000000001.0000000016.0000000005",
          "gameVersion": "1.16.5",
          "gameVersionReleaseDate": "2021-01-15T14:14:48.91Z",
          "gameVersionTypeId": 70886
        },
        {
          "gameVersionName": "Forge",
          "gameVersionPadded": "0",
          "gameVersion": "",
          "gameVersionReleaseDate": "2019-08-01T00:00:00Z",
          "gameVersionTypeId": 68441
        }
      ],
      "dependencies": [],
      "alternateFileId": 0,
      "isServerPack": false,
      "fileFingerprint": 2834403402,
      "modules": [
        {
          "name": "META-INF",
          "fingerprint": 430918040
        },
        {
          "name": "slimeknights",
          "fingerprint": 3194845915
        },
        {
          "name": "data",
          "fingerprint": 1510015062
        },
        {
          "name": "pack.mcmeta",
          "fingerprint": 3720854501
        },
        {
          "name": "Mantle.png",
          "fingerprint": 3296224890
        },
        {
          "name": "assets",
          "fingerprint": 4004036128
        }
      ]
    },
    {
      "id": 3576386,
      "gameId": 432,
      "modId": 74924,
      "isAvailable": true,
      "displayName": "Mantle 1.6.152 for 1.16.5",
      "fileName": "Mantle-1.16.5-1.6.152.jar",
      "releaseType": 2,
      "fileStatus": 4,
      "hashes": [
        {
          "value": "d677d9cdf1f87574764816b9f3ece7e58c3cd001",
          "algo": 1
        },
        {
          "value": "127852bd3ee3ef698b9dd0f7283475c9",
          "algo": 2
        }
      ],
      "fileDate": "2021-12-22T07:04:51.17Z",
      "fileLength": 805040,
      "downloadCount": 602509,
      "downloadUrl": "https://edge.forgecdn.net/files/3576/386/Mantle-1.16.5-1.6.152.jar",
      "gameVersions": [
        "1.16.5",
        "Forge"
      ],
      "sortableGameVersions": [
        {
          "gameVersionName": "1.16.5",
          "gameVersionPadded": "0000000001.0000000016.0000000005",
          "gameVersion": "1.16.5",
          "gameVersionReleaseDate": "2021-01-15T14:14:48.91Z",
          "gameVersionTypeId": 70886
        },
        {
          "gameVersionName": "Forge",
          "gameVersionPadded": "0",
          "gameVersion": "",
          "gameVersionReleaseDate": "2019-08-01T00:00:00Z",
          "gameVersionTypeId": 68441
        }
      ],
      "dependencies": [],
      "alternateFileId": 0,
      "isServerPack": false,
      "fileFingerprint": 2420192492,
      "modules": [
        {
          "name": "META-INF",
          "fingerprint": 2169481113
        },
        {
          "name": "slimeknights",
          "fingerprint": 2125697025
        },
        {
          "name": "data",
          "fingerprint": 1510015062
        },
        {
          "name": "pack.mcmeta",
          "fingerprint": 3720854501
        },
        {
          "name": "Mantle.png",
          "fingerprint": 3296224890
        },
        {
          "name": "assets",
          "fingerprint": 1734166776
        }
      ]
    },
    {
      "id": 3551291,
      "gameId": 432,
      "modId": 74924,
      "isAvailable": true,
      "displayName": "Mantle 1.6.147 for 1.16.5",
      "fileName": "Mantle-1.16.5-1.6.147.jar",
      "releaseType": 2,
      "fileStatus": 4,
      "hashes": [
        {
          "value": "54722fb8be9d7e57929dd3ae61f28a0efe9f2a0d",
          "algo": 1
        },
        {
          "value": "972d78b9510b9ee77d86811e4b4af876",
          "algo": 2
        }
      ],
      "fileDate": "2021-12-06T06:26:34.707Z",
      "fileLength": 777742,
      "downloadCount": 525256,
      "downloadUrl": "https://edge.forgecdn.net/files/3551/291/Mantle-1.16.5-1.6.147.jar",
      "gameVersions": [
        "1.16.5",
        "Forge"
      ],
      "sortableGameVersions": [
        {
          "gameVersionName": "1.16.5",
          "gameVersionPadded": "0000000001.0000000016.0000000005",
          "gameVersion": "1.16.5",
          "gameVersionReleaseDate": "2021-01-15T14:14:48.91Z",
          "gameVersionTypeId": 70886
        },
        {
          "gameVersionName": "Forge",
          "gameVersionPadded": "0",
          "gameVersion": "",
          "gameVersionReleaseDate": "2019-08-01T00:00:00Z",
          "gameVersionTypeId": 68441
        }
      ],
      "dependencies": [],
      "alternateFileId": 0,
      "isServerPack": false,
      "fileFingerprint": 3063873925,
      "modules": [
        {
          "name": "META-INF",
          "fingerprint": 3489830334
        },
        {
          "name": "slimeknights",
          "fingerprint": 881321578
        },
        {
          "name": "data",
          "fingerprint": 1510015062
        },
        {
          "name": "pack.mcmeta",
          "fingerprint": 3720854501
        },
        {
          "name": "Mantle.png",
          "fingerprint": 3296224890
        },
        {
          "name": "assets",
          "fingerprint": 1734166776
        }
      ]
    },
    {
      "id": 3482897,
      "gameId": 432,
      "modId": 74924,
      "isAvailable": true,
      "displayName": "Mantle 1.6.127 for 1.16.5",
      "fileName": "Mantle-1.16.5-1.6.127.jar",
      "releaseType": 2,
      "fileStatus": 4,
      "hashes": [
        {
          "value": "56f604da6c23e7a7f084689d209e38344850d6dd",
          "algo": 1
        },
        {
          "value": "b28587558efe5485acce4ab6c8d7c981",
          "algo": 2
        }
      ],
      "fileDate": "2021-10-06T04:47:58.91Z",
      "fileLength": 746595,
      "downloadCount": 2162041,
      "downloadUrl": "https://edge.forgecdn.net/files/3482/897/Mantle-1.16.5-1.6.127.jar",
      "gameVersions": [
        "1.16.5",
        "Forge"
      ],
      "sortableGameVersions": [
        {
          "gameVersionName": "1.16.5",
          "gameVersionPadded": "0000000001.0000000016.0000000005",
          "gameVersion": "1.16.5",
          "gameVersionReleaseDate": "2021-01-15T14:14:48.91Z",
          "gameVersionTypeId": 70886
        },
        {
          "gameVersionName": "Forge",
          "gameVersionPadded": "0",
          "gameVersion": "",
          "gameVersionReleaseDate": "2019-08-01T00:00:00Z",
          "gameVersionTypeId": 68441
        }
      ],
      "dependencies": [],
      "alternateFileId": 0,
      "isServerPack": false,
      "fileFingerprint": 1074832223,
      "modules": [
        {
          "name": "META-INF",
          "fingerprint": 2008750178
        },
        {
          "name": "slimeknights",
          "fingerprint": 3230285198
        },
        {
          "name": "data",
          "fingerprint": 1510015062
        },
        {
          "name": "pack.mcmeta",
          "fingerprint": 3720854501
        },
        {
          "name": "Mantle.png",
          "fingerprint": 3296224890
        },
        {
          "name": "assets",
          "fingerprint": 1734166776
        }
      ]
    },
    {
      "id": 3439180,
      "gameId": 432,
      "modId": 74924,
      "isAvailable": true,
      "displayName": "Mantle 1.6.123 for 1.16.5",
      "fileName": "Mantle-1.16.5-1.6.123.jar",
      "releaseType": 2,
      "fileStatus": 4,
      "hashes": [
        {
          "value": "8542cb23d3fb7c1acb1a7b7f37cfd6187217a49c",
          "algo": 1
        },
        {
          "value": "b9decb75bdca3fa22831480a1a936791",
          "algo": 2
        }
      ],
      "fileDate": "2021-08-25T22:02:55.607Z",
      "fileLength": 742903,
      "downloadCount": 1073676,
      "downloadUrl": "https://edge.forgecdn.net/files/3439/180/Mantle-1.16.5-1.6.123.jar",
      "gameVersions": [
        "1.16.5",
        "Forge"
      ],
      "sortableGameVersions": [
        {
          "gameVersionName": "1.16.5",
          "gameVersionPadded": "0000000001.0000000016.0000000005",
          "gameVersion": "1.16.5",
          "gameVersionReleaseDate": "2021-01-15T14:14:48.91Z",
          "gameVersionTypeId": 70886
        },
        {
          "gameVersionName": "Forge",
          "gameVersionPadded": "0",
          "gameVersion": "",
          "gameVersionReleaseDate": "2019-08-01T00:00:00Z",
          "gameVersionTypeId": 68441
        }
      ],
      "dependencies": [],
      "alternateFileId": 0,
      "isServerPack": false,
      "fileFingerprint": 1203431666,
      "modules": [
        {
          "name": "META-INF",
          "fingerprint": 1004667897
        },
        {
          "name": "slimeknights",
          "fingerprint": 4098133632
        },
        {
          "name": "data",
          "fingerprint": 1510015062
        },
        {
          "name": "pack.mcmeta",
          "fingerprint": 3720854501
        },
        {
          "name": "Mantle.png",
          "fingerprint": 3296224890
        },
        {
          "name": "assets",
          "fingerprint": 1734166776
        }
      ]
    },
    {
      "id": 3389377,
      "gameId": 432,
      "modId": 74924,
      "isAvailable": true,
      "displayName": "Mantle 1.6.115 for 1.16.5",
      "fileName": "Mantle-1.16.5-1.6.115.jar",
      "releaseType": 2,
      "fileStatus": 4,
      "hashes": [
        {
          "value": "0041ea7154f62c889b06a24e1974752ea8294d35",
          "algo": 1
        },
        {
          "value": "8096b511fa399b8db92745347932be6b",
          "algo": 2
        }
      ],
      "fileDate": "2021-07-15T05:15:42.127Z",
      "fileLength": 714054,
      "downloadCount": 1292219,
      "downloadUrl": "https://edge.forgecdn.net/files/3389/377/Mantle-1.16.5-1.6.115.jar",
      "gameVersions": [
        "1.16.5",
        "Forge"
      ],
      "sortableGameVersions": [
        {
          "gameVersionName": "1.16.5",
          "gameVersionPadded": "0000000001.0000000016.0000000005",
          "gameVersion": "1.16.5",
          "gameVersionReleaseDate": "2021-01-15T14:14:48.91Z",
          "gameVersionTypeId": 70886
        },
        {
          "gameVersionName": "Forge",
          "gameVersionPadded": "0",
          "gameVersion": "",
          "gameVersionReleaseDate": "2019-08-01T00:00:00Z",
          "gameVersionTypeId": 68441
        }
      ],
      "dependencies": [],
      "alternateFileId": 0,
      "isServerPack": false,
      "fileFingerprint": 885138105,
      "modules": [
        {
          "name": "META-INF",
          "fingerprint": 367076561
        },
        {
          "name": "slimeknights",
          "fingerprint": 1077992428
        },
        {
          "name": "data",
          "fingerprint": 1510015062
        },
        {
          "name": "pack.mcmeta",
          "fingerprint": 3720854501
        },
        {
          "name": "Mantle.png",
          "fingerprint": 3296224890
        },
        {
          "name": "assets",
          "fingerprint": 1734166776
        }
      ]
    },
    {
      "id": 3352484,
      "gameId": 432,
      "modId": 74924,
      "isAvailable": true,
      "displayName": "Mantle 1.6.109 for 1.16.5",
      "fileName": "Mantle-1.16.5-1.6.109.jar",
      "releaseType": 2,
      "fileStatus": 4,
      "hashes": [
        {
          "value": "02ea8688c9dc4c2896ea36d8b07c7d9e34765fa7",
          "algo": 1
        },
        {
          "value": "55c5ec9d8753293975a2dadbe556b36c",
          "algo": 2
        }
      ],
      "fileDate": "2021-06-15T02:47:21.47Z",
      "fileLength": 670970,
      "downloadCount": 623850,
      "downloadUrl": "https://edge.forgecdn.net/files/3352/484/Mantle-1.16.5-1.6.109.jar",
      "gameVersions": [
        "1.16.3",
        "1.16.5",
        "Forge",
        "1.16.4"
      ],
      "sortableGameVersions": [
        {
          "gameVersionName": "1.16.3",
          "gameVersionPadded": "0000000001.0000000016.0000000003",
          "gameVersion": "1.16.3",
          "gameVersionReleaseDate": "2020-09-10T14:44:20.443Z",
          "gameVersionTypeId": 70886
        },
        {
          "gameVersionName": "1.16.5",
          "gameVersionPadded": "0000000001.0000000016.0000000005",
          "gameVersion": "1.16.5",
          "gameVersionReleaseDate": "2021-01-15T14:14:48.91Z",
          "gameVersionTypeId": 70886
        },
        {
          "gameVersionName": "Forge",
          "gameVersionPadded": "0",
          "gameVersion": "",
          "gameVersionReleaseDate": "2019-08-01T00:00:00Z",
          "gameVersionTypeId": 68441
        },
        {
          "gameVersionName": "1.16.4",
          "gameVersionPadded": "0000000001.0000000016.0000000004",
          "gameVersion": "1.16.4",
          "gameVersionReleaseDate": "2020-11-02T18:40:51.49Z",
          "gameVersionTypeId": 70886
        }
      ],
      "dependencies": [],
      "alternateFileId": 0,
      "isServerPack": false,
      "fileFingerprint": 3728795951,
      "modules": [
        {
          "name": "META-INF",
          "fingerprint": 4205989050
        },
        {
          "name": "slimeknights",
          "fingerprint": 2653176593
        },
        {
          "name": "pack.mcmeta",
          "fingerprint": 3720854501
        },
        {
          "name": "Mantle.png",
          "fingerprint": 3296224890
        },
        {
          "name": "assets",
          "fingerprint": 1734166776
        }
      ]
    },
    {
      "id": 3326538,
      "gameId": 432,
      "modId": 74924,
      "isAvailable": true,
      "displayName": "Mantle 1.6.103 for 1.16.5",
      "fileName": "Mantle-1.16.5-1.6.103.jar",
      "releaseType": 2,
      "fileStatus": 4,
      "hashes": [
        {
          "value": "5daa58a6dd7504f921148eb87719b164d31f7d54",
          "algo": 1
        },
        {
          "value": "bffe6d20e5fb7d5d526988ddfe9acec8",
          "algo": 2
        }
      ],
      "fileDate": "2021-05-27T06:16:46.567Z",
      "fileLength": 658564,
      "downloadCount": 599805,
      "downloadUrl": "https://edge.forgecdn.net/files/3326/538/Mantle-1.16.5-1.6.103.jar",
      "gameVersions": [
        "1.16.5",
        "Forge"
      ],
      "sortableGameVersions": [
        {
          "gameVersionName": "1.16.5",
          "gameVersionPadded": "0000000001.0000000016.0000000005",
          "gameVersion": "1.16.5",
          "gameVersionReleaseDate": "2021-01-15T14:14:48.91Z",
          "gameVersionTypeId": 70886
        },
        {
          "gameVersionName": "Forge",
          "gameVersionPadded": "0",
          "gameVersion": "",
          "gameVersionReleaseDate": "2019-08-01T00:00:00Z",
          "gameVersionTypeId": 68441
        }
      ],
      "dependencies": [],
      "alternateFileId": 0,
      "isServerPack": false,
      "fileFingerprint": 4226404159,
      "modules": [
        {
          "name": "META-INF",
          "fingerprint": 4103404051
        },
        {
          "name": "slimeknights",
          "fingerprint": 2973789672
        },
        {
          "name": "pack.mcmeta",
          "fingerprint": 3720854501
        },
        {
          "name": "Mantle.png",
          "fingerprint": 3296224890
        },
        {
          "name": "assets",
          "fingerprint": 3229207999
        }
      ]
    },
    {
      "id": 3307680,
      "gameId": 432,
      "modId": 74924,
      "isAvailable": true,
      "displayName": "Mantle 1.6.97 for 1.16.5",
      "fileName": "Mantle-1.16.5-1.6.97.jar",
      "releaseType": 2,
      "fileStatus": 4,
      "hashes": [
        {
          "value": "b8221747544f89b13491b5e5e173606619685db1",
          "algo": 1
        },
        {
          "value": "4be8b03bd110ebc6c807c96d345354f9",
          "algo": 2
        }
      ],
      "fileDate": "2021-05-13T01:18:49.01Z",
      "fileLength": 643225,
      "downloadCount": 460430,
      "downloadUrl": "https://edge.forgecdn.net/files/3307/680/Mantle-1.16.5-1.6.97.jar",
      "gameVersions": [
        "1.16.5",
        "Forge"
      ],
      "sortableGameVersions": [
        {
          "gameVersionName": "1.16.5",
          "gameVersionPadded": "0000000001.0000000016.0000000005",
          "gameVersion": "1.16.5",
          "gameVersionReleaseDate": "2021-01-15T14:14:48.91Z",
          "gameVersionTypeId": 70886
        },
        {
          "gameVersionName": "Forge",
          "gameVersionPadded": "0",
          "gameVersion": "",
          "gameVersionReleaseDate": "2019-08-01T00:00:00Z",
          "gameVersionTypeId": 68441
        }
      ],
      "dependencies": [],
      "alternateFileId": 0,
      "isServerPack": false,
      "fileFingerprint": 4213762303,
      "modules": [
        {
          "name": "META-INF",
          "fingerprint": 2753646570
        },
        {
          "name": "slimeknights",
          "fingerprint": 1297303287
        },
        {
          "name": "pack.mcmeta",
          "fingerprint": 3720854501
        },
        {
          "name": "Mantle.png",
          "fingerprint": 3296224890
        },
        {
          "name": "assets",
          "fingerprint": 4127283993
        }
      ]
    },
    {
      "id": 3273201,
      "gameId": 432,
      "modId": 74924,
      "isAvailable": true,
      "displayName": "Mantle 1.6.92 for 1.16.5",
      "fileName": "Mantle-1.16.5-1.6.92.jar",
      "releaseType": 2,
      "fileStatus": 4,
      "hashes": [
        {
          "value": "dae1f5e6b06eba3448e56f8c431d57f64a781ca7",
          "algo": 1
        },
        {
          "value": "16fe9d887c2d062bcdd3d107f8457987",
          "algo": 2
        }
      ],
      "fileDate": "2021-04-12T01:22:00.6Z",
      "fileLength": 610673,
      "downloadCount": 828251,
      "downloadUrl": "https://edge.forgecdn.net/files/3273/201/Mantle-1.16.5-1.6.92.jar",
      "gameVersions": [
        "1.16.5"
      ],
      "sortableGameVersions": [
        {
          "gameVersionName": "1.16.5",
          "gameVersionPadded": "0000000001.0000000016.0000000005",
          "gameVersion": "1.16.5",
          "gameVersionReleaseDate": "2021-01-15T14:14:48.91Z",
          "gameVersionTypeId": 70886
        }
      ],
      "dependencies": [],
      "alternateFileId": 0,
      "isServerPack": false,
      "fileFingerprint": 2724304309,
      "modules": [
        {
          "name": "META-INF",
          "fingerprint": 1481821551
        },
        {
          "name": "slimeknights",
          "fingerprint": 1920153108
        },
        {
          "name": "pack.mcmeta",
          "fingerprint": 3720854501
        },
        {
          "name": "Mantle.png",
          "fingerprint": 3296224890
        },
        {
          "name": "assets",
          "fingerprint": 3843535911
        }
      ]
    },
    {
      "id": 3269973,
      "gameId": 432,
      "modId": 74924,
      "isAvailable": true,
      "displayName": "Mantle 1.6.88 for 1.16.5",
      "fileName": "Mantle-1.16.5-1.6.88.jar",
      "releaseType": 2,
      "fileStatus": 4,
      "hashes": [
        {
          "value": "6fd3b80ed1a507ebe25a44314508fce2df0ebc6c",
          "algo": 1
        },
        {
          "value": "42c50893a9de7c3fd8513fcf908f1806",
          "algo": 2
        }
      ],
      "fileDate": "2021-04-09T02:27:19.707Z",
      "fileLength": 605190,
      "downloadCount": 96826,
      "downloadUrl": "https://edge.forgecdn.net/files/3269/973/Mantle-1.16.5-1.6.88.jar",
      "gameVersions": [
        "1.16.5",
        "Forge"
      ],
      "sortableGameVersions": [
        {
          "gameVersionName": "1.16.5",
          "gameVersionPadded": "0000000001.0000000016.0000000005",
          "gameVersion": "1.16.5",
          "gameVersionReleaseDate": "2021-01-15T14:14:48.91Z",
          "gameVersionTypeId": 70886
        },
        {
          "gameVersionName": "Forge",
          "gameVersionPadded": "0",
          "gameVersion": "",
          "gameVersionReleaseDate": "2019-08-01T00:00:00Z",
          "gameVersionTypeId": 68441
        }
      ],
      "dependencies": [],
      "alternateFileId": 0,
      "isServerPack": false,
      "fileFingerprint": 4039955062,
      "modules": [
        {
          "name": "META-INF",
          "fingerprint": 2635098410
        },
        {
          "name": "slimeknights",
          "fingerprint": 3755375804
        },
        {
          "name": "pack.mcmeta",
          "fingerprint": 3720854501
        },
        {
          "name": "Mantle.png",
          "fingerprint": 3296224890
        },
        {
          "name": "assets",
          "fingerprint": 3843535911
        }
      ]
    },
    {
      "id": 3180804,
      "gameId": 432,
      "modId": 74924,
      "isAvailable": true,
      "displayName": "Mantle 1.6.79 for 1.16.5",
      "fileName": "Mantle-1.16.5-1.6.79.jar",
      "releaseType": 2,
      "fileStatus": 4,
      "hashes": [
        {
          "value": "144f48de7a51baaa90b4e813677154f83612ee0d",
          "algo": 1
        },
        {
          "value": "d675954acdcf410de953e9feb1196e60",
          "algo": 2
        }
      ],
      "fileDate": "2021-01-25T14:34:58.063Z",
      "fileLength": 581249,
      "downloadCount": 1651172,
      "downloadUrl": "https://edge.forgecdn.net/files/3180/804/Mantle-1.16.5-1.6.79.jar",
      "gameVersions": [
        "1.16.3",
        "1.16.5",
        "1.16.4",
        "1.16.2"
      ],
      "sortableGameVersions": [
        {
          "gameVersionName": "1.16.3",
          "gameVersionPadded": "0000000001.0000000016.0000000003",
          "gameVersion": "1.16.3",
          "gameVersionReleaseDate": "2020-09-10T14:44:20.443Z",
          "gameVersionTypeId": 70886
        },
        {
          "gameVersionName": "1.16.5",
          "gameVersionPadded": "0000000001.0000000016.0000000005",
          "gameVersion": "1.16.5",
          "gameVersionReleaseDate": "2021-01-15T14:14:48.91Z",
          "gameVersionTypeId": 70886
        },
        {
          "gameVersionName": "1.16.4",
          "gameVersionPadded": "0000000001.0000000016.0000000004",
          "gameVersion": "1.16.4",
          "gameVersionReleaseDate": "2020-11-02T18:40:51.49Z",
          "gameVersionTypeId": 70886
        },
        {
          "gameVersionName": "1.16.2",
          "gameVersionPadded": "0000000001.0000000016.0000000002",
          "gameVersion": "1.16.2",
          "gameVersionReleaseDate": "2020-08-11T16:42:21.863Z",
          "gameVersionTypeId": 70886
        }
      ],
      "dependencies": [],
      "alternateFileId": 0,
      "isServerPack": false,
      "fileFingerprint": 2803017213,
      "modules": [
        {
          "name": "META-INF",
          "fingerprint": 1363920683
        },
        {
          "name": "slimeknights",
          "fingerprint": 2555928036
        },
        {
          "name": "pack.mcmeta",
          "fingerprint": 3720854501
        },
        {
          "name": "Mantle.png",
          "fingerprint": 3296224890
        },
        {
          "name": "assets",
          "fingerprint": 3843535911
        }
      ]
    },
    {
      "id": 3170850,
      "gameId": 432,
      "modId": 74924,
      "isAvailable": true,
      "displayName": "Mantle 1.6.74 for 1.16.5",
      "fileName": "Mantle-1.16.5-1.6.74.jar",
      "releaseType": 2,
      "fileStatus": 4,
      "hashes": [
        {
          "value": "bc3fdc2f328527dd2b46ac6895407aaaf430e6e1",
          "algo": 1
        },
        {
          "value": "f3d33d9eea8c136a1fad12acd1001977",
          "algo": 2
        }
      ],
      "fileDate": "2021-01-16T22:06:12.067Z",
      "fileLength": 561939,
      "downloadCount": 60228,
      "downloadUrl": "https://edge.forgecdn.net/files/3170/850/Mantle-1.16.5-1.6.74.jar",
      "gameVersions": [
        "1.16.3",
        "1.16.5",
        "Forge",
        "1.16.4",
        "1.16.2"
      ],
      "sortableGameVersions": [
        {
          "gameVersionName": "1.16.3",
          "gameVersionPadded": "0000000001.0000000016.0000000003",
          "gameVersion": "1.16.3",
          "gameVersionReleaseDate": "2020-09-10T14:44:20.443Z",
          "gameVersionTypeId": 70886
        },
        {
          "gameVersionName": "1.16.5",
          "gameVersionPadded": "0000000001.0000000016.0000000005",
          "gameVersion": "1.16.5",
          "gameVersionReleaseDate": "2021-01-15T14:14:48.91Z",
          "gameVersionTypeId": 70886
        },
        {
          "gameVersionName": "Forge",
          "gameVersionPadded": "0",
          "gameVersion": "",
          "gameVersionReleaseDate": "2019-08-01T00:00:00Z",
          "gameVersionTypeId": 68441
        },
        {
          "gameVersionName": "1.16.4",
          "gameVersionPadded": "0000000001.0000000016.0000000004",
          "gameVersion": "1.16.4",
          "gameVersionReleaseDate": "2020-11-02T18:40:51.49Z",
          "gameVersionTypeId": 70886
        },
        {
          "gameVersionName": "1.16.2",
          "gameVersionPadded": "0000000001.0000000016.0000000002",
          "gameVersion": "1.16.2",
          "gameVersionReleaseDate": "2020-08-11T16:42:21.863Z",
          "gameVersionTypeId": 70886
        }
      ],
      "dependencies": [],
      "alternateFileId": 0,
      "isServerPack": false,
      "fileFingerprint": 3423461223,
      "modules": [
        {
          "name": "META-INF",
          "fingerprint": 2879495341
        },
        {
          "name": "slimeknights",
          "fingerprint": 3324360133
        },
        {
          "name": "pack.mcmeta",
          "fingerprint": 3720854501
        },
        {
          "name": "Mantle.png",
          "fingerprint": 3296224890
        },
        {
          "name": "assets",
          "fingerprint": 3843535911
        }
      ]
    },
    {
      "id": 3156757,
      "gameId": 432,
      "modId": 74924,
      "isAvailable": true,
      "displayName": "Mantle 1.6.52 for 1.16.x",
      "fileName": "Mantle-1.16.4-1.6.52.jar",
      "releaseType": 2,
      "fileStatus": 4,
      "hashes": [
        {
          "value": "acbece8f2ca3a3b102f0ad39e5a1619c49b06cf3",
          "algo": 1
        },
        {
          "value": "579a998e6e5229d858607493661b3836",
          "algo": 2
        }
      ],
      "fileDate": "2021-01-03T01:45:14.597Z",
      "fileLength": 547350,
      "downloadCount": 351048,
      "downloadUrl": "https://edge.forgecdn.net/files/3156/757/Mantle-1.16.4-1.6.52.jar",
      "gameVersions": [
        "1.16.3",
        "Forge",
        "1.16.4",
        "1.16.2"
      ],
      "sortableGameVersions": [
        {
          "gameVersionName": "1.16.3",
          "gameVersionPadded": "0000000001.0000000016.0000000003",
          "gameVersion": "1.16.3",
          "gameVersionReleaseDate": "2020-09-10T14:44:20.443Z",
          "gameVersionTypeId": 70886
        },
        {
          "gameVersionName": "Forge",
          "gameVersionPadded": "0",
          "gameVersion": "",
          "gameVersionReleaseDate": "2019-08-01T00:00:00Z",
          "gameVersionTypeId": 68441
        },
        {
          "gameVersionName": "1.16.4",
          "gameVersionPadded": "0000000001.0000000016.0000000004",
          "gameVersion": "1.16.4",
          "gameVersionReleaseDate": "2020-11-02T18:40:51.49Z",
          "gameVersionTypeId": 70886
        },
        {
          "gameVersionName": "1.16.2",
          "gameVersionPadded": "0000000001.0000000016.0000000002",
          "gameVersion": "1.16.2",
          "gameVersionReleaseDate": "2020-08-11T16:42:21.863Z",
          "gameVersionTypeId": 70886
        }
      ],
      "dependencies": [],
      "alternateFileId": 0,
      "isServerPack": false,
      "fileFingerprint": 2386743602,
      "modules": [
        {
          "name": "META-INF",
          "fingerprint": 73169444
        },
        {
          "name": "slimeknights",
          "fingerprint": 3080087058
        },
        {
          "name": "pack.mcmeta",
          "fingerprint": 3720854501
        },
        {
          "name": "Mantle.png",
          "fingerprint": 3296224890
        },
        {
          "name": "assets",
          "fingerprint": 993698285
        }
      ]
    },
    {
      "id": 3101196,
      "gameId": 432,
      "modId": 74924,
      "isAvailable": true,
      "displayName": "Mantle-1.16.4-1.6.43.jar",
      "fileName": "Mantle-1.16.4-1.6.43.jar",
      "releaseType": 3,
      "fileStatus": 4,
      "hashes": [
        {
          "value": "b71e6261af47cfc5aa0d5b68fed9a12bdf2348b2",
          "algo": 1
        },
        {
          "value": "f9b8c29c3c96b2956efa134bbcfaad96",
          "algo": 2
        }
      ],
      "fileDate": "2020-11-03T18:07:03.123Z",
      "fileLength": 539408,
      "downloadCount": 543353,
      "downloadUrl": "https://edge.forgecdn.net/files/3101/196/Mantle-1.16.4-1.6.43.jar",
      "gameVersions": [
        "1.16.3",
        "Forge",
        "1.16.4",
        "1.16.2"
      ],
      "sortableGameVersions": [
        {
          "gameVersionName": "1.16.3",
          "gameVersionPadded": "0000000001.0000000016.0000000003",
          "gameVersion": "1.16.3",
          "gameVersionReleaseDate": "2020-09-10T14:44:20.443Z",
          "gameVersionTypeId": 70886
        },
        {
          "gameVersionName": "Forge",
          "gameVersionPadded": "0",
          "gameVersion": "",
          "gameVersionReleaseDate": "2019-08-01T00:00:00Z",
          "gameVersionTypeId": 68441
        },
        {
          "gameVersionName": "1.16.4",
          "gameVersionPadded": "0000000001.0000000016.0000000004",
          "gameVersion": "1.16.4",
          "gameVersionReleaseDate": "2020-11-02T18:40:51.49Z",
          "gameVersionTypeId": 70886
        },
        {
          "gameVersionName": "1.16.2",
          "gameVersionPadded": "0000000001.0000000016.0000000002",
          "gameVersion": "1.16.2",
          "gameVersionReleaseDate": "2020-08-11T16:42:21.863Z",
          "gameVersionTypeId": 70886
        }
      ],
      "dependencies": [],
      "alternateFileId": 0,
      "isServerPack": false,
      "fileFingerprint": 1202016726,
      "modules": [
        {
          "name": "META-INF",
          "fingerprint": 2357234430
        },
        {
          "name": "slimeknights",
          "fingerprint": 532922874
        },
        {
          "name": "pack.mcmeta",
          "fingerprint": 3720854501
        },
        {
          "name": "Mantle.png",
          "fingerprint": 3296224890
        },
        {
          "name": "assets",
          "fingerprint": 3685789016
        }
      ]
    },
    {
      "id": 3069956,
      "gameId": 432,
      "modId": 74924,
      "isAvailable": true,
      "displayName": "Mantle-1.16.3-1.6.40.jar",
      "fileName": "Mantle-1.16.3-1.6.40.jar",
      "releaseType": 3,
      "fileStatus": 4,
      "hashes": [
        {
          "value": "473feb237b4861d63d5d926b2610bb9df4b3cb32",
          "algo": 1
        },
        {
          "value": "ee5bf082daa4429a522513489f3505a6",
          "algo": 2
        }
      ],
      "fileDate": "2020-10-01T20:57:08.113Z",
      "fileLength": 539410,
      "downloadCount": 25689,
      "downloadUrl": "https://edge.forgecdn.net/files/3069/956/Mantle-1.16.3-1.6.40.jar",
      "gameVersions": [
        "1.16.3",
        "Forge",
        "1.16.2"
      ],
      "sortableGameVersions": [
        {
          "gameVersionName": "1.16.3",
          "gameVersionPadded": "0000000001.0000000016.0000000003",
          "gameVersion": "1.16.3",
          "gameVersionReleaseDate": "2020-09-10T14:44:20.443Z",
          "gameVersionTypeId": 70886
        },
        {
          "gameVersionName": "Forge",
          "gameVersionPadded": "0",
          "gameVersion": "",
          "gameVersionReleaseDate": "2019-08-01T00:00:00Z",
          "gameVersionTypeId": 68441
        },
        {
          "gameVersionName": "1.16.2",
          "gameVersionPadded": "0000000001.0000000016.0000000002",
          "gameVersion": "1.16.2",
          "gameVersionReleaseDate": "2020-08-11T16:42:21.863Z",
          "gameVersionTypeId": 70886
        }
      ],
      "dependencies": [],
      "alternateFileId": 0,
      "isServerPack": false,
      "fileFingerprint": 905815906,
      "modules": [
        {
          "name": "META-INF",
          "fingerprint": 1133250141
        },
        {
          "name": "slimeknights",
          "fingerprint": 532922874
        },
        {
          "name": "pack.mcmeta",
          "fingerprint": 3720854501
        },
        {
          "name": "Mantle.png",
          "fingerprint": 3296224890
        },
        {
          "name": "assets",
          "fingerprint": 3685789016
        }
      ]
    },
    {
      "id": 3029077,
      "gameId": 432,
      "modId": 74924,
      "isAvailable": true,
      "displayName": "Mantle-1.16.1-1.6.27.jar",
      "fileName": "Mantle-1.16.1-1.6.27.jar",
      "releaseType": 3,
      "fileStatus": 4,
      "hashes": [
        {
          "value": "31cc188abd06d07711f5f40820d96f673ccf620d",
          "algo": 1
        },
        {
          "value": "f99c2d96ed310c29eddfee647da70694",
          "algo": 2
        }
      ],
      "fileDate": "2020-08-11T02:27:17.593Z",
      "fileLength": 539043,
      "downloadCount": 113907,
      "downloadUrl": "https://edge.forgecdn.net/files/3029/77/Mantle-1.16.1-1.6.27.jar",
      "gameVersions": [
        "1.16.1",
        "Forge"
      ],
      "sortableGameVersions": [
        {
          "gameVersionName": "1.16.1",
          "gameVersionPadded": "0000000001.0000000016.0000000001",
          "gameVersion": "1.16.1",
          "gameVersionReleaseDate": "2020-06-24T12:41:11.823Z",
          "gameVersionTypeId": 70886
        },
        {
          "gameVersionName": "Forge",
          "gameVersionPadded": "0",
          "gameVersion": "",
          "gameVersionReleaseDate": "2019-08-01T00:00:00Z",
          "gameVersionTypeId": 68441
        }
      ],
      "dependencies": [],
      "alternateFileId": 0,
      "isServerPack": false,
      "fileFingerprint": 1218574081,
      "modules": [
        {
          "name": "META-INF",
          "fingerprint": 3643205879
        },
        {
          "name": "slimeknights",
          "fingerprint": 1195173500
        },
        {
          "name": "pack.mcmeta",
          "fingerprint": 3720854501
        },
        {
          "name": "Mantle.png",
          "fingerprint": 3296224890
        },
        {
          "name": "assets",
          "fingerprint": 3685789016
        }
      ]
    },
    {
      "id": 3024785,
      "gameId": 432,
      "modId": 74924,
      "isAvailable": true,
      "displayName": "Mantle-1.16.1-1.6.20.jar",
      "fileName": "Mantle-1.16.1-1.6.20.jar",
      "releaseType": 3,
      "fileStatus": 4,
      "hashes": [
        {
          "value": "a31d1fafd46d1347289cc1d1d1b5a644b6712917",
          "algo": 1
        },
        {
          "value": "9a73880f8ea68754f37225bedb5d7987",
          "algo": 2
        }
      ],
      "fileDate": "2020-08-06T05:14:02.287Z",
      "fileLength": 535019,
      "downloadCount": 9194,
      "downloadUrl": "https://edge.forgecdn.net/files/3024/785/Mantle-1.16.1-1.6.20.jar",
      "gameVersions": [
        "1.16.1"
      ],
      "sortableGameVersions": [
        {
          "gameVersionName": "1.16.1",
          "gameVersionPadded": "0000000001.0000000016.0000000001",
          "gameVersion": "1.16.1",
          "gameVersionReleaseDate": "2020-06-24T12:41:11.823Z",
          "gameVersionTypeId": 70886
        }
      ],
      "dependencies": [],
      "alternateFileId": 0,
      "isServerPack": false,
      "fileFingerprint": 2133689849,
      "modules": [
        {
          "name": "META-INF",
          "fingerprint": 1517085596
        },
        {
          "name": "slimeknights",
          "fingerprint": 2793088909
        },
        {
          "name": "pack.mcmeta",
          "fingerprint": 3720854501
        },
        {
          "name": "Mantle.png",
          "fingerprint": 3296224890
        },
        {
          "name": "assets",
          "fingerprint": 3685789016
        }
      ]
    },
    {
      "id": 2942705,
      "gameId": 432,
      "modId": 74924,
      "isAvailable": true,
      "displayName": "Mantle-1.15.2-1.5.15.jar",
      "fileName": "Mantle-1.15.2-1.5.15.jar",
      "releaseType": 3,
      "fileStatus": 4,
      "hashes": [
        {
          "value": "ceca218e10e4e4be5b3e8006065c3b8bdefbe99e",
          "algo": 1
        },
        {
          "value": "9918dba4040c7eacec5f3ba602776ac9",
          "algo": 2
        }
      ],
      "fileDate": "2020-04-28T18:18:57.467Z",
      "fileLength": 826536,
      "downloadCount": 445963,
      "downloadUrl": "https://edge.forgecdn.net/files/2942/705/Mantle-1.15.2-1.5.15.jar",
      "gameVersions": [
        "1.15.2",
        "Forge"
      ],
      "sortableGameVersions": [
        {
          "gameVersionName": "1.15.2",
          "gameVersionPadded": "0000000001.0000000015.0000000002",
          "gameVersion": "1.15.2",
          "gameVersionReleaseDate": "2020-01-22T00:00:00Z",
          "gameVersionTypeId": 68722
        },
        {
          "gameVersionName": "Forge",
          "gameVersionPadded": "0",
          "gameVersion": "",
          "gameVersionReleaseDate": "2019-08-01T00:00:00Z",
          "gameVersionTypeId": 68441
        }
      ],
      "dependencies": [],
      "alternateFileId": 0,
      "isServerPack": false,
      "fileFingerprint": 622319519,
      "modules": [
        {
          "name": "META-INF",
          "fingerprint": 3238451888
        },
        {
          "name": "slimeknights",
          "fingerprint": 870362453
        },
        {
          "name": "pack.mcmeta",
          "fingerprint": 3720854501
        },
        {
          "name": "Mantle.png",
          "fingerprint": 3296224890
        },
        {
          "name": "assets",
          "fingerprint": 1911830796
        }
      ]
    },
    {
      "id": 2804948,
      "gameId": 432,
      "modId": 74924,
      "isAvailable": true,
      "displayName": "Mantle-1.14.4-1.4.32.jar",
      "fileName": "Mantle-1.14.4-1.4.32.jar",
      "releaseType": 3,
      "fileStatus": 4,
      "hashes": [
        {
          "value": "a383d273348232798ba0df935fb60dd1dfa342a6",
          "algo": 1
        },
        {
          "value": "f106c8f16f92b9800db6acd289668697",
          "algo": 2
        }
      ],
      "fileDate": "2019-10-09T16:46:25.91Z",
      "fileLength": 834559,
      "downloadCount": 900124,
      "downloadUrl": "https://edge.forgecdn.net/files/2804/948/Mantle-1.14.4-1.4.32.jar",
      "gameVersions": [
        "1.14.4",
        "Forge"
      ],
      "sortableGameVersions": [
        {
          "gameVersionName": "1.14.4",
          "gameVersionPadded": "0000000001.0000000014.0000000004",
          "gameVersion": "1.14.4",
          "gameVersionReleaseDate": "2019-07-19T00:00:00Z",
          "gameVersionTypeId": 64806
        },
        {
          "gameVersionName": "Forge",
          "gameVersionPadded": "0",
          "gameVersion": "",
          "gameVersionReleaseDate": "2019-08-01T00:00:00Z",
          "gameVersionTypeId": 68441
        }
      ],
      "dependencies": [],
      "alternateFileId": 0,
      "isServerPack": false,
      "fileFingerprint": 2820141079,
      "modules": [
        {
          "name": "META-INF",
          "fingerprint": 161688394
        },
        {
          "name": "slimeknights",
          "fingerprint": 2298708804
        },
        {
          "name": "assets",
          "fingerprint": 1911830796
        },
        {
          "name": "Mantle.png",
          "fingerprint": 3296224890
        },
        {
          "name": "pack.mcmeta",
          "fingerprint": 3720854501
        }
      ]
    },
    {
      "id": 2713386,
      "gameId": 432,
      "modId": 74924,
      "isAvailable": true,
      "displayName": "Mantle-1.12-1.3.3.55.jar",
      "fileName": "Mantle-1.12-1.3.3.55.jar",
      "releaseType": 1,
      "fileStatus": 4,
      "hashes": [
        {
          "value": "a1e5d5c197dae3e92637cafb8cd996185191165b",
          "algo": 1
        },
        {
          "value": "1026f5f8d3c4997831decd9023ca65a6",
          "algo": 2
        }
      ],
      "fileDate": "2019-05-19T20:21:43.573Z",
      "fileLength": 843486,
      "downloadCount": 34373983,
      "downloadUrl": "https://edge.forgecdn.net/files/2713/386/Mantle-1.12-1.3.3.55.jar",
      "gameVersions": [
        "1.12",
        "Forge",
        "1.12.2"
      ],
      "sortableGameVersions": [
        {
          "gameVersionName": "1.12",
          "gameVersionPadded": "0000000001.0000000012",
          "gameVersion": "1.12",
          "gameVersionReleaseDate": "2017-06-07T05:00:00Z",
          "gameVersionTypeId": 628
        },
        {
          "gameVersionName": "Forge",
          "gameVersionPadded": "0",
          "gameVersion": "",
          "gameVersionReleaseDate": "2019-08-01T00:00:00Z",
          "gameVersionTypeId": 68441
        },
        {
          "gameVersionName": "1.12.2",
          "gameVersionPadded": "0000000001.0000000012.0000000002",
          "gameVersion": "1.12.2",
          "gameVersionReleaseDate": "2017-09-18T05:00:00Z",
          "gameVersionTypeId": 628
        }
      ],
      "dependencies": [],
      "alternateFileId": 0,
      "isServerPack": false,
      "fileFingerprint": 2810798110,
      "modules": [
        {
          "name": "META-INF",
          "fingerprint": 2519310866
        },
        {
          "name": "slimeknights",
          "fingerprint": 3140161402
        },
        {
          "name": "assets",
          "fingerprint": 770502493
        },
        {
          "name": "Mantle.png",
          "fingerprint": 3296224890
        },
        {
          "name": "mcmod.info",
          "fingerprint": 1859416522
        }
      ]
    },
    {
      "id": 2693483,
      "gameId": 432,
      "modId": 74924,
      "isAvailable": true,
      "displayName": "Mantle-1.12-1.3.3.49.jar",
      "fileName": "Mantle-1.12-1.3.3.49.jar",
      "releaseType": 1,
      "fileStatus": 4,
      "hashes": [
        {
          "value": "cd6b0066ca05e36146333ee1a344bb9a0a8faa03",
          "algo": 1
        },
        {
          "value": "eb4d8475a6e6169e521febba64e792d4",
          "algo": 2
        }
      ],
      "fileDate": "2019-03-30T21:34:22.68Z",
      "fileLength": 841425,
      "downloadCount": 4229724,
      "downloadUrl": "https://edge.forgecdn.net/files/2693/483/Mantle-1.12-1.3.3.49.jar",
      "gameVersions": [
        "1.12.2"
      ],
      "sortableGameVersions": [
        {
          "gameVersionName": "1.12.2",
          "gameVersionPadded": "0000000001.0000000012.0000000002",
          "gameVersion": "1.12.2",
          "gameVersionReleaseDate": "2017-09-18T05:00:00Z",
          "gameVersionTypeId": 628
        }
      ],
      "dependencies": [],
      "alternateFileId": 0,
      "isServerPack": false,
      "fileFingerprint": 3048711305,
      "modules": [
        {
          "name": "META-INF",
          "fingerprint": 3260511022
        },
        {
          "name": "slimeknights",
          "fingerprint": 4066302248
        },
        {
          "name": "assets",
          "fingerprint": 770502493
        },
        {
          "name": "Mantle.png",
          "fingerprint": 3296224890
        },
        {
          "name": "mcmod.info",
          "fingerprint": 856657830
        }
      ]
    },
    {
      "id": 2671124,
      "gameId": 432,
      "modId": 74924,
      "isAvailable": true,
      "displayName": "Mantle-1.12-1.3.3.42.jar",
      "fileName": "Mantle-1.12-1.3.3.42.jar",
      "releaseType": 1,
      "fileStatus": 4,
      "hashes": [
        {
          "value": "ed86370ab9a8f2aa87e6e2a5379ca09503f1338b",
          "algo": 1
        },
        {
          "value": "5e412302ca8f26c9d49003f06d5cffbe",
          "algo": 2
        }
      ],
      "fileDate": "2019-02-09T17:05:37.367Z",
      "fileLength": 838980,
      "downloadCount": 3023619,
      "downloadUrl": "https://edge.forgecdn.net/files/2671/124/Mantle-1.12-1.3.3.42.jar",
      "gameVersions": [
        "1.12.2"
      ],
      "sortableGameVersions": [
        {
          "gameVersionName": "1.12.2",
          "gameVersionPadded": "0000000001.0000000012.0000000002",
          "gameVersion": "1.12.2",
          "gameVersionReleaseDate": "2017-09-18T05:00:00Z",
          "gameVersionTypeId": 628
        }
      ],
      "dependencies": [],
      "alternateFileId": 0,
      "isServerPack": false,
      "fileFingerprint": 2194154936,
      "modules": [
        {
          "name": "META-INF",
          "fingerprint": 3522344513
        },
        {
          "name": "slimeknights",
          "fingerprint": 1812762310
        },
        {
          "name": "assets",
          "fingerprint": 770502493
        },
        {
          "name": "Mantle.png",
          "fingerprint": 3296224890
        },
        {
          "name": "mcmod.info",
          "fingerprint": 543399779
        }
      ]
    },
    {
      "id": 2630843,
      "gameId": 432,
      "modId": 74924,
      "isAvailable": true,
      "displayName": "Mantle-1.12-1.3.3.39.jar",
      "fileName": "Mantle-1.12-1.3.3.39.jar",
      "releaseType": 1,
      "fileStatus": 4,
      "hashes": [
        {
          "value": "bb23a99220319ebd1e6452e7a7e973aca6b286b3",
          "algo": 1
        },
        {
          "value": "ae2a1f5f1b36191acbb07a56a17760de",
          "algo": 2
        }
      ],
      "fileDate": "2018-10-23T17:03:48.7Z",
      "fileLength": 839004,
      "downloadCount": 4948858,
      "downloadUrl": "https://edge.forgecdn.net/files/2630/843/Mantle-1.12-1.3.3.39.jar",
      "gameVersions": [
        "1.12.2"
      ],
      "sortableGameVersions": [
        {
          "gameVersionName": "1.12.2",
          "gameVersionPadded": "0000000001.0000000012.0000000002",
          "gameVersion": "1.12.2",
          "gameVersionReleaseDate": "2017-09-18T05:00:00Z",
          "gameVersionTypeId": 628
        }
      ],
      "dependencies": [],
      "alternateFileId": 0,
      "isServerPack": false,
      "fileFingerprint": 3920937836,
      "modules": [
        {
          "name": "META-INF",
          "fingerprint": 3638071190
        },
        {
          "name": "slimeknights",
          "fingerprint": 425262247
        },
        {
          "name": "assets",
          "fingerprint": 770502493
        },
        {
          "name": "Mantle.png",
          "fingerprint": 3296224890
        },
        {
          "name": "mcmod.info",
          "fingerprint": 3659868247
        }
      ]
    },
    {
      "id": 2550550,
      "gameId": 432,
      "modId": 74924,
      "isAvailable": true,
      "displayName": "Mantle-1.12-1.3.2.24.jar",
      "fileName": "Mantle-1.12-1.3.2.24.jar",
      "releaseType": 1,
      "fileStatus": 4,
      "hashes": [
        {
          "value": "5046273a7db41f4387b9a80310665ddb1e11c738",
          "algo": 1
        },
        {
          "value": "e2cd9d3d5ad2078062c91f9c33fd215c",
          "algo": 2
        }
      ],
      "fileDate": "2018-04-10T17:19:24.327Z",
      "fileLength": 860884,
      "downloadCount": 6679967,
      "downloadUrl": "https://edge.forgecdn.net/files/2550/550/Mantle-1.12-1.3.2.24.jar",
      "gameVersions": [
        "1.12.1",
        "1.12",
        "1.12.2"
      ],
      "sortableGameVersions": [
        {
          "gameVersionName": "1.12.1",
          "gameVersionPadded": "0000000001.0000000012.0000000001",
          "gameVersion": "1.12.1",
          "gameVersionReleaseDate": "2017-08-03T05:00:00Z",
          "gameVersionTypeId": 628
        },
        {
          "gameVersionName": "1.12",
          "gameVersionPadded": "0000000001.0000000012",
          "gameVersion": "1.12",
          "gameVersionReleaseDate": "2017-06-07T05:00:00Z",
          "gameVersionTypeId": 628
        },
        {
          "gameVersionName": "1.12.2",
          "gameVersionPadded": "0000000001.0000000012.0000000002",
          "gameVersion": "1.12.2",
          "gameVersionReleaseDate": "2017-09-18T05:00:00Z",
          "gameVersionTypeId": 628
        }
      ],
      "dependencies": [],
      "alternateFileId": 0,
      "isServerPack": false,
      "fileFingerprint": 1903838159,
      "modules": [
        {
          "name": "META-INF",
          "fingerprint": 2387294836
        },
        {
          "name": "slimeknights",
          "fingerprint": 4078009575
        },
        {
          "name": "assets",
          "fingerprint": 1394543065
        },
        {
          "name": "Mantle.png",
          "fingerprint": 3296224890
        },
        {
          "name": "mcmod.info",
          "fingerprint": 3379085777
        }
      ]
    },
    {
      "id": 2474052,
      "gameId": 432,
      "modId": 74924,
      "isAvailable": true,
      "displayName": "Mantle-1.12-1.3.1.21.jar",
      "fileName": "Mantle-1.12-1.3.1.21.jar",
      "releaseType": 1,
      "fileStatus": 4,
      "hashes": [
        {
          "value": "a0274575945ef637068ba9f1d73cbaf04196917d",
          "algo": 1
        },
        {
          "value": "d194c9461c96e4e4c330931247a7a0dd",
          "algo": 2
        }
      ],
      "fileDate": "2017-09-01T16:59:12.167Z",
      "fileLength": 865513,
      "downloadCount": 3390228,
      "downloadUrl": "https://edge.forgecdn.net/files/2474/52/Mantle-1.12-1.3.1.21.jar",
      "gameVersions": [
        "1.12.1",
        "1.12",
        "1.12.2"
      ],
      "sortableGameVersions": [
        {
          "gameVersionName": "1.12.1",
          "gameVersionPadded": "0000000001.0000000012.0000000001",
          "gameVersion": "1.12.1",
          "gameVersionReleaseDate": "2017-08-03T05:00:00Z",
          "gameVersionTypeId": 628
        },
        {
          "gameVersionName": "1.12",
          "gameVersionPadded": "0000000001.0000000012",
          "gameVersion": "1.12",
          "gameVersionReleaseDate": "2017-06-07T05:00:00Z",
          "gameVersionTypeId": 628
        },
        {
          "gameVersionName": "1.12.2",
          "gameVersionPadded": "0000000001.0000000012.0000000002",
          "gameVersion": "1.12.2",
          "gameVersionReleaseDate": "2017-09-18T05:00:00Z",
          "gameVersionTypeId": 628
        }
      ],
      "dependencies": [],
      "alternateFileId": 0,
      "isServerPack": false,
      "fileFingerprint": 3473629222,
      "modules": [
        {
          "name": "META-INF",
          "fingerprint": 4041124472
        },
        {
          "name": "slimeknights",
          "fingerprint": 3426577226
        },
        {
          "name": "assets",
          "fingerprint": 1394543065
        },
        {
          "name": "Mantle.png",
          "fingerprint": 3296224890
        },
        {
          "name": "mcmod.info",
          "fingerprint": 2917928293
        }
      ]
    },
    {
      "id": 2457530,
      "gameId": 432,
      "modId": 74924,
      "isAvailable": true,
      "displayName": "Mantle-1.12-1.3.1.18.jar",
      "fileName": "Mantle-1.12-1.3.1.18.jar",
      "releaseType": 1,
      "fileStatus": 4,
      "hashes": [
        {
          "value": "86c0d3b1b10c49f21a4a56bc1f5d1cdf80a41aa9",
          "algo": 1
        },
        {
          "value": "439262e578baeda2d31d2093905bdd53",
          "algo": 2
        }
      ],
      "fileDate": "2017-07-29T14:08:56.333Z",
      "fileLength": 857863,
      "downloadCount": 209580,
      "downloadUrl": "https://edge.forgecdn.net/files/2457/530/Mantle-1.12-1.3.1.18.jar",
      "gameVersions": [
        "1.12.1",
        "1.12",
        "Forge"
      ],
      "sortableGameVersions": [
        {
          "gameVersionName": "1.12.1",
          "gameVersionPadded": "0000000001.0000000012.0000000001",
          "gameVersion": "1.12.1",
          "gameVersionReleaseDate": "2017-08-03T05:00:00Z",
          "gameVersionTypeId": 628
        },
        {
          "gameVersionName": "1.12",
          "gameVersionPadded": "0000000001.0000000012",
          "gameVersion": "1.12",
          "gameVersionReleaseDate": "2017-06-07T05:00:00Z",
          "gameVersionTypeId": 628
        },
        {
          "gameVersionName": "Forge",
          "gameVersionPadded": "0",
          "gameVersion": "",
          "gameVersionReleaseDate": "2019-08-01T00:00:00Z",
          "gameVersionTypeId": 68441
        }
      ],
      "dependencies": [],
      "alternateFileId": 2464455,
      "isServerPack": false,
      "fileFingerprint": 3595992189,
      "modules": [
        {
          "name": "META-INF",
          "fingerprint": 2671567725
        },
        {
          "name": "slimeknights",
          "fingerprint": 1117321463
        },
        {
          "name": "assets",
          "fingerprint": 1394543065
        },
        {
          "name": "Mantle.png",
          "fingerprint": 3296224890
        },
        {
          "name": "mcmod.info",
          "fingerprint": 2479746567
        }
      ]
    },
    {
      "id": 2452185,
      "gameId": 432,
      "modId": 74924,
      "isAvailable": true,
      "displayName": "Mantle-1.12-1.3.0.15.jar",
      "fileName": "Mantle-1.12-1.3.0.15.jar",
      "releaseType": 3,
      "fileStatus": 4,
      "hashes": [
        {
          "value": "e3dc2b120310388d061f2570719c510297befdba",
          "algo": 1
        },
        {
          "value": "2155691d80858dd18ef49db8c5263345",
          "algo": 2
        }
      ],
      "fileDate": "2017-07-17T19:55:40.033Z",
      "fileLength": 855425,
      "downloadCount": 76187,
      "downloadUrl": "https://edge.forgecdn.net/files/2452/185/Mantle-1.12-1.3.0.15.jar",
      "gameVersions": [
        "1.12",
        "Forge"
      ],
      "sortableGameVersions": [
        {
          "gameVersionName": "1.12",
          "gameVersionPadded": "0000000001.0000000012",
          "gameVersion": "1.12",
          "gameVersionReleaseDate": "2017-06-07T05:00:00Z",
          "gameVersionTypeId": 628
        },
        {
          "gameVersionName": "Forge",
          "gameVersionPadded": "0",
          "gameVersion": "",
          "gameVersionReleaseDate": "2019-08-01T00:00:00Z",
          "gameVersionTypeId": 68441
        }
      ],
      "dependencies": [],
      "alternateFileId": 0,
      "isServerPack": false,
      "fileFingerprint": 1126713173,
      "modules": [
        {
          "name": "META-INF",
          "fingerprint": 2671567725
        },
        {
          "name": "slimeknights",
          "fingerprint": 1580550191
        },
        {
          "name": "assets",
          "fingerprint": 1394543065
        },
        {
          "name": "Mantle.png",
          "fingerprint": 3296224890
        },
        {
          "name": "mcmod.info",
          "fingerprint": 2946386224
        }
      ]
    },
    {
      "id": 2451817,
      "gameId": 432,
      "modId": 74924,
      "isAvailable": true,
      "displayName": "Mantle-1.12-1.3.0.12.jar",
      "fileName": "Mantle-1.12-1.3.0.12.jar",
      "releaseType": 3,
      "fileStatus": 4,
      "hashes": [
        {
          "value": "7af17faa89e940a20f43136651df578f5779d77d",
          "algo": 1
        },
        {
          "value": "f8acb68be5620078014479abbfb66d57",
          "algo": 2
        }
      ],
      "fileDate": "2017-07-17T01:17:44.497Z",
      "fileLength": 855301,
      "downloadCount": 4736,
      "downloadUrl": "https://edge.forgecdn.net/files/2451/817/Mantle-1.12-1.3.0.12.jar",
      "gameVersions": [
        "1.12"
      ],
      "sortableGameVersions": [
        {
          "gameVersionName": "1.12",
          "gameVersionPadded": "0000000001.0000000012",
          "gameVersion": "1.12",
          "gameVersionReleaseDate": "2017-06-07T05:00:00Z",
          "gameVersionTypeId": 628
        }
      ],
      "dependencies": [],
      "alternateFileId": 0,
      "isServerPack": false,
      "fileFingerprint": 1106979465,
      "modules": [
        {
          "name": "META-INF",
          "fingerprint": 2671567725
        },
        {
          "name": "slimeknights",
          "fingerprint": 4151464924
        },
        {
          "name": "assets",
          "fingerprint": 1394543065
        },
        {
          "name": "Mantle.png",
          "fingerprint": 3296224890
        },
        {
          "name": "mcmod.info",
          "fingerprint": 1736709216
        }
      ]
    },
    {
      "id": 2447156,
      "gameId": 432,
      "modId": 74924,
      "isAvailable": true,
      "displayName": "Mantle-1.12-1.3.0.8.jar",
      "fileName": "Mantle-1.12-1.3.0.8.jar",
      "releaseType": 3,
      "fileStatus": 4,
      "hashes": [
        {
          "value": "ae6245ac9e6f21ca58c955deb4ca9fe0aed4f71f",
          "algo": 1
        },
        {
          "value": "52e245685a4ca8205f1adaacee8c964e",
          "algo": 2
        }
      ],
      "fileDate": "2017-07-07T14:52:34.113Z",
      "fileLength": 855226,
      "downloadCount": 30366,
      "downloadUrl": "https://edge.forgecdn.net/files/2447/156/Mantle-1.12-1.3.0.8.jar",
      "gameVersions": [
        "1.12"
      ],
      "sortableGameVersions": [
        {
          "gameVersionName": "1.12",
          "gameVersionPadded": "0000000001.0000000012",
          "gameVersion": "1.12",
          "gameVersionReleaseDate": "2017-06-07T05:00:00Z",
          "gameVersionTypeId": 628
        }
      ],
      "dependencies": [],
      "alternateFileId": 0,
      "isServerPack": false,
      "fileFingerprint": 2924574427,
      "modules": [
        {
          "name": "META-INF",
          "fingerprint": 2671567725
        },
        {
          "name": "slimeknights",
          "fingerprint": 3421107730
        },
        {
          "name": "assets",
          "fingerprint": 1394543065
        },
        {
          "name": "Mantle.png",
          "fingerprint": 3296224890
        },
        {
          "name": "mcmod.info",
          "fingerprint": 867107023
        }
      ]
    },
    {
      "id": 2413993,
      "gameId": 432,
      "modId": 74924,
      "isAvailable": true,
      "displayName": "Mantle-1.11.2-1.2.0.26.jar",
      "fileName": "Mantle-1.11.2-1.2.0.26.jar",
      "releaseType": 1,
      "fileStatus": 4,
      "hashes": [
        {
          "value": "07278a19e38cbeabe93a9f90f03521da0ca82969",
          "algo": 1
        },
        {
          "value": "7a2f1b6477d296079e9566691ef7dbc9",
          "algo": 2
        }
      ],
      "fileDate": "2017-04-30T15:44:49.673Z",
      "fileLength": 856080,
      "downloadCount": 594918,
      "downloadUrl": "https://edge.forgecdn.net/files/2413/993/Mantle-1.11.2-1.2.0.26.jar",
      "gameVersions": [
        "Forge",
        "1.11.2"
      ],
      "sortableGameVersions": [
        {
          "gameVersionName": "Forge",
          "gameVersionPadded": "0",
          "gameVersion": "",
          "gameVersionReleaseDate": "2019-08-01T00:00:00Z",
          "gameVersionTypeId": 68441
        },
        {
          "gameVersionName": "1.11.2",
          "gameVersionPadded": "0000000001.0000000011.0000000002",
          "gameVersion": "1.11.2",
          "gameVersionReleaseDate": "2016-12-21T06:00:00Z",
          "gameVersionTypeId": 599
        }
      ],
      "dependencies": [],
      "alternateFileId": 0,
      "isServerPack": false,
      "fileFingerprint": 1479966098,
      "modules": [
        {
          "name": "META-INF",
          "fingerprint": 2671567725
        },
        {
          "name": "slimeknights",
          "fingerprint": 2864326400
        },
        {
          "name": "assets",
          "fingerprint": 1394543065
        },
        {
          "name": "Mantle.png",
          "fingerprint": 3296224890
        },
        {
          "name": "mcmod.info",
          "fingerprint": 2403765541
        }
      ]
    },
    {
      "id": 2380279,
      "gameId": 432,
      "modId": 74924,
      "isAvailable": true,
      "displayName": "Mantle-1.10.2-1.1.5.jar",
      "fileName": "Mantle-1.10.2-1.1.5.jar",
      "releaseType": 1,
      "fileStatus": 4,
      "hashes": [
        {
          "value": "bc97963b4eb7caa59dfbb5a56f7c3b2a28da2b9f",
          "algo": 1
        },
        {
          "value": "566a2ef221df5cfddc7af63f222cfba9",
          "algo": 2
        }
      ],
      "fileDate": "2017-02-11T15:03:19.293Z",
      "fileLength": 851810,
      "downloadCount": 13069061,
      "downloadUrl": "https://edge.forgecdn.net/files/2380/279/Mantle-1.10.2-1.1.5.jar",
      "gameVersions": [
        "1.10.2",
        "Forge"
      ],
      "sortableGameVersions": [
        {
          "gameVersionName": "1.10.2",
          "gameVersionPadded": "0000000001.0000000010.0000000002",
          "gameVersion": "1.10.2",
          "gameVersionReleaseDate": "2016-06-23T05:00:00Z",
          "gameVersionTypeId": 572
        },
        {
          "gameVersionName": "Forge",
          "gameVersionPadded": "0",
          "gameVersion": "",
          "gameVersionReleaseDate": "2019-08-01T00:00:00Z",
          "gameVersionTypeId": 68441
        }
      ],
      "dependencies": [],
      "alternateFileId": 0,
      "isServerPack": false,
      "fileFingerprint": 2757469445,
      "modules": [
        {
          "name": "assets",
          "fingerprint": 615409105
        },
        {
          "name": "Mantle.png",
          "fingerprint": 3296224890
        },
        {
          "name": "mcmod.info",
          "fingerprint": 375909602
        },
        {
          "name": "META-INF",
          "fingerprint": 3127738656
        },
        {
          "name": "slimeknights",
          "fingerprint": 659071082
        }
      ]
    },
    {
      "id": 2366244,
      "gameId": 432,
      "modId": 74924,
      "isAvailable": true,
      "displayName": "Mantle-1.10.2-1.1.4.jar",
      "fileName": "Mantle-1.10.2-1.1.4.jar",
      "releaseType": 1,
      "fileStatus": 4,
      "hashes": [
        {
          "value": "539bd8ade646c6e5cca902ae51fb9440ab6c4030",
          "algo": 1
        },
        {
          "value": "9cfc2c66c90dc5b1f16b74beae11860f",
          "algo": 2
        }
      ],
      "fileDate": "2017-01-09T19:40:41.04Z",
      "fileLength": 851786,
      "downloadCount": 2594170,
      "downloadUrl": "https://edge.forgecdn.net/files/2366/244/Mantle-1.10.2-1.1.4.jar",
      "gameVersions": [
        "1.10.2"
      ],
      "sortableGameVersions": [
        {
          "gameVersionName": "1.10.2",
          "gameVersionPadded": "0000000001.0000000010.0000000002",
          "gameVersion": "1.10.2",
          "gameVersionReleaseDate": "2016-06-23T05:00:00Z",
          "gameVersionTypeId": 572
        }
      ],
      "dependencies": [],
      "alternateFileId": 0,
      "isServerPack": false,
      "fileFingerprint": 4219802267,
      "modules": [
        {
          "name": "assets",
          "fingerprint": 615409105
        },
        {
          "name": "Mantle.png",
          "fingerprint": 3296224890
        },
        {
          "name": "mcmod.info",
          "fingerprint": 1095781450
        },
        {
          "name": "META-INF",
          "fingerprint": 3127738656
        },
        {
          "name": "slimeknights",
          "fingerprint": 1295570882
        }
      ]
    },
    {
      "id": 2353326,
      "gameId": 432,
      "modId": 74924,
      "isAvailable": true,
      "displayName": "Mantle-1.10.2-1.1.3.jar",
      "fileName": "Mantle-1.10.2-1.1.3.jar",
      "releaseType": 1,
      "fileStatus": 4,
      "hashes": [
        {
          "value": "067006c0d18ab1f3e9d94ceaac0d5e54ebee401a",
          "algo": 1
        },
        {
          "value": "709e3b66a7b4f75aaab9b6293e79c0ca",
          "algo": 2
        }
      ],
      "fileDate": "2016-12-07T18:15:21.69Z",
      "fileLength": 850608,
      "downloadCount": 867498,
      "downloadUrl": "https://edge.forgecdn.net/files/2353/326/Mantle-1.10.2-1.1.3.jar",
      "gameVersions": [
        "1.10.2"
      ],
      "sortableGameVersions": [
        {
          "gameVersionName": "1.10.2",
          "gameVersionPadded": "0000000001.0000000010.0000000002",
          "gameVersion": "1.10.2",
          "gameVersionReleaseDate": "2016-06-23T05:00:00Z",
          "gameVersionTypeId": 572
        }
      ],
      "dependencies": [],
      "alternateFileId": 0,
      "isServerPack": false,
      "fileFingerprint": 3561468614,
      "modules": [
        {
          "name": "assets",
          "fingerprint": 615409105
        },
        {
          "name": "Mantle.png",
          "fingerprint": 3296224890
        },
        {
          "name": "mcmod.info",
          "fingerprint": 3669399445
        },
        {
          "name": "META-INF",
          "fingerprint": 3127738656
        },
        {
          "name": "slimeknights",
          "fingerprint": 368854347
        }
      ]
    },
    {
      "id": 2349841,
      "gameId": 432,
      "modId": 74924,
      "isAvailable": true,
      "displayName": "Mantle-1.10.2-1.1.2.jar",
      "fileName": "Mantle-1.10.2-1.1.2.jar",
      "releaseType": 1,
      "fileStatus": 4,
      "hashes": [
        {
          "value": "052bdbbd8f516bbc6db10b1cecb6688a4660e048",
          "algo": 1
        },
        {
          "value": "b6b9a7acc5ba8132dcfa0a724c1fb43b",
          "algo": 2
        }
      ],
      "fileDate": "2016-11-27T16:19:04.15Z",
      "fileLength": 850366,
      "downloadCount": 198673,
      "downloadUrl": "https://edge.forgecdn.net/files/2349/841/Mantle-1.10.2-1.1.2.jar",
      "gameVersions": [
        "1.10.2"
      ],
      "sortableGameVersions": [
        {
          "gameVersionName": "1.10.2",
          "gameVersionPadded": "0000000001.0000000010.0000000002",
          "gameVersion": "1.10.2",
          "gameVersionReleaseDate": "2016-06-23T05:00:00Z",
          "gameVersionTypeId": 572
        }
      ],
      "dependencies": [],
      "alternateFileId": 0,
      "isServerPack": false,
      "fileFingerprint": 2262903123,
      "modules": [
        {
          "name": "assets",
          "fingerprint": 615409105
        },
        {
          "name": "Mantle.png",
          "fingerprint": 3296224890
        },
        {
          "name": "mcmod.info",
          "fingerprint": 2007167426
        },
        {
          "name": "META-INF",
          "fingerprint": 3127738656
        },
        {
          "name": "slimeknights",
          "fingerprint": 584082005
        }
      ]
    },
    {
      "id": 2338788,
      "gameId": 432,
      "modId": 74924,
      "isAvailable": true,
      "displayName": "Mantle-1.10.2-1.1.1.jar",
      "fileName": "Mantle-1.10.2-1.1.1.jar",
      "releaseType": 1,
      "fileStatus": 4,
      "hashes": [
        {
          "value": "6714d9b03214aa84fa0048870d9358f93580a4ca",
          "algo": 1
        },
        {
          "value": "f443022af2ae825779731b0beb0403df",
          "algo": 2
        }
      ],
      "fileDate": "2016-10-23T14:59:54.327Z",
      "fileLength": 848651,
      "downloadCount": 550786,
      "downloadUrl": "https://edge.forgecdn.net/files/2338/788/Mantle-1.10.2-1.1.1.jar",
      "gameVersions": [
        "1.10.2"
      ],
      "sortableGameVersions": [
        {
          "gameVersionName": "1.10.2",
          "gameVersionPadded": "0000000001.0000000010.0000000002",
          "gameVersion": "1.10.2",
          "gameVersionReleaseDate": "2016-06-23T05:00:00Z",
          "gameVersionTypeId": 572
        }
      ],
      "dependencies": [],
      "alternateFileId": 0,
      "isServerPack": false,
      "fileFingerprint": 805720243,
      "modules": [
        {
          "name": "assets",
          "fingerprint": 3563853920
        },
        {
          "name": "Mantle.png",
          "fingerprint": 3296224890
        },
        {
          "name": "mcmod.info",
          "fingerprint": 1454199063
        },
        {
          "name": "META-INF",
          "fingerprint": 3127738656
        },
        {
          "name": "slimeknights",
          "fingerprint": 3980418012
        }
      ]
    },
    {
      "id": 2337607,
      "gameId": 432,
      "modId": 74924,
      "isAvailable": true,
      "displayName": "Mantle-1.10.2-1.1.0.jar",
      "fileName": "Mantle-1.10.2-1.1.0.jar",
      "releaseType": 1,
      "fileStatus": 4,
      "hashes": [
        {
          "value": "0b64ca3e6648aa8302c127d4572475b1b282ede6",
          "algo": 1
        },
        {
          "value": "eb5596aedd5bc2bf0944d4079a38f99c",
          "algo": 2
        }
      ],
      "fileDate": "2016-10-18T09:29:43.897Z",
      "fileLength": 848349,
      "downloadCount": 54060,
      "downloadUrl": "https://edge.forgecdn.net/files/2337/607/Mantle-1.10.2-1.1.0.jar",
      "gameVersions": [
        "1.10.2"
      ],
      "sortableGameVersions": [
        {
          "gameVersionName": "1.10.2",
          "gameVersionPadded": "0000000001.0000000010.0000000002",
          "gameVersion": "1.10.2",
          "gameVersionReleaseDate": "2016-06-23T05:00:00Z",
          "gameVersionTypeId": 572
        }
      ],
      "dependencies": [],
      "alternateFileId": 0,
      "isServerPack": false,
      "fileFingerprint": 2346387055,
      "modules": [
        {
          "name": "assets",
          "fingerprint": 3563853920
        },
        {
          "name": "Mantle.png",
          "fingerprint": 3296224890
        },
        {
          "name": "mcmod.info",
          "fingerprint": 3548278859
        },
        {
          "name": "META-INF",
          "fingerprint": 3127738656
        },
        {
          "name": "slimeknights",
          "fingerprint": 771032982
        }
      ]
    },
    {
      "id": 2329535,
      "gameId": 432,
      "modId": 74924,
      "isAvailable": true,
      "displayName": "Mantle-1.10.2-1.0.0.jar",
      "fileName": "Mantle-1.10.2-1.0.0.jar",
      "releaseType": 1,
      "fileStatus": 4,
      "hashes": [
        {
          "value": "e562eed39073ed767581f252dd2a3802b29cbaa0",
          "algo": 1
        },
        {
          "value": "899e843d1e8fa0a933623f405800135c",
          "algo": 2
        }
      ],
      "fileDate": "2016-09-11T11:49:54.797Z",
      "fileLength": 807782,
      "downloadCount": 397248,
      "downloadUrl": "https://edge.forgecdn.net/files/2329/535/Mantle-1.10.2-1.0.0.jar",
      "gameVersions": [
        "1.10.2"
      ],
      "sortableGameVersions": [
        {
          "gameVersionName": "1.10.2",
          "gameVersionPadded": "0000000001.0000000010.0000000002",
          "gameVersion": "1.10.2",
          "gameVersionReleaseDate": "2016-06-23T05:00:00Z",
          "gameVersionTypeId": 572
        }
      ],
      "dependencies": [],
      "alternateFileId": 0,
      "isServerPack": false,
      "fileFingerprint": 4062376321,
      "modules": [
        {
          "name": "assets",
          "fingerprint": 4066090275
        },
        {
          "name": "Mantle.png",
          "fingerprint": 3296224890
        },
        {
          "name": "mcmod.info",
          "fingerprint": 221250284
        },
        {
          "name": "META-INF",
          "fingerprint": 3127738656
        },
        {
          "name": "slimeknights",
          "fingerprint": 1773141208
        }
      ]
    },
    {
      "id": 2319362,
      "gameId": 432,
      "modId": 74924,
      "isAvailable": true,
      "displayName": "Mantle-1.10.2-0.10.4.jar",
      "fileName": "Mantle-1.10.2-0.10.4.jar",
      "releaseType": 1,
      "fileStatus": 4,
      "hashes": [
        {
          "value": "c81048f7c8569e6791ed46406d99fc3011ddaba3",
          "algo": 1
        },
        {
          "value": "e2ab6d3afb44a0caa8d25b381fa0c5dd",
          "algo": 2
        }
      ],
      "fileDate": "2016-07-28T18:02:38.147Z",
      "fileLength": 3202531,
      "downloadCount": 238159,
      "downloadUrl": "https://edge.forgecdn.net/files/2319/362/Mantle-1.10.2-0.10.4.jar",
      "gameVersions": [
        "1.10.2"
      ],
      "sortableGameVersions": [
        {
          "gameVersionName": "1.10.2",
          "gameVersionPadded": "0000000001.0000000010.0000000002",
          "gameVersion": "1.10.2",
          "gameVersionReleaseDate": "2016-06-23T05:00:00Z",
          "gameVersionTypeId": 572
        }
      ],
      "dependencies": [],
      "alternateFileId": 0,
      "isServerPack": false,
      "fileFingerprint": 4182609833,
      "modules": [
        {
          "name": "assets",
          "fingerprint": 4066090275
        },
        {
          "name": "com",
          "fingerprint": 1298318705
        },
        {
          "name": "Mantle.png",
          "fingerprint": 3296224890
        },
        {
          "name": "mcmod.info",
          "fingerprint": 3520799305
        },
        {
          "name": "META-INF",
          "fingerprint": 1544962130
        },
        {
          "name": "ninja",
          "fingerprint": 3265728300
        },
        {
          "name": "slimeknights",
          "fingerprint": 3269809685
        }
      ]
    },
    {
      "id": 2311098,
      "gameId": 432,
      "modId": 74924,
      "isAvailable": true,
      "displayName": "Mantle-1.10-0.10.3.jar",
      "fileName": "Mantle-1.10-0.10.3.jar",
      "releaseType": 1,
      "fileStatus": 4,
      "hashes": [
        {
          "value": "918f5033b8900507c7bd70d4844b15efffaba69a",
          "algo": 1
        },
        {
          "value": "e7b0633a8c97984aae17df6fa3d3a188",
          "algo": 2
        }
      ],
      "fileDate": "2016-06-27T19:49:34.95Z",
      "fileLength": 3202318,
      "downloadCount": 237892,
      "downloadUrl": "https://edge.forgecdn.net/files/2311/98/Mantle-1.10-0.10.3.jar",
      "gameVersions": [
        "1.10.2",
        "Forge",
        "1.10"
      ],
      "sortableGameVersions": [
        {
          "gameVersionName": "1.10.2",
          "gameVersionPadded": "0000000001.0000000010.0000000002",
          "gameVersion": "1.10.2",
          "gameVersionReleaseDate": "2016-06-23T05:00:00Z",
          "gameVersionTypeId": 572
        },
        {
          "gameVersionName": "Forge",
          "gameVersionPadded": "0",
          "gameVersion": "",
          "gameVersionReleaseDate": "2019-08-01T00:00:00Z",
          "gameVersionTypeId": 68441
        },
        {
          "gameVersionName": "1.10",
          "gameVersionPadded": "0000000001.0000000010",
          "gameVersion": "1.10",
          "gameVersionReleaseDate": "2016-06-08T05:00:00Z",
          "gameVersionTypeId": 572
        }
      ],
      "dependencies": [],
      "alternateFileId": 0,
      "isServerPack": false,
      "fileFingerprint": 836821843,
      "modules": [
        {
          "name": "assets",
          "fingerprint": 4066090275
        },
        {
          "name": "com",
          "fingerprint": 1298318705
        },
        {
          "name": "Mantle.png",
          "fingerprint": 3296224890
        },
        {
          "name": "mcmod.info",
          "fingerprint": 2353219210
        },
        {
          "name": "META-INF",
          "fingerprint": 1544962130
        },
        {
          "name": "ninja",
          "fingerprint": 3265728300
        },
        {
          "name": "slimeknights",
          "fingerprint": 678955495
        }
      ]
    },
    {
      "id": 2311092,
      "gameId": 432,
      "modId": 74924,
      "isAvailable": true,
      "displayName": "Mantle-1.9.4-0.10.3.jar",
      "fileName": "Mantle-1.9.4-0.10.3.jar",
      "releaseType": 1,
      "fileStatus": 4,
      "hashes": [
        {
          "value": "62a956b106daba1787d36402f210bac3dbd58278",
          "algo": 1
        },
        {
          "value": "c011b2394d79ddc28957494b9313a46f",
          "algo": 2
        }
      ],
      "fileDate": "2016-06-27T19:35:42.173Z",
      "fileLength": 3202320,
      "downloadCount": 194037,
      "downloadUrl": "https://edge.forgecdn.net/files/2311/92/Mantle-1.9.4-0.10.3.jar",
      "gameVersions": [
        "1.9.4",
        "Forge"
      ],
      "sortableGameVersions": [
        {
          "gameVersionName": "1.9.4",
          "gameVersionPadded": "0000000001.0000000009.0000000004",
          "gameVersion": "1.9.4",
          "gameVersionReleaseDate": "2016-05-10T05:00:00Z",
          "gameVersionTypeId": 552
        },
        {
          "gameVersionName": "Forge",
          "gameVersionPadded": "0",
          "gameVersion": "",
          "gameVersionReleaseDate": "2019-08-01T00:00:00Z",
          "gameVersionTypeId": 68441
        }
      ],
      "dependencies": [],
      "alternateFileId": 0,
      "isServerPack": false,
      "fileFingerprint": 881893643,
      "modules": [
        {
          "name": "assets",
          "fingerprint": 4066090275
        },
        {
          "name": "com",
          "fingerprint": 1298318705
        },
        {
          "name": "Mantle.png",
          "fingerprint": 3296224890
        },
        {
          "name": "mcmod.info",
          "fingerprint": 803421877
        },
        {
          "name": "META-INF",
          "fingerprint": 1544962130
        },
        {
          "name": "ninja",
          "fingerprint": 3265728300
        },
        {
          "name": "slimeknights",
          "fingerprint": 870111589
        }
      ]
    },
    {
      "id": 2308431,
      "gameId": 432,
      "modId": 74924,
      "isAvailable": true,
      "displayName": "Mantle-1.9.4-0.10.2.jar",
      "fileName": "Mantle-1.9.4-0.10.2.jar",
      "releaseType": 1,
      "fileStatus": 4,
      "hashes": [
        {
          "value": "7ceae9a22653332ab227366fe202431a1e7698ec",
          "algo": 1
        },
        {
          "value": "698a71170da5035ee53f8489264598ab",
          "algo": 2
        }
      ],
      "fileDate": "2016-06-18T09:02:13.73Z",
      "fileLength": 3202257,
      "downloadCount": 44023,
      "downloadUrl": "https://edge.forgecdn.net/files/2308/431/Mantle-1.9.4-0.10.2.jar",
      "gameVersions": [
        "1.9.4",
        "Forge"
      ],
      "sortableGameVersions": [
        {
          "gameVersionName": "1.9.4",
          "gameVersionPadded": "0000000001.0000000009.0000000004",
          "gameVersion": "1.9.4",
          "gameVersionReleaseDate": "2016-05-10T05:00:00Z",
          "gameVersionTypeId": 552
        },
        {
          "gameVersionName": "Forge",
          "gameVersionPadded": "0",
          "gameVersion": "",
          "gameVersionReleaseDate": "2019-08-01T00:00:00Z",
          "gameVersionTypeId": 68441
        }
      ],
      "dependencies": [],
      "alternateFileId": 0,
      "isServerPack": false,
      "fileFingerprint": 3083559397,
      "modules": [
        {
          "name": "assets",
          "fingerprint": 4066090275
        },
        {
          "name": "com",
          "fingerprint": 1298318705
        },
        {
          "name": "Mantle.png",
          "fingerprint": 3296224890
        },
        {
          "name": "mcmod.info",
          "fingerprint": 960586675
        },
        {
          "name": "META-INF",
          "fingerprint": 1544962130
        },
        {
          "name": "ninja",
          "fingerprint": 3265728300
        },
        {
          "name": "slimeknights",
          "fingerprint": 3700526195
        }
      ]
    },
    {
      "id": 2304145,
      "gameId": 432,
      "modId": 74924,
      "isAvailable": true,
      "displayName": "Mantle-1.9.4-0.10.1.jenkins142.jar",
      "fileName": "Mantle-1.9.4-0.10.1.jenkins142.jar",
      "releaseType": 3,
      "fileStatus": 4,
      "hashes": [
        {
          "value": "97b31348aa7854f64c2fe25f281624611ace7cc2",
          "algo": 1
        },
        {
          "value": "d1776d6caf7f2d7c6b0b914fd76946cd",
          "algo": 2
        }
      ],
      "fileDate": "2016-05-31T19:18:29.953Z",
      "fileLength": 3190921,
      "downloadCount": 83262,
      "downloadUrl": "https://edge.forgecdn.net/files/2304/145/Mantle-1.9.4-0.10.1.jenkins142.jar",
      "gameVersions": [
        "1.9.4",
        "Forge"
      ],
      "sortableGameVersions": [
        {
          "gameVersionName": "1.9.4",
          "gameVersionPadded": "0000000001.0000000009.0000000004",
          "gameVersion": "1.9.4",
          "gameVersionReleaseDate": "2016-05-10T05:00:00Z",
          "gameVersionTypeId": 552
        },
        {
          "gameVersionName": "Forge",
          "gameVersionPadded": "0",
          "gameVersion": "",
          "gameVersionReleaseDate": "2019-08-01T00:00:00Z",
          "gameVersionTypeId": 68441
        }
      ],
      "dependencies": [],
      "alternateFileId": 0,
      "isServerPack": false,
      "fileFingerprint": 3522380333,
      "modules": [
        {
          "name": "META-INF",
          "fingerprint": 1544962130
        },
        {
          "name": "slimeknights",
          "fingerprint": 3498014023
        },
        {
          "name": "Mantle.png",
          "fingerprint": 3296224890
        },
        {
          "name": "mcmod.info",
          "fingerprint": 1159199439
        },
        {
          "name": "assets",
          "fingerprint": 3532577073
        },
        {
          "name": "ninja",
          "fingerprint": 3265728300
        },
        {
          "name": "com",
          "fingerprint": 1298318705
        }
      ]
    },
    {
      "id": 2302982,
      "gameId": 432,
      "modId": 74924,
      "isAvailable": true,
      "displayName": "Mantle-1.9-0.10.1.jar",
      "fileName": "Mantle-1.9-0.10.1.jar",
      "releaseType": 2,
      "fileStatus": 4,
      "hashes": [
        {
          "value": "45ff7b5d29333abd74cd01de5e57606a3facdffd",
          "algo": 1
        },
        {
          "value": "ff5096add01448238bf69774436c617e",
          "algo": 2
        }
      ],
      "fileDate": "2016-05-26T15:37:09.12Z",
      "fileLength": 3189409,
      "downloadCount": 53408,
      "downloadUrl": "https://edge.forgecdn.net/files/2302/982/Mantle-1.9-0.10.1.jar",
      "gameVersions": [
        "Forge",
        "1.9"
      ],
      "sortableGameVersions": [
        {
          "gameVersionName": "Forge",
          "gameVersionPadded": "0",
          "gameVersion": "",
          "gameVersionReleaseDate": "2019-08-01T00:00:00Z",
          "gameVersionTypeId": 68441
        },
        {
          "gameVersionName": "1.9",
          "gameVersionPadded": "0000000001.0000000009",
          "gameVersion": "1.9",
          "gameVersionReleaseDate": "2016-02-29T06:00:00Z",
          "gameVersionTypeId": 552
        }
      ],
      "dependencies": [],
      "alternateFileId": 0,
      "isServerPack": false,
      "fileFingerprint": 3396617729,
      "modules": [
        {
          "name": "assets",
          "fingerprint": 3532577073
        },
        {
          "name": "com",
          "fingerprint": 1298318705
        },
        {
          "name": "Mantle.png",
          "fingerprint": 3296224890
        },
        {
          "name": "mcmod.info",
          "fingerprint": 2154070063
        },
        {
          "name": "META-INF",
          "fingerprint": 1544962130
        },
        {
          "name": "ninja",
          "fingerprint": 3265728300
        },
        {
          "name": "slimeknights",
          "fingerprint": 2073215209
        }
      ]
    },
    {
      "id": 2297859,
      "gameId": 432,
      "modId": 74924,
      "isAvailable": true,
      "displayName": "Mantle-1.9-0.10.0.jar",
      "fileName": "Mantle-1.9-0.10.0.jar",
      "releaseType": 3,
      "fileStatus": 4,
      "hashes": [
        {
          "value": "4208185ac946ea9c65cda59778ede694b88dc697",
          "algo": 1
        },
        {
          "value": "86d12ddd60e3e9331e5043135f7d7263",
          "algo": 2
        }
      ],
      "fileDate": "2016-05-03T19:35:49.777Z",
      "fileLength": 3182310,
      "downloadCount": 19392,
      "downloadUrl": "https://edge.forgecdn.net/files/2297/859/Mantle-1.9-0.10.0.jar",
      "gameVersions": [
        "1.9"
      ],
      "sortableGameVersions": [
        {
          "gameVersionName": "1.9",
          "gameVersionPadded": "0000000001.0000000009",
          "gameVersion": "1.9",
          "gameVersionReleaseDate": "2016-02-29T06:00:00Z",
          "gameVersionTypeId": 552
        }
      ],
      "dependencies": [],
      "alternateFileId": 0,
      "isServerPack": false,
      "fileFingerprint": 2761580544,
      "modules": [
        {
          "name": "assets",
          "fingerprint": 3532577073
        },
        {
          "name": "com",
          "fingerprint": 1298318705
        },
        {
          "name": "Mantle.png",
          "fingerprint": 3296224890
        },
        {
          "name": "mcmod.info",
          "fingerprint": 138917010
        },
        {
          "name": "META-INF",
          "fingerprint": 2866639361
        },
        {
          "name": "ninja",
          "fingerprint": 3265728300
        },
        {
          "name": "slimeknights",
          "fingerprint": 1335334026
        }
      ]
    },
    {
      "id": 2293459,
      "gameId": 432,
      "modId": 74924,
      "isAvailable": true,
      "displayName": "Mantle-1.9-0.9.4.jar",
      "fileName": "Mantle-1.9-0.9.4.jar",
      "releaseType": 1,
      "fileStatus": 4,
      "hashes": [
        {
          "value": "152960bb41822bf90122610e0a28a9d85856c571",
          "algo": 1
        },
        {
          "value": "9527a96064cf97926d8a78ef72d957e6",
          "algo": 2
        }
      ],
      "fileDate": "2016-04-10T16:48:52.707Z",
      "fileLength": 3174367,
      "downloadCount": 101446,
      "downloadUrl": "https://edge.forgecdn.net/files/2293/459/Mantle-1.9-0.9.4.jar",
      "gameVersions": [
        "1.9"
      ],
      "sortableGameVersions": [
        {
          "gameVersionName": "1.9",
          "gameVersionPadded": "0000000001.0000000009",
          "gameVersion": "1.9",
          "gameVersionReleaseDate": "2016-02-29T06:00:00Z",
          "gameVersionTypeId": 552
        }
      ],
      "dependencies": [],
      "alternateFileId": 0,
      "isServerPack": false,
      "fileFingerprint": 3685195251,
      "modules": [
        {
          "name": "assets",
          "fingerprint": 1707124058
        },
        {
          "name": "com",
          "fingerprint": 1298318705
        },
        {
          "name": "Mantle.png",
          "fingerprint": 3296224890
        },
        {
          "name": "mcmod.info",
          "fingerprint": 2556572152
        },
        {
          "name": "META-INF",
          "fingerprint": 2866639361
        },
        {
          "name": "ninja",
          "fingerprint": 3265728300
        },
        {
          "name": "slimeknights",
          "fingerprint": 1712025994
        }
      ]
    },
    {
      "id": 2290992,
      "gameId": 432,
      "modId": 74924,
      "isAvailable": true,
      "displayName": "Mantle-1.9-0.9.3a.jar",
      "fileName": "Mantle-1.9-0.9.3a.jar",
      "releaseType": 3,
      "fileStatus": 4,
      "hashes": [
        {
          "value": "3df3d27f3d1f9e456376c3e0c25ad0f33825ea5c",
          "algo": 1
        },
        {
          "value": "35246af1166251579e143dba4e7b2397",
          "algo": 2
        }
      ],
      "fileDate": "2016-03-30T21:23:08.877Z",
      "fileLength": 3174115,
      "downloadCount": 17285,
      "downloadUrl": "https://edge.forgecdn.net/files/2290/992/Mantle-1.9-0.9.3a.jar",
      "gameVersions": [
        "1.9"
      ],
      "sortableGameVersions": [
        {
          "gameVersionName": "1.9",
          "gameVersionPadded": "0000000001.0000000009",
          "gameVersion": "1.9",
          "gameVersionReleaseDate": "2016-02-29T06:00:00Z",
          "gameVersionTypeId": 552
        }
      ],
      "dependencies": [],
      "alternateFileId": 0,
      "isServerPack": false,
      "fileFingerprint": 1007651793,
      "modules": [
        {
          "name": "assets",
          "fingerprint": 1707124058
        },
        {
          "name": "com",
          "fingerprint": 1298318705
        },
        {
          "name": "Mantle.png",
          "fingerprint": 3296224890
        },
        {
          "name": "mcmod.info",
          "fingerprint": 983977596
        },
        {
          "name": "META-INF",
          "fingerprint": 2866639361
        },
        {
          "name": "ninja",
          "fingerprint": 3265728300
        },
        {
          "name": "slimeknights",
          "fingerprint": 358398528
        }
      ]
    }
  ],
  "pagination": {
    "index": 0,
    "pageSize": 50,
    "resultCount": 50,
    "totalCount": 66
  }
}
