{
  "data": [
    {
      "id": 2409598,
      "gameId": 432,
      "modId": 223328,
      "isAvailable": true,
      "displayName": "JSTR Universal",
      "fileName": "JSTR_Modded_Universal.zip",
      "releaseType": 1,
      "fileStatus": 4,
      "hashes": [
        {
          "value": "d0e45d51d49247add3fcaa1ae5c89511c6149358",
          "algo": 1
        },
        {
          "value": "5e8c1e44e1461da81954b9340d3f1f45",
          "algo": 2
        }
      ],
      "fileDate": "2017-04-20T23:59:27.48Z",
      "fileLength": 34906089,
      "downloadCount": 88,
      "downloadUrl": "https://edge.forgecdn.net/files/2409/598/JSTR_Modded_Universal.zip",
      "gameVersions": [
        "1.8.9"
      ],
      "sortableGameVersions": [
        {
          "gameVersionName": "1.8.9",
          "gameVersionPadded": "0000000001.0000000008.0000000009",
          "gameVersion": "1.8.9",
          "gameVersionReleaseDate": "2015-12-09T06:00:00Z",
          "gameVersionTypeId": 4
        }
      ],
      "dependencies": [],
      "alternateFileId": 0,
      "isServerPack": false,
      "fileFingerprint": 1459627502,
      "modules": [
        {
          "name": "pack.mcmeta",
          "fingerprint": 150540921
        },
        {
          "name": "assets",
          "fingerprint": 2318586128
        },
        {
          "name": "pack.png",
          "fingerprint": 1449310668
        },
        {
          "name": "JSTR_1.8.x_CHANGELOG.txt",
          "fingerprint": 1257552692
        },
        {
          "name": "font.txt",
          "fingerprint": 2243831094
        },
        {
          "name": "license.txt",
          "fingerprint": 3622228448
        },
        {
          "name": "ReadMe.txt",
          "fingerprint": 387904363
        }
      ]
    },
    {
      "id": 2409597,
      "gameId": 432,
      "modId": 223328,
      "isAvailable": true,
      "displayName": "JSTR Universal",
      "fileName": "JSTR_Modded_Universal.zip",
      "releaseType": 1,
      "fileStatus": 4,
      "hashes": [
        {
          "value": "8339f3d1d46827e4df1f568c786e18588ff543e6",
          "algo": 1
        },
        {
          "value": "8de89a1421710d5022abfd7e652717e0",
          "algo": 2
        }
      ],
      "fileDate": "2017-04-20T23:59:03.25Z",
      "fileLength": 177632062,
      "downloadCount": 188,
      "downloadUrl": "https://edge.forgecdn.net/files/2409/597/JSTR_Modded_Universal.zip",
      "gameVersions": [
        "1.7.10"
      ],
      "sortableGameVersions": [
        {
          "gameVersionName": "1.7.10",
          "gameVersionPadded": "0000000001.0000000007.0000000010",
          "gameVersion": "1.7.10",
          "gameVersionReleaseDate": "2014-06-16T00:00:00Z",
          "gameVersionTypeId": 5
        }
      ],
      "dependencies": [],
      "alternateFileId": 0,
      "isServerPack": false,
      "fileFingerprint": 2430459659,
      "modules": [
        {
          "name": "pack.mcmeta",
          "fingerprint": 295346243
        },
        {
          "name": "assets",
          "fingerprint": 1347057396
        },
        {
          "name": "JOHN_SMITH_LEGACY_1.7.10_CHANGELOG.txt",
          "fingerprint": 1960649881
        },
        {
          "name": "helper_files",
          "fingerprint": 2709340199
        },
        {
          "name": "pack.png",
          "fingerprint": 1449310668
        },
        {
          "name": "font.txt",
          "fingerprint": 2243831094
        },
        {
          "name": "license.txt",
          "fingerprint": 3622228448
        },
        {
          "name": "ReadMe.txt",
          "fingerprint": 2277206236
        },
        {
          "name": "Reika",
          "fingerprint": 1980618461
        },
        {
          "name": "textures",
          "fingerprint": 489227403
        }
      ]
    },
    {
      "id": 2408675,
      "gameId": 432,
      "modId": 223328,
      "isAvailable": true,
      "displayName": "JSTR Universal",
      "fileName": "JSTR_Modded_Universal.zip",
      "releaseType": 1,
      "fileStatus": 4,
      "hashes": [
        {
          "value": "a19353c3ed9d8beec83ae07447b6064266ee1a23",
          "algo": 1
        },
        {
          "value": "a7d074c32aa1260c9495155c07fa8fd4",
          "algo": 2
        }
      ],
      "fileDate": "2017-04-18T23:50:18.647Z",
      "fileLength": 34906089,
      "downloadCount": 105,
      "downloadUrl": "https://edge.forgecdn.net/files/2408/675/JSTR_Modded_Universal.zip",
      "gameVersions": [
        "1.8.9"
      ],
      "sortableGameVersions": [
        {
          "gameVersionName": "1.8.9",
          "gameVersionPadded": "0000000001.0000000008.0000000009",
          "gameVersion": "1.8.9",
          "gameVersionReleaseDate": "2015-12-09T06:00:00Z",
          "gameVersionTypeId": 4
        }
      ],
      "dependencies": [],
      "alternateFileId": 0,
      "isServerPack": false,
      "fileFingerprint": 3654566469,
      "modules": [
        {
          "name": "pack.mcmeta",
          "fingerprint": 150540921
        },
        {
          "name": "assets",
          "fingerprint": 2318586128
        },
        {
          "name": "pack.png",
          "fingerprint": 1449310668
        },
        {
          "name": "JSTR_1.8.x_CHANGELOG.txt",
          "fingerprint": 1257552692
        },
        {
          "name": "font.txt",
          "fingerprint": 2243831094
        },
        {
          "name": "license.txt",
          "fingerprint": 3622228448
        },
        {
          "name": "ReadMe.txt",
          "fingerprint": 387904363
        }
      ]
    },
    {
      "id": 2408674,
      "gameId": 432,
      "modId": 223328,
      "isAvailable": true,
      "displayName": "JSTR Universal",
      "fileName": "JSTR_Modded_Universal.zip",
      "releaseType": 1,
      "fileStatus": 4,
      "hashes": [
        {
          "value": "332a8f7df419a9ae2dc5bad5486dcadd5c3539bb",
          "algo": 1
        },
        {
          "value": "675b998b14f11364b078adb8eba8e862",
          "algo": 2
        }
      ],
      "fileDate": "2017-04-18T23:49:50.973Z",
      "fileLength": 177632062,
      "downloadCount": 412,
      "downloadUrl": "https://edge.forgecdn.net/files/2408/674/JSTR_Modded_Universal.zip",
      "gameVersions": [
        "1.7.10"
      ],
      "sortableGameVersions": [
        {
          "gameVersionName": "1.7.10",
          "gameVersionPadded": "0000000001.0000000007.0000000010",
          "gameVersion": "1.7.10",
          "gameVersionReleaseDate": "2014-06-16T00:00:00Z",
          "gameVersionTypeId": 5
        }
      ],
      "dependencies": [],
      "alternateFileId": 0,
      "isServerPack": false,
      "fileFingerprint": 3364859635,
      "modules": [
        {
          "name": "pack.mcmeta",
          "fingerprint": 1005821155
        },
        {
          "name": "assets",
          "fingerprint": 1347057396
        },
        {
          "name": "JOHN_SMITH_LEGACY_1.7.10_CHANGELOG.txt",
          "fingerprint": 1960649881
        },
        {
          "name": "helper_files",
          "fingerprint": 2709340199
        },
        {
          "name": "pack.png",
          "fingerprint": 1449310668
        },
        {
          "name": "font.txt",
          "fingerprint": 2243831094
        },
        {
          "name": "license.txt",
          "fingerprint": 3622228448
        },
        {
          "name": "ReadMe.txt",
          "fingerprint": 2277206236
        },
        {
          "name": "Reika",
          "fingerprint": 1980618461
        },
        {
          "name": "textures",
          "fingerprint": 489227403
        }
      ]
    },
    {
      "id": 2407813,
      "gameId": 432,
      "modId": 223328,
      "isAvailable": true,
      "displayName": "JSTR Universal",
      "fileName": "JSTR_Modded_Universal.zip",
      "releaseType": 1,
      "fileStatus": 4,
      "hashes": [
        {
          "value": "1b2f6d884d685d03fc57359ca736a24c27a41da7",
          "algo": 1
        },
        {
          "value": "da7ba40bb23155d13da4927caf773e70",
          "algo": 2
        }
      ],
      "fileDate": "2017-04-17T00:13:08.467Z",
      "fileLength": 33821645,
      "downloadCount": 118,
      "downloadUrl": "https://edge.forgecdn.net/files/2407/813/JSTR_Modded_Universal.zip",
      "gameVersions": [
        "1.9.3"
      ],
      "sortableGameVersions": [
        {
          "gameVersionName": "1.9.3",
          "gameVersionPadded": "0000000001.0000000009.0000000003",
          "gameVersion": "1.9.3",
          "gameVersionReleaseDate": "2016-05-09T05:00:00Z",
          "gameVersionTypeId": 552
        }
      ],
      "dependencies": [],
      "alternateFileId": 0,
      "isServerPack": false,
      "fileFingerprint": 1143132079,
      "modules": [
        {
          "name": "pack.mcmeta",
          "fingerprint": 3124656134
        },
        {
          "name": "assets",
          "fingerprint": 2378690372
        },
        {
          "name": "pack.png",
          "fingerprint": 1449310668
        },
        {
          "name": "font.txt",
          "fingerprint": 2243831094
        },
        {
          "name": "license.txt",
          "fingerprint": 3622228448
        },
        {
          "name": "ReadMe.txt",
          "fingerprint": 2951307156
        }
      ]
    },
    {
      "id": 2407811,
      "gameId": 432,
      "modId": 223328,
      "isAvailable": true,
      "displayName": "JSTR Universal",
      "fileName": "JSTR_Modded_Universal.zip",
      "releaseType": 1,
      "fileStatus": 4,
      "hashes": [
        {
          "value": "c7fe0564e7c20c96c2a981f1696a1ac5853b0258",
          "algo": 1
        },
        {
          "value": "f38531f937503534e2fd9d932652ba9f",
          "algo": 2
        }
      ],
      "fileDate": "2017-04-17T00:11:04.49Z",
      "fileLength": 177632062,
      "downloadCount": 224,
      "downloadUrl": "https://edge.forgecdn.net/files/2407/811/JSTR_Modded_Universal.zip",
      "gameVersions": [
        "1.7.10"
      ],
      "sortableGameVersions": [
        {
          "gameVersionName": "1.7.10",
          "gameVersionPadded": "0000000001.0000000007.0000000010",
          "gameVersion": "1.7.10",
          "gameVersionReleaseDate": "2014-06-16T00:00:00Z",
          "gameVersionTypeId": 5
        }
      ],
      "dependencies": [],
      "alternateFileId": 0,
      "isServerPack": false,
      "fileFingerprint": 1016095622,
      "modules": [
        {
          "name": "pack.mcmeta",
          "fingerprint": 2417376560
        },
        {
          "name": "assets",
          "fingerprint": 1347057396
        },
        {
          "name": "JOHN_SMITH_LEGACY_1.7.10_CHANGELOG.txt",
          "fingerprint": 1960649881
        },
        {
          "name": "helper_files",
          "fingerprint": 2709340199
        },
        {
          "name": "pack.png",
          "fingerprint": 1449310668
        },
        {
          "name": "font.txt",
          "fingerprint": 2243831094
        },
        {
          "name": "license.txt",
          "fingerprint": 3622228448
        },
        {
          "name": "ReadMe.txt",
          "fingerprint": 2277206236
        },
        {
          "name": "Reika",
          "fingerprint": 1980618461
        },
        {
          "name": "textures",
          "fingerprint": 489227403
        }
      ]
    },
    {
      "id": 2407055,
      "gameId": 432,
      "modId": 223328,
      "isAvailable": true,
      "displayName": "JSTR Universal",
      "fileName": "JSTR_Modded_Universal.zip",
      "releaseType": 1,
      "fileStatus": 4,
      "hashes": [
        {
          "value": "ebfb509c9a5cb3b42adac913bd152da4e1c7795d",
          "algo": 1
        },
        {
          "value": "e2dd8868120fb83c4e3ed4f2ba81d489",
          "algo": 2
        }
      ],
      "fileDate": "2017-04-15T00:14:04.757Z",
      "fileLength": 33821645,
      "downloadCount": 111,
      "downloadUrl": "https://edge.forgecdn.net/files/2407/55/JSTR_Modded_Universal.zip",
      "gameVersions": [
        "1.9.3"
      ],
      "sortableGameVersions": [
        {
          "gameVersionName": "1.9.3",
          "gameVersionPadded": "0000000001.0000000009.0000000003",
          "gameVersion": "1.9.3",
          "gameVersionReleaseDate": "2016-05-09T05:00:00Z",
          "gameVersionTypeId": 552
        }
      ],
      "dependencies": [],
      "alternateFileId": 0,
      "isServerPack": false,
      "fileFingerprint": 1454379738,
      "modules": [
        {
          "name": "pack.mcmeta",
          "fingerprint": 3124656134
        },
        {
          "name": "assets",
          "fingerprint": 2378690372
        },
        {
          "name": "pack.png",
          "fingerprint": 1449310668
        },
        {
          "name": "font.txt",
          "fingerprint": 2243831094
        },
        {
          "name": "license.txt",
          "fingerprint": 3622228448
        },
        {
          "name": "ReadMe.txt",
          "fingerprint": 2951307156
        }
      ]
    },
    {
      "id": 2407053,
      "gameId": 432,
      "modId": 223328,
      "isAvailable": true,
      "displayName": "JSTR Universal",
      "fileName": "JSTR_Modded_Universal.zip",
      "releaseType": 1,
      "fileStatus": 4,
      "hashes": [
        {
          "value": "1ad38f1831b33de04baae37e332b5d824d010a8f",
          "algo": 1
        },
        {
          "value": "84f7dadfbab0f71a2860bfb696e53bd6",
          "algo": 2
        }
      ],
      "fileDate": "2017-04-15T00:13:19.57Z",
      "fileLength": 34906089,
      "downloadCount": 75,
      "downloadUrl": "https://edge.forgecdn.net/files/2407/53/JSTR_Modded_Universal.zip",
      "gameVersions": [
        "1.8.9"
      ],
      "sortableGameVersions": [
        {
          "gameVersionName": "1.8.9",
          "gameVersionPadded": "0000000001.0000000008.0000000009",
          "gameVersion": "1.8.9",
          "gameVersionReleaseDate": "2015-12-09T06:00:00Z",
          "gameVersionTypeId": 4
        }
      ],
      "dependencies": [],
      "alternateFileId": 0,
      "isServerPack": false,
      "fileFingerprint": 3412033325,
      "modules": [
        {
          "name": "pack.mcmeta",
          "fingerprint": 150540921
        },
        {
          "name": "assets",
          "fingerprint": 2318586128
        },
        {
          "name": "pack.png",
          "fingerprint": 1449310668
        },
        {
          "name": "JSTR_1.8.x_CHANGELOG.txt",
          "fingerprint": 1257552692
        },
        {
          "name": "font.txt",
          "fingerprint": 2243831094
        },
        {
          "name": "license.txt",
          "fingerprint": 3622228448
        },
        {
          "name": "ReadMe.txt",
          "fingerprint": 387904363
        }
      ]
    },
    {
      "id": 2407052,
      "gameId": 432,
      "modId": 223328,
      "isAvailable": true,
      "displayName": "JSTR Universal",
      "fileName": "JSTR_Modded_Universal.zip",
      "releaseType": 1,
      "fileStatus": 4,
      "hashes": [
        {
          "value": "4aedf4c4c77b8f64a39ceb51360e9f3fe634c7dc",
          "algo": 1
        },
        {
          "value": "5683bcf57d1289b69271a00db2c2da1e",
          "algo": 2
        }
      ],
      "fileDate": "2017-04-15T00:12:34.293Z",
      "fileLength": 177630008,
      "downloadCount": 243,
      "downloadUrl": "https://edge.forgecdn.net/files/2407/52/JSTR_Modded_Universal.zip",
      "gameVersions": [
        "1.7.10"
      ],
      "sortableGameVersions": [
        {
          "gameVersionName": "1.7.10",
          "gameVersionPadded": "0000000001.0000000007.0000000010",
          "gameVersion": "1.7.10",
          "gameVersionReleaseDate": "2014-06-16T00:00:00Z",
          "gameVersionTypeId": 5
        }
      ],
      "dependencies": [],
      "alternateFileId": 0,
      "isServerPack": false,
      "fileFingerprint": 3263585838,
      "modules": [
        {
          "name": "pack.mcmeta",
          "fingerprint": 3331342695
        },
        {
          "name": "assets",
          "fingerprint": 4137904048
        },
        {
          "name": "JOHN_SMITH_LEGACY_1.7.10_CHANGELOG.txt",
          "fingerprint": 1960649881
        },
        {
          "name": "helper_files",
          "fingerprint": 2709340199
        },
        {
          "name": "pack.png",
          "fingerprint": 1449310668
        },
        {
          "name": "font.txt",
          "fingerprint": 2243831094
        },
        {
          "name": "license.txt",
          "fingerprint": 3622228448
        },
        {
          "name": "ReadMe.txt",
          "fingerprint": 2277206236
        },
        {
          "name": "Reika",
          "fingerprint": 1980618461
        },
        {
          "name": "textures",
          "fingerprint": 489227403
        }
      ]
    },
    {
      "id": 2406282,
      "gameId": 432,
      "modId": 223328,
      "isAvailable": true,
      "displayName": "JSTR Universal",
      "fileName": "JSTR_Modded_Universal.zip",
      "releaseType": 1,
      "fileStatus": 4,
      "hashes": [
        {
          "value": "118ef0de939b9c0c69e010580fb70dd973ed84ea",
          "algo": 1
        },
        {
          "value": "cd59dd18339ed97032afbcc537f74110",
          "algo": 2
        }
      ],
      "fileDate": "2017-04-13T00:04:11.47Z",
      "fileLength": 33821645,
      "downloadCount": 109,
      "downloadUrl": "https://edge.forgecdn.net/files/2406/282/JSTR_Modded_Universal.zip",
      "gameVersions": [
        "1.9.3"
      ],
      "sortableGameVersions": [
        {
          "gameVersionName": "1.9.3",
          "gameVersionPadded": "0000000001.0000000009.0000000003",
          "gameVersion": "1.9.3",
          "gameVersionReleaseDate": "2016-05-09T05:00:00Z",
          "gameVersionTypeId": 552
        }
      ],
      "dependencies": [],
      "alternateFileId": 0,
      "isServerPack": false,
      "fileFingerprint": 1076975125,
      "modules": [
        {
          "name": "pack.mcmeta",
          "fingerprint": 3124656134
        },
        {
          "name": "assets",
          "fingerprint": 2378690372
        },
        {
          "name": "pack.png",
          "fingerprint": 1449310668
        },
        {
          "name": "font.txt",
          "fingerprint": 2243831094
        },
        {
          "name": "license.txt",
          "fingerprint": 3622228448
        },
        {
          "name": "ReadMe.txt",
          "fingerprint": 2951307156
        }
      ]
    },
    {
      "id": 2406278,
      "gameId": 432,
      "modId": 223328,
      "isAvailable": true,
      "displayName": "JSTR Universal",
      "fileName": "JSTR_Modded_Universal.zip",
      "releaseType": 1,
      "fileStatus": 4,
      "hashes": [
        {
          "value": "e4696d1c4caf724806df3950afdb7293626a1a80",
          "algo": 1
        },
        {
          "value": "8fed79aad8415c2c7d1b261943197734",
          "algo": 2
        }
      ],
      "fileDate": "2017-04-13T00:01:37.507Z",
      "fileLength": 177630008,
      "downloadCount": 209,
      "downloadUrl": "https://edge.forgecdn.net/files/2406/278/JSTR_Modded_Universal.zip",
      "gameVersions": [
        "1.7.10"
      ],
      "sortableGameVersions": [
        {
          "gameVersionName": "1.7.10",
          "gameVersionPadded": "0000000001.0000000007.0000000010",
          "gameVersion": "1.7.10",
          "gameVersionReleaseDate": "2014-06-16T00:00:00Z",
          "gameVersionTypeId": 5
        }
      ],
      "dependencies": [],
      "alternateFileId": 0,
      "isServerPack": false,
      "fileFingerprint": 4156865416,
      "modules": [
        {
          "name": "pack.mcmeta",
          "fingerprint": 1350523018
        },
        {
          "name": "assets",
          "fingerprint": 4137904048
        },
        {
          "name": "JOHN_SMITH_LEGACY_1.7.10_CHANGELOG.txt",
          "fingerprint": 1960649881
        },
        {
          "name": "helper_files",
          "fingerprint": 2709340199
        },
        {
          "name": "pack.png",
          "fingerprint": 1449310668
        },
        {
          "name": "font.txt",
          "fingerprint": 2243831094
        },
        {
          "name": "license.txt",
          "fingerprint": 3622228448
        },
        {
          "name": "ReadMe.txt",
          "fingerprint": 2277206236
        },
        {
          "name": "Reika",
          "fingerprint": 1980618461
        },
        {
          "name": "textures",
          "fingerprint": 489227403
        }
      ]
    },
    {
      "id": 2405486,
      "gameId": 432,
      "modId": 223328,
      "isAvailable": true,
      "displayName": "JSTR Universal",
      "fileName": "JSTR_Modded_Universal.zip",
      "releaseType": 1,
      "fileStatus": 4,
      "hashes": [
        {
          "value": "6102ed36e2d30a879fc60123186335e2dc5f3fce",
          "algo": 1
        },
        {
          "value": "25486a95677ce7bc775ec616d3895f9a",
          "algo": 2
        }
      ],
      "fileDate": "2017-04-11T00:03:21.607Z",
      "fileLength": 33821645,
      "downloadCount": 94,
      "downloadUrl": "https://edge.forgecdn.net/files/2405/486/JSTR_Modded_Universal.zip",
      "gameVersions": [
        "1.9.3"
      ],
      "sortableGameVersions": [
        {
          "gameVersionName": "1.9.3",
          "gameVersionPadded": "0000000001.0000000009.0000000003",
          "gameVersion": "1.9.3",
          "gameVersionReleaseDate": "2016-05-09T05:00:00Z",
          "gameVersionTypeId": 552
        }
      ],
      "dependencies": [],
      "alternateFileId": 0,
      "isServerPack": false,
      "fileFingerprint": 3065815595,
      "modules": [
        {
          "name": "pack.mcmeta",
          "fingerprint": 3124656134
        },
        {
          "name": "assets",
          "fingerprint": 2378690372
        },
        {
          "name": "pack.png",
          "fingerprint": 1449310668
        },
        {
          "name": "font.txt",
          "fingerprint": 2243831094
        },
        {
          "name": "license.txt",
          "fingerprint": 3622228448
        },
        {
          "name": "ReadMe.txt",
          "fingerprint": 2951307156
        }
      ]
    },
    {
      "id": 2405485,
      "gameId": 432,
      "modId": 223328,
      "isAvailable": true,
      "displayName": "JSTR Universal",
      "fileName": "JSTR_Modded_Universal.zip",
      "releaseType": 1,
      "fileStatus": 4,
      "hashes": [
        {
          "value": "88896602ccca3f7ac8c01068452bd092eab7a1c0",
          "algo": 1
        },
        {
          "value": "3d84196dbb41fec97fff9de032334686",
          "algo": 2
        }
      ],
      "fileDate": "2017-04-11T00:02:03.88Z",
      "fileLength": 34906089,
      "downloadCount": 86,
      "downloadUrl": "https://edge.forgecdn.net/files/2405/485/JSTR_Modded_Universal.zip",
      "gameVersions": [
        "1.8.9"
      ],
      "sortableGameVersions": [
        {
          "gameVersionName": "1.8.9",
          "gameVersionPadded": "0000000001.0000000008.0000000009",
          "gameVersion": "1.8.9",
          "gameVersionReleaseDate": "2015-12-09T06:00:00Z",
          "gameVersionTypeId": 4
        }
      ],
      "dependencies": [],
      "alternateFileId": 0,
      "isServerPack": false,
      "fileFingerprint": 1589524691,
      "modules": [
        {
          "name": "pack.mcmeta",
          "fingerprint": 150540921
        },
        {
          "name": "assets",
          "fingerprint": 2318586128
        },
        {
          "name": "pack.png",
          "fingerprint": 1449310668
        },
        {
          "name": "JSTR_1.8.x_CHANGELOG.txt",
          "fingerprint": 1257552692
        },
        {
          "name": "font.txt",
          "fingerprint": 2243831094
        },
        {
          "name": "license.txt",
          "fingerprint": 3622228448
        },
        {
          "name": "ReadMe.txt",
          "fingerprint": 387904363
        }
      ]
    },
    {
      "id": 2405484,
      "gameId": 432,
      "modId": 223328,
      "isAvailable": true,
      "displayName": "JSTR Universal",
      "fileName": "JSTR_Modded_Universal.zip",
      "releaseType": 1,
      "fileStatus": 4,
      "hashes": [
        {
          "value": "a51a7834f822f9cc40084d5623179d8ef497db5b",
          "algo": 1
        },
        {
          "value": "d15519516ef6beccd909021be40bd8f1",
          "algo": 2
        }
      ],
      "fileDate": "2017-04-11T00:00:48.733Z",
      "fileLength": 177630008,
      "downloadCount": 1035,
      "downloadUrl": "https://edge.forgecdn.net/files/2405/484/JSTR_Modded_Universal.zip",
      "gameVersions": [
        "1.7.10"
      ],
      "sortableGameVersions": [
        {
          "gameVersionName": "1.7.10",
          "gameVersionPadded": "0000000001.0000000007.0000000010",
          "gameVersion": "1.7.10",
          "gameVersionReleaseDate": "2014-06-16T00:00:00Z",
          "gameVersionTypeId": 5
        }
      ],
      "dependencies": [],
      "alternateFileId": 0,
      "isServerPack": false,
      "fileFingerprint": 2046415758,
      "modules": [
        {
          "name": "pack.mcmeta",
          "fingerprint": 818879349
        },
        {
          "name": "assets",
          "fingerprint": 4137904048
        },
        {
          "name": "JOHN_SMITH_LEGACY_1.7.10_CHANGELOG.txt",
          "fingerprint": 1960649881
        },
        {
          "name": "helper_files",
          "fingerprint": 2709340199
        },
        {
          "name": "pack.png",
          "fingerprint": 1449310668
        },
        {
          "name": "font.txt",
          "fingerprint": 2243831094
        },
        {
          "name": "license.txt",
          "fingerprint": 3622228448
        },
        {
          "name": "ReadMe.txt",
          "fingerprint": 2277206236
        },
        {
          "name": "Reika",
          "fingerprint": 1980618461
        },
        {
          "name": "textures",
          "fingerprint": 489227403
        }
      ]
    },
    {
      "id": 2404568,
      "gameId": 432,
      "modId": 223328,
      "isAvailable": true,
      "displayName": "JSTR Universal",
      "fileName": "JSTR_Modded_Universal.zip",
      "releaseType": 1,
      "fileStatus": 4,
      "hashes": [
        {
          "value": "cd005ac478b7306864585008a9efadf4c5c0bc2e",
          "algo": 1
        },
        {
          "value": "07040aa9cfda4724467cca98f4c977d0",
          "algo": 2
        }
      ],
      "fileDate": "2017-04-09T00:01:10.557Z",
      "fileLength": 33821645,
      "downloadCount": 103,
      "downloadUrl": "https://edge.forgecdn.net/files/2404/568/JSTR_Modded_Universal.zip",
      "gameVersions": [
        "1.9.3"
      ],
      "sortableGameVersions": [
        {
          "gameVersionName": "1.9.3",
          "gameVersionPadded": "0000000001.0000000009.0000000003",
          "gameVersion": "1.9.3",
          "gameVersionReleaseDate": "2016-05-09T05:00:00Z",
          "gameVersionTypeId": 552
        }
      ],
      "dependencies": [],
      "alternateFileId": 0,
      "isServerPack": false,
      "fileFingerprint": 3851260944,
      "modules": [
        {
          "name": "pack.mcmeta",
          "fingerprint": 3124656134
        },
        {
          "name": "assets",
          "fingerprint": 2378690372
        },
        {
          "name": "pack.png",
          "fingerprint": 1449310668
        },
        {
          "name": "font.txt",
          "fingerprint": 2243831094
        },
        {
          "name": "license.txt",
          "fingerprint": 3622228448
        },
        {
          "name": "ReadMe.txt",
          "fingerprint": 2951307156
        }
      ]
    },
    {
      "id": 2404564,
      "gameId": 432,
      "modId": 223328,
      "isAvailable": true,
      "displayName": "JSTR Universal",
      "fileName": "JSTR_Modded_Universal.zip",
      "releaseType": 1,
      "fileStatus": 4,
      "hashes": [
        {
          "value": "8e14802e1cba4911c3df25ca0d203671a2027f81",
          "algo": 1
        },
        {
          "value": "9c0bc2a7325b32adf4c3b3b9f0b0513c",
          "algo": 2
        }
      ],
      "fileDate": "2017-04-08T23:59:15.977Z",
      "fileLength": 177630008,
      "downloadCount": 250,
      "downloadUrl": "https://edge.forgecdn.net/files/2404/564/JSTR_Modded_Universal.zip",
      "gameVersions": [
        "1.7.10"
      ],
      "sortableGameVersions": [
        {
          "gameVersionName": "1.7.10",
          "gameVersionPadded": "0000000001.0000000007.0000000010",
          "gameVersion": "1.7.10",
          "gameVersionReleaseDate": "2014-06-16T00:00:00Z",
          "gameVersionTypeId": 5
        }
      ],
      "dependencies": [],
      "alternateFileId": 0,
      "isServerPack": false,
      "fileFingerprint": 3468480436,
      "modules": [
        {
          "name": "pack.mcmeta",
          "fingerprint": 3465874281
        },
        {
          "name": "assets",
          "fingerprint": 4137904048
        },
        {
          "name": "JOHN_SMITH_LEGACY_1.7.10_CHANGELOG.txt",
          "fingerprint": 1960649881
        },
        {
          "name": "helper_files",
          "fingerprint": 2709340199
        },
        {
          "name": "pack.png",
          "fingerprint": 1449310668
        },
        {
          "name": "font.txt",
          "fingerprint": 2243831094
        },
        {
          "name": "license.txt",
          "fingerprint": 3622228448
        },
        {
          "name": "ReadMe.txt",
          "fingerprint": 2277206236
        },
        {
          "name": "Reika",
          "fingerprint": 1980618461
        },
        {
          "name": "textures",
          "fingerprint": 489227403
        }
      ]
    },
    {
      "id": 2403730,
      "gameId": 432,
      "modId": 223328,
      "isAvailable": true,
      "displayName": "JSTR Universal",
      "fileName": "JSTR_Modded_Universal.zip",
      "releaseType": 1,
      "fileStatus": 4,
      "hashes": [
        {
          "value": "7d8f0d8b7261ee5deaa9827d63a2452ff2167ddd",
          "algo": 1
        },
        {
          "value": "2cdac9980c3083ddbf9e617b76ccda04",
          "algo": 2
        }
      ],
      "fileDate": "2017-04-07T00:24:59.097Z",
      "fileLength": 33821645,
      "downloadCount": 103,
      "downloadUrl": "https://edge.forgecdn.net/files/2403/730/JSTR_Modded_Universal.zip",
      "gameVersions": [
        "1.9.3"
      ],
      "sortableGameVersions": [
        {
          "gameVersionName": "1.9.3",
          "gameVersionPadded": "0000000001.0000000009.0000000003",
          "gameVersion": "1.9.3",
          "gameVersionReleaseDate": "2016-05-09T05:00:00Z",
          "gameVersionTypeId": 552
        }
      ],
      "dependencies": [],
      "alternateFileId": 0,
      "isServerPack": false,
      "fileFingerprint": 504767950,
      "modules": [
        {
          "name": "pack.mcmeta",
          "fingerprint": 3124656134
        },
        {
          "name": "assets",
          "fingerprint": 2378690372
        },
        {
          "name": "pack.png",
          "fingerprint": 1449310668
        },
        {
          "name": "font.txt",
          "fingerprint": 2243831094
        },
        {
          "name": "license.txt",
          "fingerprint": 3622228448
        },
        {
          "name": "ReadMe.txt",
          "fingerprint": 2951307156
        }
      ]
    },
    {
      "id": 2403728,
      "gameId": 432,
      "modId": 223328,
      "isAvailable": true,
      "displayName": "JSTR Universal",
      "fileName": "JSTR_Modded_Universal.zip",
      "releaseType": 1,
      "fileStatus": 4,
      "hashes": [
        {
          "value": "eb5e032185dbb75021614846d1336574f574e071",
          "algo": 1
        },
        {
          "value": "4a46d42c7468d53c910aa2b03ab5d6f6",
          "algo": 2
        }
      ],
      "fileDate": "2017-04-07T00:23:22.487Z",
      "fileLength": 177630008,
      "downloadCount": 225,
      "downloadUrl": "https://edge.forgecdn.net/files/2403/728/JSTR_Modded_Universal.zip",
      "gameVersions": [
        "1.7.10"
      ],
      "sortableGameVersions": [
        {
          "gameVersionName": "1.7.10",
          "gameVersionPadded": "0000000001.0000000007.0000000010",
          "gameVersion": "1.7.10",
          "gameVersionReleaseDate": "2014-06-16T00:00:00Z",
          "gameVersionTypeId": 5
        }
      ],
      "dependencies": [],
      "alternateFileId": 0,
      "isServerPack": false,
      "fileFingerprint": 785118730,
      "modules": [
        {
          "name": "pack.mcmeta",
          "fingerprint": 1403057424
        },
        {
          "name": "assets",
          "fingerprint": 4137904048
        },
        {
          "name": "JOHN_SMITH_LEGACY_1.7.10_CHANGELOG.txt",
          "fingerprint": 1960649881
        },
        {
          "name": "helper_files",
          "fingerprint": 2709340199
        },
        {
          "name": "pack.png",
          "fingerprint": 1449310668
        },
        {
          "name": "font.txt",
          "fingerprint": 2243831094
        },
        {
          "name": "license.txt",
          "fingerprint": 3622228448
        },
        {
          "name": "ReadMe.txt",
          "fingerprint": 2277206236
        },
        {
          "name": "Reika",
          "fingerprint": 1980618461
        },
        {
          "name": "textures",
          "fingerprint": 489227403
        }
      ]
    },
    {
      "id": 2402974,
      "gameId": 432,
      "modId": 223328,
      "isAvailable": true,
      "displayName": "JSTR Universal",
      "fileName": "JSTR_Modded_Universal.zip",
      "releaseType": 1,
      "fileStatus": 4,
      "hashes": [
        {
          "value": "a79276256f7a52980916026b98232fec76bf5e62",
          "algo": 1
        },
        {
          "value": "cf6f2260e64c5f33047a45a87ad03f8b",
          "algo": 2
        }
      ],
      "fileDate": "2017-04-04T23:58:51.457Z",
      "fileLength": 33821645,
      "downloadCount": 86,
      "downloadUrl": "https://edge.forgecdn.net/files/2402/974/JSTR_Modded_Universal.zip",
      "gameVersions": [
        "1.9.3"
      ],
      "sortableGameVersions": [
        {
          "gameVersionName": "1.9.3",
          "gameVersionPadded": "0000000001.0000000009.0000000003",
          "gameVersion": "1.9.3",
          "gameVersionReleaseDate": "2016-05-09T05:00:00Z",
          "gameVersionTypeId": 552
        }
      ],
      "dependencies": [],
      "alternateFileId": 0,
      "isServerPack": false,
      "fileFingerprint": 3997956565,
      "modules": [
        {
          "name": "pack.mcmeta",
          "fingerprint": 3124656134
        },
        {
          "name": "assets",
          "fingerprint": 2378690372
        },
        {
          "name": "pack.png",
          "fingerprint": 1449310668
        },
        {
          "name": "font.txt",
          "fingerprint": 2243831094
        },
        {
          "name": "license.txt",
          "fingerprint": 3622228448
        },
        {
          "name": "ReadMe.txt",
          "fingerprint": 2951307156
        }
      ]
    },
    {
      "id": 2402970,
      "gameId": 432,
      "modId": 223328,
      "isAvailable": true,
      "displayName": "JSTR Universal",
      "fileName": "JSTR_Modded_Universal.zip",
      "releaseType": 1,
      "fileStatus": 4,
      "hashes": [
        {
          "value": "95d2c9306a9abddbb2e39aa47f1e2370fe3d538c",
          "algo": 1
        },
        {
          "value": "ee9c4c6775f9403b1136bdf9ed8c0a61",
          "algo": 2
        }
      ],
      "fileDate": "2017-04-04T23:57:20.28Z",
      "fileLength": 177630008,
      "downloadCount": 227,
      "downloadUrl": "https://edge.forgecdn.net/files/2402/970/JSTR_Modded_Universal.zip",
      "gameVersions": [
        "1.7.10"
      ],
      "sortableGameVersions": [
        {
          "gameVersionName": "1.7.10",
          "gameVersionPadded": "0000000001.0000000007.0000000010",
          "gameVersion": "1.7.10",
          "gameVersionReleaseDate": "2014-06-16T00:00:00Z",
          "gameVersionTypeId": 5
        }
      ],
      "dependencies": [],
      "alternateFileId": 0,
      "isServerPack": false,
      "fileFingerprint": 4292871130,
      "modules": [
        {
          "name": "pack.mcmeta",
          "fingerprint": 1943332097
        },
        {
          "name": "assets",
          "fingerprint": 4137904048
        },
        {
          "name": "JOHN_SMITH_LEGACY_1.7.10_CHANGELOG.txt",
          "fingerprint": 1960649881
        },
        {
          "name": "helper_files",
          "fingerprint": 2709340199
        },
        {
          "name": "pack.png",
          "fingerprint": 1449310668
        },
        {
          "name": "font.txt",
          "fingerprint": 2243831094
        },
        {
          "name": "license.txt",
          "fingerprint": 3622228448
        },
        {
          "name": "ReadMe.txt",
          "fingerprint": 2277206236
        },
        {
          "name": "Reika",
          "fingerprint": 1980618461
        },
        {
          "name": "textures",
          "fingerprint": 489227403
        }
      ]
    },
    {
      "id": 2402197,
      "gameId": 432,
      "modId": 223328,
      "isAvailable": true,
      "displayName": "JSTR Universal",
      "fileName": "JSTR_Modded_Universal.zip",
      "releaseType": 1,
      "fileStatus": 4,
      "hashes": [
        {
          "value": "8796b865567aa9a4310a52476e4c672e8a208cfb",
          "algo": 1
        },
        {
          "value": "983243af1b2d80f5767feede8ecf59a2",
          "algo": 2
        }
      ],
      "fileDate": "2017-04-03T00:03:26.24Z",
      "fileLength": 33821645,
      "downloadCount": 92,
      "downloadUrl": "https://edge.forgecdn.net/files/2402/197/JSTR_Modded_Universal.zip",
      "gameVersions": [
        "1.9.3"
      ],
      "sortableGameVersions": [
        {
          "gameVersionName": "1.9.3",
          "gameVersionPadded": "0000000001.0000000009.0000000003",
          "gameVersion": "1.9.3",
          "gameVersionReleaseDate": "2016-05-09T05:00:00Z",
          "gameVersionTypeId": 552
        }
      ],
      "dependencies": [],
      "alternateFileId": 0,
      "isServerPack": false,
      "fileFingerprint": 2170816956,
      "modules": [
        {
          "name": "pack.mcmeta",
          "fingerprint": 3124656134
        },
        {
          "name": "assets",
          "fingerprint": 2378690372
        },
        {
          "name": "pack.png",
          "fingerprint": 1449310668
        },
        {
          "name": "font.txt",
          "fingerprint": 2243831094
        },
        {
          "name": "license.txt",
          "fingerprint": 3622228448
        },
        {
          "name": "ReadMe.txt",
          "fingerprint": 2951307156
        }
      ]
    },
    {
      "id": 2402196,
      "gameId": 432,
      "modId": 223328,
      "isAvailable": true,
      "displayName": "JSTR Universal",
      "fileName": "JSTR_Modded_Universal.zip",
      "releaseType": 1,
      "fileStatus": 4,
      "hashes": [
        {
          "value": "b630263dc0af783601211e326da54f4e35c4aaf9",
          "algo": 1
        },
        {
          "value": "23980a3082531b2b480d63b5e2ed22a7",
          "algo": 2
        }
      ],
      "fileDate": "2017-04-03T00:02:17.65Z",
      "fileLength": 34906089,
      "downloadCount": 98,
      "downloadUrl": "https://edge.forgecdn.net/files/2402/196/JSTR_Modded_Universal.zip",
      "gameVersions": [
        "1.8.9"
      ],
      "sortableGameVersions": [
        {
          "gameVersionName": "1.8.9",
          "gameVersionPadded": "0000000001.0000000008.0000000009",
          "gameVersion": "1.8.9",
          "gameVersionReleaseDate": "2015-12-09T06:00:00Z",
          "gameVersionTypeId": 4
        }
      ],
      "dependencies": [],
      "alternateFileId": 0,
      "isServerPack": false,
      "fileFingerprint": 2552330712,
      "modules": [
        {
          "name": "pack.mcmeta",
          "fingerprint": 150540921
        },
        {
          "name": "assets",
          "fingerprint": 2318586128
        },
        {
          "name": "pack.png",
          "fingerprint": 1449310668
        },
        {
          "name": "JSTR_1.8.x_CHANGELOG.txt",
          "fingerprint": 1257552692
        },
        {
          "name": "font.txt",
          "fingerprint": 2243831094
        },
        {
          "name": "license.txt",
          "fingerprint": 3622228448
        },
        {
          "name": "ReadMe.txt",
          "fingerprint": 387904363
        }
      ]
    },
    {
      "id": 2402195,
      "gameId": 432,
      "modId": 223328,
      "isAvailable": true,
      "displayName": "JSTR Universal",
      "fileName": "JSTR_Modded_Universal.zip",
      "releaseType": 1,
      "fileStatus": 4,
      "hashes": [
        {
          "value": "7365e768ca5919d6a9112767af4b0763038c2184",
          "algo": 1
        },
        {
          "value": "03958953df99ca9ef1ceb51cc3001adc",
          "algo": 2
        }
      ],
      "fileDate": "2017-04-03T00:01:07.593Z",
      "fileLength": 177630008,
      "downloadCount": 186,
      "downloadUrl": "https://edge.forgecdn.net/files/2402/195/JSTR_Modded_Universal.zip",
      "gameVersions": [
        "1.7.10"
      ],
      "sortableGameVersions": [
        {
          "gameVersionName": "1.7.10",
          "gameVersionPadded": "0000000001.0000000007.0000000010",
          "gameVersion": "1.7.10",
          "gameVersionReleaseDate": "2014-06-16T00:00:00Z",
          "gameVersionTypeId": 5
        }
      ],
      "dependencies": [],
      "alternateFileId": 0,
      "isServerPack": false,
      "fileFingerprint": 2197816513,
      "modules": [
        {
          "name": "pack.mcmeta",
          "fingerprint": 3453134407
        },
        {
          "name": "assets",
          "fingerprint": 4137904048
        },
        {
          "name": "JOHN_SMITH_LEGACY_1.7.10_CHANGELOG.txt",
          "fingerprint": 1960649881
        },
        {
          "name": "helper_files",
          "fingerprint": 2709340199
        },
        {
          "name": "pack.png",
          "fingerprint": 1449310668
        },
        {
          "name": "font.txt",
          "fingerprint": 2243831094
        },
        {
          "name": "license.txt",
          "fingerprint": 3622228448
        },
        {
          "name": "ReadMe.txt",
          "fingerprint": 2277206236
        },
        {
          "name": "Reika",
          "fingerprint": 1980618461
        },
        {
          "name": "textures",
          "fingerprint": 489227403
        }
      ]
    },
    {
      "id": 2401095,
      "gameId": 432,
      "modId": 223328,
      "isAvailable": true,
      "displayName": "JSTR Universal",
      "fileName": "JSTR_Modded_Universal.zip",
      "releaseType": 1,
      "fileStatus": 4,
      "hashes": [
        {
          "value": "fd757c6256235f05c448fd71a5fe5161b01eea70",
          "algo": 1
        },
        {
          "value": "8c40601105bae0be29e08b2ff903df36",
          "algo": 2
        }
      ],
      "fileDate": "2017-04-01T00:20:17.903Z",
      "fileLength": 33821645,
      "downloadCount": 91,
      "downloadUrl": "https://edge.forgecdn.net/files/2401/95/JSTR_Modded_Universal.zip",
      "gameVersions": [
        "1.9.3"
      ],
      "sortableGameVersions": [
        {
          "gameVersionName": "1.9.3",
          "gameVersionPadded": "0000000001.0000000009.0000000003",
          "gameVersion": "1.9.3",
          "gameVersionReleaseDate": "2016-05-09T05:00:00Z",
          "gameVersionTypeId": 552
        }
      ],
      "dependencies": [],
      "alternateFileId": 0,
      "isServerPack": false,
      "fileFingerprint": 354022183,
      "modules": [
        {
          "name": "pack.mcmeta",
          "fingerprint": 3124656134
        },
        {
          "name": "assets",
          "fingerprint": 2378690372
        },
        {
          "name": "pack.png",
          "fingerprint": 1449310668
        },
        {
          "name": "font.txt",
          "fingerprint": 2243831094
        },
        {
          "name": "license.txt",
          "fingerprint": 3622228448
        },
        {
          "name": "ReadMe.txt",
          "fingerprint": 2951307156
        }
      ]
    },
    {
      "id": 2401094,
      "gameId": 432,
      "modId": 223328,
      "isAvailable": true,
      "displayName": "JSTR Universal",
      "fileName": "JSTR_Modded_Universal.zip",
      "releaseType": 1,
      "fileStatus": 4,
      "hashes": [
        {
          "value": "cdb23729f175ede5d9346c6869574e741dce2fff",
          "algo": 1
        },
        {
          "value": "f9a9f68da2d3c32d564b5e5ad3a20496",
          "algo": 2
        }
      ],
      "fileDate": "2017-04-01T00:19:44.647Z",
      "fileLength": 34906089,
      "downloadCount": 51,
      "downloadUrl": "https://edge.forgecdn.net/files/2401/94/JSTR_Modded_Universal.zip",
      "gameVersions": [
        "1.8.9"
      ],
      "sortableGameVersions": [
        {
          "gameVersionName": "1.8.9",
          "gameVersionPadded": "0000000001.0000000008.0000000009",
          "gameVersion": "1.8.9",
          "gameVersionReleaseDate": "2015-12-09T06:00:00Z",
          "gameVersionTypeId": 4
        }
      ],
      "dependencies": [],
      "alternateFileId": 0,
      "isServerPack": false,
      "fileFingerprint": 851292708,
      "modules": [
        {
          "name": "pack.mcmeta",
          "fingerprint": 150540921
        },
        {
          "name": "assets",
          "fingerprint": 2318586128
        },
        {
          "name": "pack.png",
          "fingerprint": 1449310668
        },
        {
          "name": "JSTR_1.8.x_CHANGELOG.txt",
          "fingerprint": 1257552692
        },
        {
          "name": "font.txt",
          "fingerprint": 2243831094
        },
        {
          "name": "license.txt",
          "fingerprint": 3622228448
        },
        {
          "name": "ReadMe.txt",
          "fingerprint": 387904363
        }
      ]
    },
    {
      "id": 2401093,
      "gameId": 432,
      "modId": 223328,
      "isAvailable": true,
      "displayName": "JSTR Universal",
      "fileName": "JSTR_Modded_Universal.zip",
      "releaseType": 1,
      "fileStatus": 4,
      "hashes": [
        {
          "value": "580386a0b25bb1cc648a89c9489ca2970ea15805",
          "algo": 1
        },
        {
          "value": "5899afee638647acaaa96370ac65ca44",
          "algo": 2
        }
      ],
      "fileDate": "2017-04-01T00:18:59.997Z",
      "fileLength": 177630008,
      "downloadCount": 220,
      "downloadUrl": "https://edge.forgecdn.net/files/2401/93/JSTR_Modded_Universal.zip",
      "gameVersions": [
        "1.7.10"
      ],
      "sortableGameVersions": [
        {
          "gameVersionName": "1.7.10",
          "gameVersionPadded": "0000000001.0000000007.0000000010",
          "gameVersion": "1.7.10",
          "gameVersionReleaseDate": "2014-06-16T00:00:00Z",
          "gameVersionTypeId": 5
        }
      ],
      "dependencies": [],
      "alternateFileId": 0,
      "isServerPack": false,
      "fileFingerprint": 1551690573,
      "modules": [
        {
          "name": "pack.mcmeta",
          "fingerprint": 2831436462
        },
        {
          "name": "assets",
          "fingerprint": 4137904048
        },
        {
          "name": "JOHN_SMITH_LEGACY_1.7.10_CHANGELOG.txt",
          "fingerprint": 1960649881
        },
        {
          "name": "helper_files",
          "fingerprint": 2709340199
        },
        {
          "name": "pack.png",
          "fingerprint": 1449310668
        },
        {
          "name": "font.txt",
          "fingerprint": 2243831094
        },
        {
          "name": "license.txt",
          "fingerprint": 3622228448
        },
        {
          "name": "ReadMe.txt",
          "fingerprint": 2277206236
        },
        {
          "name": "Reika",
          "fingerprint": 1980618461
        },
        {
          "name": "textures",
          "fingerprint": 489227403
        }
      ]
    },
    {
      "id": 2400585,
      "gameId": 432,
      "modId": 223328,
      "isAvailable": true,
      "displayName": "JSTR Universal",
      "fileName": "JSTR_Modded_Universal.zip",
      "releaseType": 1,
      "fileStatus": 4,
      "hashes": [
        {
          "value": "2b618b856a1543203ae9ea751a9c0b79d8d2c8ad",
          "algo": 1
        },
        {
          "value": "eda8c7afeef98f2583b1e5a5fa5537f2",
          "algo": 2
        }
      ],
      "fileDate": "2017-03-31T00:18:23.287Z",
      "fileLength": 33821645,
      "downloadCount": 86,
      "downloadUrl": "https://edge.forgecdn.net/files/2400/585/JSTR_Modded_Universal.zip",
      "gameVersions": [
        "1.9.3"
      ],
      "sortableGameVersions": [
        {
          "gameVersionName": "1.9.3",
          "gameVersionPadded": "0000000001.0000000009.0000000003",
          "gameVersion": "1.9.3",
          "gameVersionReleaseDate": "2016-05-09T05:00:00Z",
          "gameVersionTypeId": 552
        }
      ],
      "dependencies": [],
      "alternateFileId": 0,
      "isServerPack": false,
      "fileFingerprint": 1949470379,
      "modules": [
        {
          "name": "pack.mcmeta",
          "fingerprint": 3124656134
        },
        {
          "name": "assets",
          "fingerprint": 2378690372
        },
        {
          "name": "pack.png",
          "fingerprint": 1449310668
        },
        {
          "name": "font.txt",
          "fingerprint": 2243831094
        },
        {
          "name": "license.txt",
          "fingerprint": 3622228448
        },
        {
          "name": "ReadMe.txt",
          "fingerprint": 2951307156
        }
      ]
    },
    {
      "id": 2400584,
      "gameId": 432,
      "modId": 223328,
      "isAvailable": true,
      "displayName": "JSTR Universal",
      "fileName": "JSTR_Modded_Universal.zip",
      "releaseType": 1,
      "fileStatus": 4,
      "hashes": [
        {
          "value": "c873f89c5652d7154b08e62b648004c4824ee4f3",
          "algo": 1
        },
        {
          "value": "e91f5da2a2618abbcb99ececc64433c7",
          "algo": 2
        }
      ],
      "fileDate": "2017-03-31T00:17:20.533Z",
      "fileLength": 34906089,
      "downloadCount": 49,
      "downloadUrl": "https://edge.forgecdn.net/files/2400/584/JSTR_Modded_Universal.zip",
      "gameVersions": [
        "1.8.9"
      ],
      "sortableGameVersions": [
        {
          "gameVersionName": "1.8.9",
          "gameVersionPadded": "0000000001.0000000008.0000000009",
          "gameVersion": "1.8.9",
          "gameVersionReleaseDate": "2015-12-09T06:00:00Z",
          "gameVersionTypeId": 4
        }
      ],
      "dependencies": [],
      "alternateFileId": 0,
      "isServerPack": false,
      "fileFingerprint": 675682468,
      "modules": [
        {
          "name": "pack.mcmeta",
          "fingerprint": 150540921
        },
        {
          "name": "assets",
          "fingerprint": 2318586128
        },
        {
          "name": "pack.png",
          "fingerprint": 1449310668
        },
        {
          "name": "JSTR_1.8.x_CHANGELOG.txt",
          "fingerprint": 1257552692
        },
        {
          "name": "font.txt",
          "fingerprint": 2243831094
        },
        {
          "name": "license.txt",
          "fingerprint": 3622228448
        },
        {
          "name": "ReadMe.txt",
          "fingerprint": 387904363
        }
      ]
    },
    {
      "id": 2400583,
      "gameId": 432,
      "modId": 223328,
      "isAvailable": true,
      "displayName": "JSTR Universal",
      "fileName": "JSTR_Modded_Universal.zip",
      "releaseType": 1,
      "fileStatus": 4,
      "hashes": [
        {
          "value": "c5a43bc26d906cc81c60a49ef109176a465e25da",
          "algo": 1
        },
        {
          "value": "12988717235ba9d91c4ccbd81b99ec03",
          "algo": 2
        }
      ],
      "fileDate": "2017-03-31T00:16:19.93Z",
      "fileLength": 177630008,
      "downloadCount": 150,
      "downloadUrl": "https://edge.forgecdn.net/files/2400/583/JSTR_Modded_Universal.zip",
      "gameVersions": [
        "1.7.10"
      ],
      "sortableGameVersions": [
        {
          "gameVersionName": "1.7.10",
          "gameVersionPadded": "0000000001.0000000007.0000000010",
          "gameVersion": "1.7.10",
          "gameVersionReleaseDate": "2014-06-16T00:00:00Z",
          "gameVersionTypeId": 5
        }
      ],
      "dependencies": [],
      "alternateFileId": 0,
      "isServerPack": false,
      "fileFingerprint": 1565275254,
      "modules": [
        {
          "name": "pack.mcmeta",
          "fingerprint": 2370399787
        },
        {
          "name": "assets",
          "fingerprint": 4137904048
        },
        {
          "name": "JOHN_SMITH_LEGACY_1.7.10_CHANGELOG.txt",
          "fingerprint": 1960649881
        },
        {
          "name": "helper_files",
          "fingerprint": 2709340199
        },
        {
          "name": "pack.png",
          "fingerprint": 1449310668
        },
        {
          "name": "font.txt",
          "fingerprint": 2243831094
        },
        {
          "name": "license.txt",
          "fingerprint": 3622228448
        },
        {
          "name": "ReadMe.txt",
          "fingerprint": 2277206236
        },
        {
          "name": "Reika",
          "fingerprint": 1980618461
        },
        {
          "name": "textures",
          "fingerprint": 489227403
        }
      ]
    },
    {
      "id": 2399107,
      "gameId": 432,
      "modId": 223328,
      "isAvailable": true,
      "displayName": "JSTR Universal",
      "fileName": "JSTR_Modded_Universal.zip",
      "releaseType": 1,
      "fileStatus": 4,
      "hashes": [
        {
          "value": "9e0d6929d346feaa1ccb52972fa98da68d34e98c",
          "algo": 1
        },
        {
          "value": "212cc229c65f4ba692d60a58952f863e",
          "algo": 2
        }
      ],
      "fileDate": "2017-03-29T00:18:34.74Z",
      "fileLength": 34906089,
      "downloadCount": 157,
      "downloadUrl": "https://edge.forgecdn.net/files/2399/107/JSTR_Modded_Universal.zip",
      "gameVersions": [
        "1.8.9"
      ],
      "sortableGameVersions": [
        {
          "gameVersionName": "1.8.9",
          "gameVersionPadded": "0000000001.0000000008.0000000009",
          "gameVersion": "1.8.9",
          "gameVersionReleaseDate": "2015-12-09T06:00:00Z",
          "gameVersionTypeId": 4
        }
      ],
      "dependencies": [],
      "alternateFileId": 0,
      "isServerPack": false,
      "fileFingerprint": 3600936449,
      "modules": [
        {
          "name": "pack.mcmeta",
          "fingerprint": 150540921
        },
        {
          "name": "assets",
          "fingerprint": 2318586128
        },
        {
          "name": "pack.png",
          "fingerprint": 1449310668
        },
        {
          "name": "JSTR_1.8.x_CHANGELOG.txt",
          "fingerprint": 1257552692
        },
        {
          "name": "font.txt",
          "fingerprint": 2243831094
        },
        {
          "name": "license.txt",
          "fingerprint": 3622228448
        },
        {
          "name": "ReadMe.txt",
          "fingerprint": 387904363
        }
      ]
    },
    {
      "id": 2399106,
      "gameId": 432,
      "modId": 223328,
      "isAvailable": true,
      "displayName": "JSTR Universal",
      "fileName": "JSTR_Modded_Universal.zip",
      "releaseType": 1,
      "fileStatus": 4,
      "hashes": [
        {
          "value": "6c874ec1b1343c1da6c966ae71f328e293f19350",
          "algo": 1
        },
        {
          "value": "9a62caf1e191a221f556065a1a2988cf",
          "algo": 2
        }
      ],
      "fileDate": "2017-03-29T00:17:33.167Z",
      "fileLength": 177630008,
      "downloadCount": 239,
      "downloadUrl": "https://edge.forgecdn.net/files/2399/106/JSTR_Modded_Universal.zip",
      "gameVersions": [
        "1.7.10"
      ],
      "sortableGameVersions": [
        {
          "gameVersionName": "1.7.10",
          "gameVersionPadded": "0000000001.0000000007.0000000010",
          "gameVersion": "1.7.10",
          "gameVersionReleaseDate": "2014-06-16T00:00:00Z",
          "gameVersionTypeId": 5
        }
      ],
      "dependencies": [],
      "alternateFileId": 0,
      "isServerPack": false,
      "fileFingerprint": 3682587108,
      "modules": [
        {
          "name": "pack.mcmeta",
          "fingerprint": 4206014779
        },
        {
          "name": "assets",
          "fingerprint": 4137904048
        },
        {
          "name": "JOHN_SMITH_LEGACY_1.7.10_CHANGELOG.txt",
          "fingerprint": 1960649881
        },
        {
          "name": "helper_files",
          "fingerprint": 2709340199
        },
        {
          "name": "pack.png",
          "fingerprint": 1449310668
        },
        {
          "name": "font.txt",
          "fingerprint": 2243831094
        },
        {
          "name": "license.txt",
          "fingerprint": 3622228448
        },
        {
          "name": "ReadMe.txt",
          "fingerprint": 2277206236
        },
        {
          "name": "Reika",
          "fingerprint": 1980618461
        },
        {
          "name": "textures",
          "fingerprint": 489227403
        }
      ]
    },
    {
      "id": 2397719,
      "gameId": 432,
      "modId": 223328,
      "isAvailable": true,
      "displayName": "JSTR Universal",
      "fileName": "JSTR_Modded_Universal.zip",
      "releaseType": 1,
      "fileStatus": 4,
      "hashes": [
        {
          "value": "18ba6fa145550c7a0afb532c4e5e2ed4de18a19b",
          "algo": 1
        },
        {
          "value": "29559eb7424a5909310991fec426dabb",
          "algo": 2
        }
      ],
      "fileDate": "2017-03-27T00:26:30.867Z",
      "fileLength": 34906089,
      "downloadCount": 114,
      "downloadUrl": "https://edge.forgecdn.net/files/2397/719/JSTR_Modded_Universal.zip",
      "gameVersions": [
        "1.8.9"
      ],
      "sortableGameVersions": [
        {
          "gameVersionName": "1.8.9",
          "gameVersionPadded": "0000000001.0000000008.0000000009",
          "gameVersion": "1.8.9",
          "gameVersionReleaseDate": "2015-12-09T06:00:00Z",
          "gameVersionTypeId": 4
        }
      ],
      "dependencies": [],
      "alternateFileId": 0,
      "isServerPack": false,
      "fileFingerprint": 4290423076,
      "modules": [
        {
          "name": "pack.mcmeta",
          "fingerprint": 150540921
        },
        {
          "name": "assets",
          "fingerprint": 2318586128
        },
        {
          "name": "pack.png",
          "fingerprint": 1449310668
        },
        {
          "name": "JSTR_1.8.x_CHANGELOG.txt",
          "fingerprint": 1257552692
        },
        {
          "name": "font.txt",
          "fingerprint": 2243831094
        },
        {
          "name": "license.txt",
          "fingerprint": 3622228448
        },
        {
          "name": "ReadMe.txt",
          "fingerprint": 387904363
        }
      ]
    },
    {
      "id": 2397718,
      "gameId": 432,
      "modId": 223328,
      "isAvailable": true,
      "displayName": "JSTR Universal",
      "fileName": "JSTR_Modded_Universal.zip",
      "releaseType": 1,
      "fileStatus": 4,
      "hashes": [
        {
          "value": "97d8d03c37be8617f4ddfda52057d6628d96ad02",
          "algo": 1
        },
        {
          "value": "26760c5a184f3054a678a092a47c7348",
          "algo": 2
        }
      ],
      "fileDate": "2017-03-27T00:25:37.64Z",
      "fileLength": 177630008,
      "downloadCount": 220,
      "downloadUrl": "https://edge.forgecdn.net/files/2397/718/JSTR_Modded_Universal.zip",
      "gameVersions": [
        "1.7.10"
      ],
      "sortableGameVersions": [
        {
          "gameVersionName": "1.7.10",
          "gameVersionPadded": "0000000001.0000000007.0000000010",
          "gameVersion": "1.7.10",
          "gameVersionReleaseDate": "2014-06-16T00:00:00Z",
          "gameVersionTypeId": 5
        }
      ],
      "dependencies": [],
      "alternateFileId": 0,
      "isServerPack": false,
      "fileFingerprint": 3491950842,
      "modules": [
        {
          "name": "pack.mcmeta",
          "fingerprint": 1608142522
        },
        {
          "name": "assets",
          "fingerprint": 4137904048
        },
        {
          "name": "JOHN_SMITH_LEGACY_1.7.10_CHANGELOG.txt",
          "fingerprint": 1960649881
        },
        {
          "name": "helper_files",
          "fingerprint": 2709340199
        },
        {
          "name": "pack.png",
          "fingerprint": 1449310668
        },
        {
          "name": "font.txt",
          "fingerprint": 2243831094
        },
        {
          "name": "license.txt",
          "fingerprint": 3622228448
        },
        {
          "name": "ReadMe.txt",
          "fingerprint": 2277206236
        },
        {
          "name": "Reika",
          "fingerprint": 1980618461
        },
        {
          "name": "textures",
          "fingerprint": 489227403
        }
      ]
    },
    {
      "id": 2396979,
      "gameId": 432,
      "modId": 223328,
      "isAvailable": true,
      "displayName": "JSTR Universal",
      "fileName": "JSTR_Modded_Universal.zip",
      "releaseType": 1,
      "fileStatus": 4,
      "hashes": [
        {
          "value": "0c98403b56ed16ef967e5a6e1fb1153f6289a3dd",
          "algo": 1
        },
        {
          "value": "4327175689090cfb776bcd0daf4cf08b",
          "algo": 2
        }
      ],
      "fileDate": "2017-03-25T01:23:13.093Z",
      "fileLength": 33821645,
      "downloadCount": 130,
      "downloadUrl": "https://edge.forgecdn.net/files/2396/979/JSTR_Modded_Universal.zip",
      "gameVersions": [
        "1.9.3"
      ],
      "sortableGameVersions": [
        {
          "gameVersionName": "1.9.3",
          "gameVersionPadded": "0000000001.0000000009.0000000003",
          "gameVersion": "1.9.3",
          "gameVersionReleaseDate": "2016-05-09T05:00:00Z",
          "gameVersionTypeId": 552
        }
      ],
      "dependencies": [],
      "alternateFileId": 0,
      "isServerPack": false,
      "fileFingerprint": 3220003627,
      "modules": [
        {
          "name": "pack.mcmeta",
          "fingerprint": 3124656134
        },
        {
          "name": "assets",
          "fingerprint": 2378690372
        },
        {
          "name": "pack.png",
          "fingerprint": 1449310668
        },
        {
          "name": "font.txt",
          "fingerprint": 2243831094
        },
        {
          "name": "license.txt",
          "fingerprint": 3622228448
        },
        {
          "name": "ReadMe.txt",
          "fingerprint": 2951307156
        }
      ]
    },
    {
      "id": 2396977,
      "gameId": 432,
      "modId": 223328,
      "isAvailable": true,
      "displayName": "JSTR Universal",
      "fileName": "JSTR_Modded_Universal.zip",
      "releaseType": 1,
      "fileStatus": 4,
      "hashes": [
        {
          "value": "687835c209094bb1b9d802a74fb6cf6d2ccf5966",
          "algo": 1
        },
        {
          "value": "3bd031bd6607c5c13a72fc9095284467",
          "algo": 2
        }
      ],
      "fileDate": "2017-03-25T01:21:10.163Z",
      "fileLength": 177630008,
      "downloadCount": 237,
      "downloadUrl": "https://edge.forgecdn.net/files/2396/977/JSTR_Modded_Universal.zip",
      "gameVersions": [
        "1.7.10"
      ],
      "sortableGameVersions": [
        {
          "gameVersionName": "1.7.10",
          "gameVersionPadded": "0000000001.0000000007.0000000010",
          "gameVersion": "1.7.10",
          "gameVersionReleaseDate": "2014-06-16T00:00:00Z",
          "gameVersionTypeId": 5
        }
      ],
      "dependencies": [],
      "alternateFileId": 0,
      "isServerPack": false,
      "fileFingerprint": 4195517128,
      "modules": [
        {
          "name": "pack.mcmeta",
          "fingerprint": 3036244444
        },
        {
          "name": "assets",
          "fingerprint": 4137904048
        },
        {
          "name": "JOHN_SMITH_LEGACY_1.7.10_CHANGELOG.txt",
          "fingerprint": 1960649881
        },
        {
          "name": "helper_files",
          "fingerprint": 2709340199
        },
        {
          "name": "pack.png",
          "fingerprint": 1449310668
        },
        {
          "name": "font.txt",
          "fingerprint": 2243831094
        },
        {
          "name": "license.txt",
          "fingerprint": 3622228448
        },
        {
          "name": "ReadMe.txt",
          "fingerprint": 2277206236
        },
        {
          "name": "Reika",
          "fingerprint": 1980618461
        },
        {
          "name": "textures",
          "fingerprint": 489227403
        }
      ]
    },
    {
      "id": 2396332,
      "gameId": 432,
      "modId": 223328,
      "isAvailable": true,
      "displayName": "JSTR Universal",
      "fileName": "JSTR_Modded_Universal.zip",
      "releaseType": 1,
      "fileStatus": 4,
      "hashes": [
        {
          "value": "5ec526fd999b31855823e711612eb6e4e3558f1d",
          "algo": 1
        },
        {
          "value": "a14ca691c17188ee1a7b9ef4954adcf4",
          "algo": 2
        }
      ],
      "fileDate": "2017-03-23T01:23:56.867Z",
      "fileLength": 33821645,
      "downloadCount": 111,
      "downloadUrl": "https://edge.forgecdn.net/files/2396/332/JSTR_Modded_Universal.zip",
      "gameVersions": [
        "1.9.3"
      ],
      "sortableGameVersions": [
        {
          "gameVersionName": "1.9.3",
          "gameVersionPadded": "0000000001.0000000009.0000000003",
          "gameVersion": "1.9.3",
          "gameVersionReleaseDate": "2016-05-09T05:00:00Z",
          "gameVersionTypeId": 552
        }
      ],
      "dependencies": [],
      "alternateFileId": 0,
      "isServerPack": false,
      "fileFingerprint": 3897868245,
      "modules": [
        {
          "name": "pack.mcmeta",
          "fingerprint": 3124656134
        },
        {
          "name": "assets",
          "fingerprint": 2378690372
        },
        {
          "name": "pack.png",
          "fingerprint": 1449310668
        },
        {
          "name": "font.txt",
          "fingerprint": 2243831094
        },
        {
          "name": "license.txt",
          "fingerprint": 3622228448
        },
        {
          "name": "ReadMe.txt",
          "fingerprint": 2951307156
        }
      ]
    },
    {
      "id": 2396330,
      "gameId": 432,
      "modId": 223328,
      "isAvailable": true,
      "displayName": "JSTR Universal",
      "fileName": "JSTR_Modded_Universal.zip",
      "releaseType": 1,
      "fileStatus": 4,
      "hashes": [
        {
          "value": "a8a0b2c4b6ac20505d4d0b90fe1cd98f58b9a4ea",
          "algo": 1
        },
        {
          "value": "2711788f42e8b61fbbdd17cc635ca6ee",
          "algo": 2
        }
      ],
      "fileDate": "2017-03-23T01:22:07.573Z",
      "fileLength": 177630006,
      "downloadCount": 213,
      "downloadUrl": "https://edge.forgecdn.net/files/2396/330/JSTR_Modded_Universal.zip",
      "gameVersions": [
        "1.7.10"
      ],
      "sortableGameVersions": [
        {
          "gameVersionName": "1.7.10",
          "gameVersionPadded": "0000000001.0000000007.0000000010",
          "gameVersion": "1.7.10",
          "gameVersionReleaseDate": "2014-06-16T00:00:00Z",
          "gameVersionTypeId": 5
        }
      ],
      "dependencies": [],
      "alternateFileId": 0,
      "isServerPack": false,
      "fileFingerprint": 3316230094,
      "modules": [
        {
          "name": "pack.mcmeta",
          "fingerprint": 3750545326
        },
        {
          "name": "assets",
          "fingerprint": 4137904048
        },
        {
          "name": "JOHN_SMITH_LEGACY_1.7.10_CHANGELOG.txt",
          "fingerprint": 1960649881
        },
        {
          "name": "helper_files",
          "fingerprint": 2709340199
        },
        {
          "name": "pack.png",
          "fingerprint": 1449310668
        },
        {
          "name": "font.txt",
          "fingerprint": 2243831094
        },
        {
          "name": "license.txt",
          "fingerprint": 3622228448
        },
        {
          "name": "ReadMe.txt",
          "fingerprint": 2277206236
        },
        {
          "name": "Reika",
          "fingerprint": 1980618461
        },
        {
          "name": "textures",
          "fingerprint": 489227403
        }
      ]
    },
    {
      "id": 2395604,
      "gameId": 432,
      "modId": 223328,
      "isAvailable": true,
      "displayName": "JSTR Universal",
      "fileName": "JSTR_Modded_Universal.zip",
      "releaseType": 1,
      "fileStatus": 4,
      "hashes": [
        {
          "value": "14cd1c3a998ae38f4002bde891ba836129dfd2e0",
          "algo": 1
        },
        {
          "value": "9993d3d0c8fe1c305a91d54107850794",
          "algo": 2
        }
      ],
      "fileDate": "2017-03-21T01:26:53.127Z",
      "fileLength": 33821645,
      "downloadCount": 180,
      "downloadUrl": "https://edge.forgecdn.net/files/2395/604/JSTR_Modded_Universal.zip",
      "gameVersions": [
        "1.9.3"
      ],
      "sortableGameVersions": [
        {
          "gameVersionName": "1.9.3",
          "gameVersionPadded": "0000000001.0000000009.0000000003",
          "gameVersion": "1.9.3",
          "gameVersionReleaseDate": "2016-05-09T05:00:00Z",
          "gameVersionTypeId": 552
        }
      ],
      "dependencies": [],
      "alternateFileId": 0,
      "isServerPack": false,
      "fileFingerprint": 3654916065,
      "modules": [
        {
          "name": "pack.mcmeta",
          "fingerprint": 3124656134
        },
        {
          "name": "assets",
          "fingerprint": 2378690372
        },
        {
          "name": "pack.png",
          "fingerprint": 1449310668
        },
        {
          "name": "font.txt",
          "fingerprint": 2243831094
        },
        {
          "name": "license.txt",
          "fingerprint": 3622228448
        },
        {
          "name": "ReadMe.txt",
          "fingerprint": 2951307156
        }
      ]
    },
    {
      "id": 2395603,
      "gameId": 432,
      "modId": 223328,
      "isAvailable": true,
      "displayName": "JSTR Universal",
      "fileName": "JSTR_Modded_Universal.zip",
      "releaseType": 1,
      "fileStatus": 4,
      "hashes": [
        {
          "value": "89b273df2375321255a26fc09bdb3c1a662b6822",
          "algo": 1
        },
        {
          "value": "eac12dc7d0125361c83285c6b38d5d43",
          "algo": 2
        }
      ],
      "fileDate": "2017-03-21T01:25:57.563Z",
      "fileLength": 34906089,
      "downloadCount": 60,
      "downloadUrl": "https://edge.forgecdn.net/files/2395/603/JSTR_Modded_Universal.zip",
      "gameVersions": [
        "1.8.9"
      ],
      "sortableGameVersions": [
        {
          "gameVersionName": "1.8.9",
          "gameVersionPadded": "0000000001.0000000008.0000000009",
          "gameVersion": "1.8.9",
          "gameVersionReleaseDate": "2015-12-09T06:00:00Z",
          "gameVersionTypeId": 4
        }
      ],
      "dependencies": [],
      "alternateFileId": 0,
      "isServerPack": false,
      "fileFingerprint": 1865053434,
      "modules": [
        {
          "name": "pack.mcmeta",
          "fingerprint": 150540921
        },
        {
          "name": "assets",
          "fingerprint": 2318586128
        },
        {
          "name": "pack.png",
          "fingerprint": 1449310668
        },
        {
          "name": "JSTR_1.8.x_CHANGELOG.txt",
          "fingerprint": 1257552692
        },
        {
          "name": "font.txt",
          "fingerprint": 2243831094
        },
        {
          "name": "license.txt",
          "fingerprint": 3622228448
        },
        {
          "name": "ReadMe.txt",
          "fingerprint": 387904363
        }
      ]
    },
    {
      "id": 2395602,
      "gameId": 432,
      "modId": 223328,
      "isAvailable": true,
      "displayName": "JSTR Universal",
      "fileName": "JSTR_Modded_Universal.zip",
      "releaseType": 1,
      "fileStatus": 4,
      "hashes": [
        {
          "value": "5142d06e88ceb0b9408ee703b96a81419ebbb463",
          "algo": 1
        },
        {
          "value": "4637133e6c15196a99b9f6fae92b0282",
          "algo": 2
        }
      ],
      "fileDate": "2017-03-21T01:25:14.883Z",
      "fileLength": 177630008,
      "downloadCount": 170,
      "downloadUrl": "https://edge.forgecdn.net/files/2395/602/JSTR_Modded_Universal.zip",
      "gameVersions": [
        "1.7.10"
      ],
      "sortableGameVersions": [
        {
          "gameVersionName": "1.7.10",
          "gameVersionPadded": "0000000001.0000000007.0000000010",
          "gameVersion": "1.7.10",
          "gameVersionReleaseDate": "2014-06-16T00:00:00Z",
          "gameVersionTypeId": 5
        }
      ],
      "dependencies": [],
      "alternateFileId": 0,
      "isServerPack": false,
      "fileFingerprint": 2954657673,
      "modules": [
        {
          "name": "pack.mcmeta",
          "fingerprint": 1700693465
        },
        {
          "name": "assets",
          "fingerprint": 4137904048
        },
        {
          "name": "JOHN_SMITH_LEGACY_1.7.10_CHANGELOG.txt",
          "fingerprint": 1960649881
        },
        {
          "name": "helper_files",
          "fingerprint": 2709340199
        },
        {
          "name": "pack.png",
          "fingerprint": 1449310668
        },
        {
          "name": "font.txt",
          "fingerprint": 2243831094
        },
        {
          "name": "license.txt",
          "fingerprint": 3622228448
        },
        {
          "name": "ReadMe.txt",
          "fingerprint": 2277206236
        },
        {
          "name": "Reika",
          "fingerprint": 1980618461
        },
        {
          "name": "textures",
          "fingerprint": 489227403
        }
      ]
    },
    {
      "id": 2394705,
      "gameId": 432,
      "modId": 223328,
      "isAvailable": true,
      "displayName": "JSTR Universal",
      "fileName": "JSTR_Modded_Universal.zip",
      "releaseType": 1,
      "fileStatus": 4,
      "hashes": [
        {
          "value": "9d1663cd1aea456fad537f4723b7107a1bce8045",
          "algo": 1
        },
        {
          "value": "91f1ed4b053d689e1879176f726f36aa",
          "algo": 2
        }
      ],
      "fileDate": "2017-03-19T01:24:24.99Z",
      "fileLength": 34906089,
      "downloadCount": 107,
      "downloadUrl": "https://edge.forgecdn.net/files/2394/705/JSTR_Modded_Universal.zip",
      "gameVersions": [
        "1.8.9"
      ],
      "sortableGameVersions": [
        {
          "gameVersionName": "1.8.9",
          "gameVersionPadded": "0000000001.0000000008.0000000009",
          "gameVersion": "1.8.9",
          "gameVersionReleaseDate": "2015-12-09T06:00:00Z",
          "gameVersionTypeId": 4
        }
      ],
      "dependencies": [],
      "alternateFileId": 0,
      "isServerPack": false,
      "fileFingerprint": 3945063834,
      "modules": [
        {
          "name": "pack.mcmeta",
          "fingerprint": 150540921
        },
        {
          "name": "assets",
          "fingerprint": 2318586128
        },
        {
          "name": "pack.png",
          "fingerprint": 1449310668
        },
        {
          "name": "JSTR_1.8.x_CHANGELOG.txt",
          "fingerprint": 1257552692
        },
        {
          "name": "font.txt",
          "fingerprint": 2243831094
        },
        {
          "name": "license.txt",
          "fingerprint": 3622228448
        },
        {
          "name": "ReadMe.txt",
          "fingerprint": 387904363
        }
      ]
    },
    {
      "id": 2394704,
      "gameId": 432,
      "modId": 223328,
      "isAvailable": true,
      "displayName": "JSTR Universal",
      "fileName": "JSTR_Modded_Universal.zip",
      "releaseType": 1,
      "fileStatus": 4,
      "hashes": [
        {
          "value": "b66ab066fd6e25fda4d8f2abf2d2155932c8db8b",
          "algo": 1
        },
        {
          "value": "5e569033bac7753a0a4e0572b9af7958",
          "algo": 2
        }
      ],
      "fileDate": "2017-03-19T01:23:37.98Z",
      "fileLength": 177630008,
      "downloadCount": 211,
      "downloadUrl": "https://edge.forgecdn.net/files/2394/704/JSTR_Modded_Universal.zip",
      "gameVersions": [
        "1.7.10"
      ],
      "sortableGameVersions": [
        {
          "gameVersionName": "1.7.10",
          "gameVersionPadded": "0000000001.0000000007.0000000010",
          "gameVersion": "1.7.10",
          "gameVersionReleaseDate": "2014-06-16T00:00:00Z",
          "gameVersionTypeId": 5
        }
      ],
      "dependencies": [],
      "alternateFileId": 0,
      "isServerPack": false,
      "fileFingerprint": 3331201521,
      "modules": [
        {
          "name": "pack.mcmeta",
          "fingerprint": 2893727431
        },
        {
          "name": "assets",
          "fingerprint": 4137904048
        },
        {
          "name": "JOHN_SMITH_LEGACY_1.7.10_CHANGELOG.txt",
          "fingerprint": 1960649881
        },
        {
          "name": "helper_files",
          "fingerprint": 2709340199
        },
        {
          "name": "pack.png",
          "fingerprint": 1449310668
        },
        {
          "name": "font.txt",
          "fingerprint": 2243831094
        },
        {
          "name": "license.txt",
          "fingerprint": 3622228448
        },
        {
          "name": "ReadMe.txt",
          "fingerprint": 2277206236
        },
        {
          "name": "Reika",
          "fingerprint": 1980618461
        },
        {
          "name": "textures",
          "fingerprint": 489227403
        }
      ]
    },
    {
      "id": 2394007,
      "gameId": 432,
      "modId": 223328,
      "isAvailable": true,
      "displayName": "JSTR Universal",
      "fileName": "JSTR_Modded_Universal.zip",
      "releaseType": 1,
      "fileStatus": 4,
      "hashes": [
        {
          "value": "0bdcb2088ecc18edb11964573dfe9f5e10c2a9a4",
          "algo": 1
        },
        {
          "value": "f6f142006d06500a4f4bca34478969fd",
          "algo": 2
        }
      ],
      "fileDate": "2017-03-17T01:26:22.387Z",
      "fileLength": 33821645,
      "downloadCount": 110,
      "downloadUrl": "https://edge.forgecdn.net/files/2394/7/JSTR_Modded_Universal.zip",
      "gameVersions": [
        "1.9.3"
      ],
      "sortableGameVersions": [
        {
          "gameVersionName": "1.9.3",
          "gameVersionPadded": "0000000001.0000000009.0000000003",
          "gameVersion": "1.9.3",
          "gameVersionReleaseDate": "2016-05-09T05:00:00Z",
          "gameVersionTypeId": 552
        }
      ],
      "dependencies": [],
      "alternateFileId": 0,
      "isServerPack": false,
      "fileFingerprint": 969724427,
      "modules": [
        {
          "name": "pack.mcmeta",
          "fingerprint": 3124656134
        },
        {
          "name": "assets",
          "fingerprint": 2378690372
        },
        {
          "name": "pack.png",
          "fingerprint": 1449310668
        },
        {
          "name": "font.txt",
          "fingerprint": 2243831094
        },
        {
          "name": "license.txt",
          "fingerprint": 3622228448
        },
        {
          "name": "ReadMe.txt",
          "fingerprint": 2951307156
        }
      ]
    },
    {
      "id": 2394006,
      "gameId": 432,
      "modId": 223328,
      "isAvailable": true,
      "displayName": "JSTR Universal",
      "fileName": "JSTR_Modded_Universal.zip",
      "releaseType": 1,
      "fileStatus": 4,
      "hashes": [
        {
          "value": "79f2f22982e50d9cbfaf74e5b0d3a18f34e9d199",
          "algo": 1
        },
        {
          "value": "6c74c18fd1415c6276834355ba477bd5",
          "algo": 2
        }
      ],
      "fileDate": "2017-03-17T01:25:42.25Z",
      "fileLength": 34906089,
      "downloadCount": 58,
      "downloadUrl": "https://edge.forgecdn.net/files/2394/6/JSTR_Modded_Universal.zip",
      "gameVersions": [
        "1.8.9"
      ],
      "sortableGameVersions": [
        {
          "gameVersionName": "1.8.9",
          "gameVersionPadded": "0000000001.0000000008.0000000009",
          "gameVersion": "1.8.9",
          "gameVersionReleaseDate": "2015-12-09T06:00:00Z",
          "gameVersionTypeId": 4
        }
      ],
      "dependencies": [],
      "alternateFileId": 0,
      "isServerPack": false,
      "fileFingerprint": 3699234337,
      "modules": [
        {
          "name": "pack.mcmeta",
          "fingerprint": 150540921
        },
        {
          "name": "assets",
          "fingerprint": 2318586128
        },
        {
          "name": "pack.png",
          "fingerprint": 1449310668
        },
        {
          "name": "JSTR_1.8.x_CHANGELOG.txt",
          "fingerprint": 1257552692
        },
        {
          "name": "font.txt",
          "fingerprint": 2243831094
        },
        {
          "name": "license.txt",
          "fingerprint": 3622228448
        },
        {
          "name": "ReadMe.txt",
          "fingerprint": 387904363
        }
      ]
    },
    {
      "id": 2394005,
      "gameId": 432,
      "modId": 223328,
      "isAvailable": true,
      "displayName": "JSTR Universal",
      "fileName": "JSTR_Modded_Universal.zip",
      "releaseType": 1,
      "fileStatus": 4,
      "hashes": [
        {
          "value": "d2c9deb120fa525f01a924d6c19eb74c71fa82cf",
          "algo": 1
        },
        {
          "value": "751d7ebc0583c5afa753723f1be51f35",
          "algo": 2
        }
      ],
      "fileDate": "2017-03-17T01:24:58.127Z",
      "fileLength": 177630008,
      "downloadCount": 267,
      "downloadUrl": "https://edge.forgecdn.net/files/2394/5/JSTR_Modded_Universal.zip",
      "gameVersions": [
        "1.7.10"
      ],
      "sortableGameVersions": [
        {
          "gameVersionName": "1.7.10",
          "gameVersionPadded": "0000000001.0000000007.0000000010",
          "gameVersion": "1.7.10",
          "gameVersionReleaseDate": "2014-06-16T00:00:00Z",
          "gameVersionTypeId": 5
        }
      ],
      "dependencies": [],
      "alternateFileId": 0,
      "isServerPack": false,
      "fileFingerprint": 4293613559,
      "modules": [
        {
          "name": "pack.mcmeta",
          "fingerprint": 4064887109
        },
        {
          "name": "assets",
          "fingerprint": 4137904048
        },
        {
          "name": "JOHN_SMITH_LEGACY_1.7.10_CHANGELOG.txt",
          "fingerprint": 1960649881
        },
        {
          "name": "helper_files",
          "fingerprint": 2709340199
        },
        {
          "name": "pack.png",
          "fingerprint": 1449310668
        },
        {
          "name": "font.txt",
          "fingerprint": 2243831094
        },
        {
          "name": "license.txt",
          "fingerprint": 3622228448
        },
        {
          "name": "ReadMe.txt",
          "fingerprint": 2277206236
        },
        {
          "name": "Reika",
          "fingerprint": 1980618461
        },
        {
          "name": "textures",
          "fingerprint": 489227403
        }
      ]
    },
    {
      "id": 2393242,
      "gameId": 432,
      "modId": 223328,
      "isAvailable": true,
      "displayName": "JSTR Universal",
      "fileName": "JSTR_Modded_Universal.zip",
      "releaseType": 1,
      "fileStatus": 4,
      "hashes": [
        {
          "value": "9ec117b50af22a226d4fe02b182431a53c97a34a",
          "algo": 1
        },
        {
          "value": "1da696f47ceaa5249b43553978a52e62",
          "algo": 2
        }
      ],
      "fileDate": "2017-03-15T01:25:10.607Z",
      "fileLength": 33821645,
      "downloadCount": 105,
      "downloadUrl": "https://edge.forgecdn.net/files/2393/242/JSTR_Modded_Universal.zip",
      "gameVersions": [
        "1.9.3"
      ],
      "sortableGameVersions": [
        {
          "gameVersionName": "1.9.3",
          "gameVersionPadded": "0000000001.0000000009.0000000003",
          "gameVersion": "1.9.3",
          "gameVersionReleaseDate": "2016-05-09T05:00:00Z",
          "gameVersionTypeId": 552
        }
      ],
      "dependencies": [],
      "alternateFileId": 0,
      "isServerPack": false,
      "fileFingerprint": 3503234191,
      "modules": [
        {
          "name": "pack.mcmeta",
          "fingerprint": 3124656134
        },
        {
          "name": "assets",
          "fingerprint": 2378690372
        },
        {
          "name": "pack.png",
          "fingerprint": 1449310668
        },
        {
          "name": "font.txt",
          "fingerprint": 2243831094
        },
        {
          "name": "license.txt",
          "fingerprint": 3622228448
        },
        {
          "name": "ReadMe.txt",
          "fingerprint": 2951307156
        }
      ]
    },
    {
      "id": 2393240,
      "gameId": 432,
      "modId": 223328,
      "isAvailable": true,
      "displayName": "JSTR Universal",
      "fileName": "JSTR_Modded_Universal.zip",
      "releaseType": 1,
      "fileStatus": 4,
      "hashes": [
        {
          "value": "c50c32a4b3513cc6c7314c10a6d5c825c7b8ac8b",
          "algo": 1
        },
        {
          "value": "b37516c40958ae927e4e8aa3795e3bfc",
          "algo": 2
        }
      ],
      "fileDate": "2017-03-15T01:24:33.983Z",
      "fileLength": 34906089,
      "downloadCount": 60,
      "downloadUrl": "https://edge.forgecdn.net/files/2393/240/JSTR_Modded_Universal.zip",
      "gameVersions": [
        "1.8.9"
      ],
      "sortableGameVersions": [
        {
          "gameVersionName": "1.8.9",
          "gameVersionPadded": "0000000001.0000000008.0000000009",
          "gameVersion": "1.8.9",
          "gameVersionReleaseDate": "2015-12-09T06:00:00Z",
          "gameVersionTypeId": 4
        }
      ],
      "dependencies": [],
      "alternateFileId": 0,
      "isServerPack": false,
      "fileFingerprint": 892552274,
      "modules": [
        {
          "name": "pack.mcmeta",
          "fingerprint": 150540921
        },
        {
          "name": "assets",
          "fingerprint": 2318586128
        },
        {
          "name": "pack.png",
          "fingerprint": 1449310668
        },
        {
          "name": "JSTR_1.8.x_CHANGELOG.txt",
          "fingerprint": 1257552692
        },
        {
          "name": "font.txt",
          "fingerprint": 2243831094
        },
        {
          "name": "license.txt",
          "fingerprint": 3622228448
        },
        {
          "name": "ReadMe.txt",
          "fingerprint": 387904363
        }
      ]
    },
    {
      "id": 2393239,
      "gameId": 432,
      "modId": 223328,
      "isAvailable": true,
      "displayName": "JSTR Universal",
      "fileName": "JSTR_Modded_Universal.zip",
      "releaseType": 1,
      "fileStatus": 4,
      "hashes": [
        {
          "value": "8696403018439a977db283ff44368f6de8ef4ef8",
          "algo": 1
        },
        {
          "value": "14fa603cad615177056f3148d2c7d2d7",
          "algo": 2
        }
      ],
      "fileDate": "2017-03-15T01:23:49.943Z",
      "fileLength": 177630008,
      "downloadCount": 210,
      "downloadUrl": "https://edge.forgecdn.net/files/2393/239/JSTR_Modded_Universal.zip",
      "gameVersions": [
        "1.7.10"
      ],
      "sortableGameVersions": [
        {
          "gameVersionName": "1.7.10",
          "gameVersionPadded": "0000000001.0000000007.0000000010",
          "gameVersion": "1.7.10",
          "gameVersionReleaseDate": "2014-06-16T00:00:00Z",
          "gameVersionTypeId": 5
        }
      ],
      "dependencies": [],
      "alternateFileId": 0,
      "isServerPack": false,
      "fileFingerprint": 4071301859,
      "modules": [
        {
          "name": "pack.mcmeta",
          "fingerprint": 2126317451
        },
        {
          "name": "assets",
          "fingerprint": 4137904048
        },
        {
          "name": "JOHN_SMITH_LEGACY_1.7.10_CHANGELOG.txt",
          "fingerprint": 1960649881
        },
        {
          "name": "helper_files",
          "fingerprint": 2709340199
        },
        {
          "name": "pack.png",
          "fingerprint": 1449310668
        },
        {
          "name": "font.txt",
          "fingerprint": 2243831094
        },
        {
          "name": "license.txt",
          "fingerprint": 3622228448
        },
        {
          "name": "ReadMe.txt",
          "fingerprint": 2277206236
        },
        {
          "name": "Reika",
          "fingerprint": 1980618461
        },
        {
          "name": "textures",
          "fingerprint": 489227403
        }
      ]
    },
    {
      "id": 2392479,
      "gameId": 432,
      "modId": 223328,
      "isAvailable": true,
      "displayName": "JSTR Universal",
      "fileName": "JSTR_Modded_Universal.zip",
      "releaseType": 1,
      "fileStatus": 4,
      "hashes": [
        {
          "value": "94f643c531dc91a913f8aa1ad108b5ebe1dbc638",
          "algo": 1
        },
        {
          "value": "e8b5b8ac1d55faec1a57fe678818a3c7",
          "algo": 2
        }
      ],
      "fileDate": "2017-03-13T01:27:50.637Z",
      "fileLength": 33821645,
      "downloadCount": 129,
      "downloadUrl": "https://edge.forgecdn.net/files/2392/479/JSTR_Modded_Universal.zip",
      "gameVersions": [
        "1.9.3"
      ],
      "sortableGameVersions": [
        {
          "gameVersionName": "1.9.3",
          "gameVersionPadded": "0000000001.0000000009.0000000003",
          "gameVersion": "1.9.3",
          "gameVersionReleaseDate": "2016-05-09T05:00:00Z",
          "gameVersionTypeId": 552
        }
      ],
      "dependencies": [],
      "alternateFileId": 0,
      "isServerPack": false,
      "fileFingerprint": 2723993907,
      "modules": [
        {
          "name": "pack.mcmeta",
          "fingerprint": 3124656134
        },
        {
          "name": "assets",
          "fingerprint": 2378690372
        },
        {
          "name": "pack.png",
          "fingerprint": 1449310668
        },
        {
          "name": "font.txt",
          "fingerprint": 2243831094
        },
        {
          "name": "license.txt",
          "fingerprint": 3622228448
        },
        {
          "name": "ReadMe.txt",
          "fingerprint": 2951307156
        }
      ]
    },
    {
      "id": 2392477,
      "gameId": 432,
      "modId": 223328,
      "isAvailable": true,
      "displayName": "JSTR Universal",
      "fileName": "JSTR_Modded_Universal.zip",
      "releaseType": 1,
      "fileStatus": 4,
      "hashes": [
        {
          "value": "8b45a4913036faf6c0ef630d347c3229c5477db4",
          "algo": 1
        },
        {
          "value": "3624d3176753d94c1a69ef1eab82d3fc",
          "algo": 2
        }
      ],
      "fileDate": "2017-03-13T01:26:16.15Z",
      "fileLength": 177630008,
      "downloadCount": 218,
      "downloadUrl": "https://edge.forgecdn.net/files/2392/477/JSTR_Modded_Universal.zip",
      "gameVersions": [
        "1.7.10"
      ],
      "sortableGameVersions": [
        {
          "gameVersionName": "1.7.10",
          "gameVersionPadded": "0000000001.0000000007.0000000010",
          "gameVersion": "1.7.10",
          "gameVersionReleaseDate": "2014-06-16T00:00:00Z",
          "gameVersionTypeId": 5
        }
      ],
      "dependencies": [],
      "alternateFileId": 0,
      "isServerPack": false,
      "fileFingerprint": 4242843630,
      "modules": [
        {
          "name": "pack.mcmeta",
          "fingerprint": 4221222201
        },
        {
          "name": "assets",
          "fingerprint": 4137904048
        },
        {
          "name": "JOHN_SMITH_LEGACY_1.7.10_CHANGELOG.txt",
          "fingerprint": 1960649881
        },
        {
          "name": "helper_files",
          "fingerprint": 2709340199
        },
        {
          "name": "pack.png",
          "fingerprint": 1449310668
        },
        {
          "name": "font.txt",
          "fingerprint": 2243831094
        },
        {
          "name": "license.txt",
          "fingerprint": 3622228448
        },
        {
          "name": "ReadMe.txt",
          "fingerprint": 2277206236
        },
        {
          "name": "Reika",
          "fingerprint": 1980618461
        },
        {
          "name": "textures",
          "fingerprint": 489227403
        }
      ]
    }
  ],
  "pagination": {
    "index": 150,
    "pageSize": 50,
    "resultCount": 50,
    "totalCount": 402
  }
}
