<?xml version="1.0" encoding="UTF-8" standalone="no"?>
<svg
   xmlns:dc="http://purl.org/dc/elements/1.1/"
   xmlns:cc="http://creativecommons.org/ns#"
   xmlns:rdf="http://www.w3.org/1999/02/22-rdf-syntax-ns#"
   xmlns:svg="http://www.w3.org/2000/svg"
   xmlns="http://www.w3.org/2000/svg"
   xmlns:sodipodi="http://sodipodi.sourceforge.net/DTD/sodipodi-0.dtd"
   xmlns:inkscape="http://www.inkscape.org/namespaces/inkscape"
   viewBox="0 0 36 36"
   version="1.1"
   id="svg10"
   sodipodi:docname="certificate_unsigned.svg"
   inkscape:version="1.0.2 (e86c870879, 2021-01-15)">
  <metadata
     id="metadata16">
    <rdf:RDF>
      <cc:Work
         rdf:about="">
        <dc:format>image/svg+xml</dc:format>
        <dc:type
           rdf:resource="http://purl.org/dc/dcmitype/StillImage" />
      </cc:Work>
    </rdf:RDF>
  </metadata>
  <defs
     id="defs14" />
  <sodipodi:namedview
     pagecolor="#ffffff"
     bordercolor="#666666"
     borderopacity="1"
     objecttolerance="10"
     gridtolerance="10"
     guidetolerance="10"
     inkscape:pageopacity="0"
     inkscape:pageshadow="2"
     inkscape:window-width="2558"
     inkscape:window-height="1402"
     id="namedview12"
     showgrid="false"
     inkscape:zoom="15.833333"
     inkscape:cx="-9.2876533"
     inkscape:cy="17.575475"
     inkscape:window-x="1920"
     inkscape:window-y="18"
     inkscape:window-maximized="0"
     inkscape:current-layer="svg10"
     inkscape:document-rotation="0" />
  <path
     fill="#ccd6dd"
     d="M 3,4 C 3,1.791 4.791,0 7,0 h 22 c 2.209,0 4,1.791 4,4 v 28 c 0,2.209 -1.791,4 -4,4 H 7 C 4.791,36 3,34.209 3,32 Z"
     id="path951" />
  <path
     fill="#99aab5"
     d="m 7,14.669716 c 0,-0.553 0.447,-1 1,-1 h 20 c 0.552,0 1,0.447 1,1 0,0.553 -0.448,1 -1,1 H 8 c -0.553,0 -1,-0.447 -1,-1 z m 16,-4 c 0,-0.553 0.448,-0.9999997 1,-0.9999997 h 4 c 0.552,0 1,0.4469997 1,0.9999997 0,0.553 -0.448,1 -1,1 h -4 c -0.552,0 -1,-0.447 -1,-1 z m -16,20 c 0,-0.552 0.447,-1 1,-1 h 20 c 0.552,0 1,0.448 1,1 0,0.552 -0.448,1 -1,1 H 8 c -0.553,0 -1,-0.448 -1,-1 z m 0,-4 c 0,-0.553 0.447,-1 1,-1 h 20 c 0.552,0 1,0.447 1,1 0,0.553 -0.448,1 -1,1 H 8 c -0.553,0 -1,-0.447 -1,-1 z m 0,-4 c 0,-0.553 0.447,-1 1,-1 h 20 c 0.552,0 1,0.447 1,1 0,0.553 -0.448,1 -1,1 H 8 c -0.553,0 -1,-0.447 -1,-1 z m 0,-4 c 0,-0.553 0.447,-1 1,-1 h 20 c 0.552,0 1,0.447 1,1 0,0.553 -0.448,1 -1,1 H 8 c -0.553,0 -1,-0.447 -1,-1 z"
     id="path953" />
</svg>
