<?xml version="1.0" encoding="UTF-8" standalone="no"?>
<svg
   viewBox="0 0 36 36"
   version="1.1"
   id="svg14"
   sodipodi:docname="browser_window.svg"
   inkscape:version="1.2 (dc2aedaf03, 2022-05-15)"
   inkscape:export-filename="/home/jost/repos/tikz-twemojis/server.png"
   inkscape:export-xdpi="2666.6699"
   inkscape:export-ydpi="2666.6699"
   xml:space="preserve"
   xmlns:inkscape="http://www.inkscape.org/namespaces/inkscape"
   xmlns:sodipodi="http://sodipodi.sourceforge.net/DTD/sodipodi-0.dtd"
   xmlns="http://www.w3.org/2000/svg"
   xmlns:svg="http://www.w3.org/2000/svg"
   xmlns:rdf="http://www.w3.org/1999/02/22-rdf-syntax-ns#"
   xmlns:cc="http://creativecommons.org/ns#"
   xmlns:dc="http://purl.org/dc/elements/1.1/"><metadata
     id="metadata20"><rdf:RDF><cc:Work
         rdf:about=""><dc:format>image/svg+xml</dc:format><dc:type
           rdf:resource="http://purl.org/dc/dcmitype/StillImage" /><dc:title /></cc:Work></rdf:RDF></metadata><defs
     id="defs18"><inkscape:perspective
       sodipodi:type="inkscape:persp3d"
       inkscape:vp_x="11.357269 : -1.0095978 : 1"
       inkscape:vp_y="0 : 1000 : 0"
       inkscape:vp_z="42.517197 : -0.99898911 : 1"
       inkscape:persp3d-origin="25.768219 : -0.29430005 : 1"
       id="perspective947" /></defs><sodipodi:namedview
     pagecolor="#ffffff"
     bordercolor="#666666"
     borderopacity="1"
     objecttolerance="10"
     gridtolerance="10"
     guidetolerance="10"
     inkscape:pageopacity="0"
     inkscape:pageshadow="2"
     inkscape:window-width="2558"
     inkscape:window-height="1399"
     id="namedview16"
     showgrid="false"
     showguides="true"
     inkscape:guide-bbox="true"
     inkscape:zoom="16"
     inkscape:cx="20.90625"
     inkscape:cy="7.625"
     inkscape:window-x="1920"
     inkscape:window-y="20"
     inkscape:window-maximized="1"
     inkscape:current-layer="svg14"
     inkscape:document-rotation="0"
     inkscape:showpageshadow="2"
     inkscape:pagecheckerboard="0"
     inkscape:deskcolor="#d1d1d1" /><path
     id="rect122-1"
     style="fill:#9aaab4;fill-opacity:1"
     d="M 3.5,0 C 1.5610019,0 0,1.5610019 0,3.5 v 7 c 0.47303244,-0.0022 35.268858,5.92e-4 36,0 v -7 C 36,1.5610019 34.438998,0 32.5,0 Z"
     sodipodi:nodetypes="ssccsss" /><circle
     style="fill:#5c9031;fill-opacity:1;stroke-width:0.9375"
     id="path973-06-1-5"
     cx="5.75"
     cy="2.75"
     r="0.75" /><circle
     style="fill:#ffcc41;fill-opacity:1;stroke-width:0.9375"
     id="path973-6-3-5-6"
     cx="3.75"
     cy="2.75"
     r="0.75" /><circle
     style="fill:#eb2027;fill-opacity:1;stroke-width:0.9375"
     id="path973-0-2-5-1"
     cx="1.75"
     cy="2.75"
     r="0.75" /><path
     id="rect122-1-3-5"
     style="fill:#e1e8ed;stroke-width:0.940598"
     d="m 36,10.500859 v 22.220448 c 0,1.816396 -1.652823,3.278695 -3.705883,3.278695 H 3.705883 C 1.6528239,36.000002 0,34.537703 0,32.721307 V 10.500859 c 0.473033,-0.0022 35.268857,5.92e-4 36,0 z"
     sodipodi:nodetypes="csssscc" /><rect
     style="fill:#e1e8ed;fill-opacity:1;stroke-width:1.02025"
     id="rect1049"
     width="5"
     height="5"
     x="1"
     y="4.5"
     rx="0.40309024"
     ry="0.37783629" /><rect
     style="fill:#e1e8ed;fill-opacity:1;stroke-width:1.02025"
     id="rect1049-6"
     width="5"
     height="5"
     x="7.1373763"
     y="4.5"
     rx="0.40309024"
     ry="0.37783629" /><rect
     style="fill:#e1e8ed;fill-opacity:1;stroke-width:2.04051"
     id="rect1049-6-7"
     width="20"
     height="5"
     x="15"
     y="4.5049806"
     rx="0.40309024"
     ry="0.37783629" /><rect
     style="fill:#9aaab4;fill-opacity:0;stroke:#9aaab4;stroke-width:0.6489;stroke-dasharray:none;stroke-opacity:1"
     id="rect1049-6-7-5"
     width="27.351101"
     height="5.3511"
     x="4.32445"
     y="20.32445"
     rx="0.40309024"
     ry="0.37783629" /><text
     xml:space="preserve"
     style="font-style:normal;font-weight:normal;font-size:40px;line-height:1.25;font-family:sans-serif;fill:#66757f;fill-opacity:1;stroke:none"
     x="1.4279683"
     y="9.1002722"
     id="text1219"><tspan
       sodipodi:role="line"
       id="tspan1217"
       x="1.4279683"
       y="9.1002722"
       style="font-style:normal;font-variant:normal;font-weight:normal;font-stretch:normal;font-size:6.66667px;font-family:Cantarell;-inkscape-font-specification:'Cantarell, Normal';font-variant-ligatures:normal;font-variant-caps:normal;font-variant-numeric:normal;font-variant-east-asian:normal;fill:#66757f;fill-opacity:1">&lt;</tspan></text><text
     xml:space="preserve"
     style="font-style:normal;font-weight:normal;font-size:40px;line-height:1.25;font-family:sans-serif;fill:#66757f;fill-opacity:1;stroke:none"
     x="-11.685378"
     y="9.0365829"
     id="text1219-9"
     transform="scale(-1,1)"><tspan
       sodipodi:role="line"
       id="tspan1217-6"
       x="-11.685378"
       y="9.0365829"
       style="font-style:normal;font-variant:normal;font-weight:normal;font-stretch:normal;font-size:6.66667px;font-family:Cantarell;-inkscape-font-specification:'Cantarell, Normal';font-variant-ligatures:normal;font-variant-caps:normal;font-variant-numeric:normal;font-variant-east-asian:normal;fill:#66757f;fill-opacity:1">&lt;</tspan></text><path
     d="m 19.108834,7.1379776 -0.605746,-0.605745 h 0.354739 c -0.0034,-0.009 -0.0068,-0.01751 -0.01026,-0.02647 -0.210455,-0.533602 -0.730396,-0.910543 -1.338704,-0.910543 -0.79443,0 -1.438594,0.644168 -1.438594,1.438594 0,0.79443 0.644164,1.439022 1.438594,1.439022 0.584402,0 1.087696,-0.348763 1.312661,-0.849068 0.0022,-0.0047 0.0034,-0.0098 0.0055,-0.0145 l 0.385901,0.38334 c -0.0025,0.0043 -0.0043,0.0094 -0.0068,0.01409 -3.16e-4,9.5e-4 -0.0013,0.0022 -0.0016,0.0029 -0.340653,0.588244 -0.97628,0.983538 -1.704969,0.983538 -1.086841,-3.17e-4 -1.968355,-0.881514 -1.968355,-1.968782 0,-1.087269 0.881514,-1.968783 1.968783,-1.968783 0.908832,0 1.673805,0.615566 1.90048,1.453107 0.0022,0.0077 0.0028,0.0158 0.0047,0.02347 h 0.309495 z"
     id="path1324"
     style="fill:#66757f;fill-opacity:1;stroke-width:0.00426882" /><g
     id="g1636"
     transform="matrix(0.10983026,0,0,0.10856957,5.1035343,21.018413)"><path
       fill="#9aaab4"
       d="M 27.388,24.642 24.56,27.47 19.61,22.52 22.438,19.692 Z"
       id="path2" /><path
       fill="#66757f"
       d="m 34.683,29.11 -5.879,-5.879 c -0.781,-0.781 -2.047,-0.781 -2.828,0 l -2.828,2.828 c -0.781,0.781 -0.781,2.047 0,2.828 l 5.879,5.879 c 1.562,1.563 4.096,1.563 5.658,0 1.56,-1.561 1.559,-4.094 -0.002,-5.656 z"
       id="path4" /><path
       id="circle6"
       d="M 13.390625,0.16992188 A 13.5,13.5 0 0 0 0.0859375,13.669922 a 13.5,13.5 0 0 0 13.5000005,13.5 13.5,13.5 0 0 0 13.5,-13.5 13.5,13.5 0 0 0 -13.5,-13.50000012 13.5,13.5 0 0 0 -0.195313,0 z M 13.4375,4.1699219 a 9.5,9.5 0 0 1 0.148438,0 9.5,9.5 0 0 1 9.5,9.5000001 9.5,9.5 0 0 1 -9.5,9.5 9.5,9.5 0 0 1 -9.5000005,-9.5 A 9.5,9.5 0 0 1 13.4375,4.1699219 Z"
       style="fill:#8899a6;fill-opacity:1" /></g></svg>
