<?xml version="1.0"?>
<svg version="1.1" viewBox="0 0 36 36" xmlns="http://www.w3.org/2000/svg">
 <circle cx="24.5" cy="13.5" r="5.5" fill="#F4F7F9"/>
 <circle cx="11.5" cy="13.5" r="5.5" fill="#F4F7F9"/>
 <path d="m10.877 8.0371c-0.79 0.089-1.5277 0.34833-2.1797 0.73633-0.43 0.449-0.69727 1.0556-0.69727 1.7266 0 1.381 1.119 2.5 2.5 2.5s2.5-1.119 2.5-2.5c0-1.252-0.92205-2.2809-2.123-2.4629zm13 0c-0.789 0.089-1.5267 0.34833-2.1777 0.73633-0.431 0.449-0.69922 1.0556-0.69922 1.7266 0 1.381 1.119 2.5 2.5 2.5s2.5-1.119 2.5-2.5c0-1.252-0.92205-2.2809-2.123-2.4629z" fill="#664500"/>
</svg>
