<?xml version="1.0"?>
<svg version="1.1" viewBox="0 0 36 36" xmlns="http://www.w3.org/2000/svg">
 <path d="M23.485 29.379C23.474 29.335 22.34 26.5 18 26.5s-5.474 2.835-5.485 2.879c-.053.213.044.431.232.544.188.112.433.086.596-.06C13.352 29.855 14.356 29 18 29c3.59 0 4.617.83 4.656.863.095.09.219.137.344.137.084 0 .169-.021.246-.064.196-.112.294-.339.239-.557z" fill="#664500"/>
 <path d="m35.973 17.069c4.21e-4 0.0066 0.0035 0.01294 0.0039 0.01953-1e-6 -2.63e-4 0-0.01953 0-0.01953zm2e-3 0.11719c0.01302 0.77408-0.3245 1.5438-0.99024 2.043l-12.176 9.1309c0.0011 0.0012 0.0028 0.0027 0.0039 0.0039l-0.27344 0.19922 0.79297 0.51562c0.0014 0.0026 0.0025 0.0032 0.0039 0.0059l11.25-6.9434c0.703-0.431 0.99522-0.83409 1.1992-1.7461 0.19495-0.87152 0.19009-3.0116 0.18945-3.209z" fill-opacity=".3"/>
 <path d="M35.474 15.729c-.829-1.104-2.397-1.328-3.501-.5L14.767 28.137c.646-.242 1.51-.444 2.615-.522.256-.018 2.66-.627 2.66-.627l1.293 1.036s.911.367 1.197.539l12.444-9.335c1.103-.827 1.326-2.395.498-3.499z" fill="#CCD6DD"/>
 <path d="M28.686 20.87c-.448-.596-.787-1.145-1.383-.698l-9.922 7.443c.256-.018.5-.042.783-.044 1.36-.009 2.4.195 3.17.452l7.588-5.692c.596-.447.211-.864-.236-1.461z" fill="#DA2F47"/>
 <path d="M18.599 25.228l1.234 1.598.741-.595-1.197-1.587zm2.223-1.661l1.235 1.598.741-.595-1.197-1.587zm2.184-1.619l1.234 1.598.741-.595-1.197-1.587zm2.181-1.66l1.235 1.597.741-.594-1.197-1.587zm2.238-1.641l1.235 1.598.74-.595-1.196-1.587zm2.14-1.618l1.235 1.598.74-.595-1.196-1.587z" fill="#67757F"/>
</svg>
