<?xml version="1.0"?>
<svg version="1.1" viewBox="0 0 36 36" xmlns="http://www.w3.org/2000/svg">
 <path d="m17.236 21.543c-0.274-0.026-0.50934 0.19375-0.52734 0.46875-0.017 0.274 0.19084 0.5103 0.46484 0.5293 0.035 2e-3 3.5332 0.29995 3.5332 2.002s-3.4982 1.998-3.5332 2c-0.014 1e-3 -0.024109 0.009719-0.037109 0.011719-0.052 6e-3 -0.10148 0.017062-0.14648 0.039062l-0.019531 0.011719c-0.047 0.026-0.088 0.056656-0.125 0.097656-0.014 0.015-0.023156 0.031828-0.035156 0.048828-0.023 0.032-0.043594 0.062563-0.058594 0.10156-0.012 0.029-0.01939 0.060796-0.025391 0.091796-4e-3 0.023-0.015578 0.043407-0.017578 0.066407 0 0.011 0.003907 0.02125 0.003907 0.03125s-0.004907 0.02125-0.003907 0.03125c1e-3 0.024 0.012579 0.045359 0.017578 0.068359 0.006001 0.031 0.011438 0.060844 0.023438 0.089844 0.013 0.03 0.030828 0.056984 0.048828 0.083984 0.017 0.024 0.032734 0.049313 0.052734 0.070313 0.023 0.023 0.050125 0.040547 0.078126 0.060547 0.024 0.017 0.046218 0.033875 0.074218 0.046875 0.032 0.015 0.06461 0.021343 0.09961 0.027343 0.024 6e-3 0.045312 0.019485 0.070312 0.021485 0.035 2e-3 3.5332 0.298 3.5332 2s-3.4982 2-3.5332 2.002c-0.274 0.02-0.48184 0.2563-0.46484 0.5293 0.017 0.265 0.23605 0.46875 0.49805 0.46875h0.029297c0.56-0.031 5.4707-0.381 5.4707-3 0-1.345-1.2939-2.088-2.6289-2.5 1.335-0.412 2.6289-1.156 2.6289-2.5 0-2.619-4.9107-2.969-5.4707-3z" fill="#664500"/>
</svg>
