<?xml version="1.0" encoding="UTF-8" standalone="no"?>
<svg
   xmlns:dc="http://purl.org/dc/elements/1.1/"
   xmlns:cc="http://creativecommons.org/ns#"
   xmlns:rdf="http://www.w3.org/1999/02/22-rdf-syntax-ns#"
   xmlns:svg="http://www.w3.org/2000/svg"
   xmlns="http://www.w3.org/2000/svg"
   xmlns:sodipodi="http://sodipodi.sourceforge.net/DTD/sodipodi-0.dtd"
   xmlns:inkscape="http://www.inkscape.org/namespaces/inkscape"
   viewBox="0 0 36 36"
   version="1.1"
   id="svg14"
   sodipodi:docname="all_own_emojis.svg"
   inkscape:version="1.0.2 (e86c870879, 2021-01-15)"
   inkscape:export-filename="/home/jost/repos/tikz-twemojis/server.png"
   inkscape:export-xdpi="2666.6699"
   inkscape:export-ydpi="2666.6699">
  <metadata
     id="metadata20">
    <rdf:RDF>
      <cc:Work
         rdf:about="">
        <dc:format>image/svg+xml</dc:format>
        <dc:type
           rdf:resource="http://purl.org/dc/dcmitype/StillImage" />
        <dc:title></dc:title>
      </cc:Work>
    </rdf:RDF>
  </metadata>
  <defs
     id="defs18">
    <inkscape:perspective
       sodipodi:type="inkscape:persp3d"
       inkscape:vp_x="11.357269 : -1.0095978 : 1"
       inkscape:vp_y="0 : 1000 : 0"
       inkscape:vp_z="42.517197 : -0.99898911 : 1"
       inkscape:persp3d-origin="25.768219 : -0.29430005 : 1"
       id="perspective947" />
  </defs>
  <sodipodi:namedview
     pagecolor="#ffffff"
     bordercolor="#666666"
     borderopacity="1"
     objecttolerance="10"
     gridtolerance="10"
     guidetolerance="10"
     inkscape:pageopacity="0"
     inkscape:pageshadow="2"
     inkscape:window-width="2558"
     inkscape:window-height="1402"
     id="namedview16"
     showgrid="false"
     showguides="true"
     inkscape:guide-bbox="true"
     inkscape:zoom="4"
     inkscape:cx="101.57573"
     inkscape:cy="-41.428812"
     inkscape:window-x="1920"
     inkscape:window-y="18"
     inkscape:window-maximized="0"
     inkscape:current-layer="svg14"
     inkscape:document-rotation="0" />
  <rect
     style="fill:#9aaab4;fill-opacity:1"
     id="rect122-1"
     width="36"
     height="36"
     x="0"
     y="0"
     rx="3.5"
     ry="3.5" />
  <path
     fill="#e1e8ed"
     d="m 35,31.234266 c 0,-2.079948 -1.26839,-3.765735 -2.83333,-3.765735 H 3.833333 C 2.268389,27.468531 1,29.154318 1,31.234266 1,33.314212 2.268389,35 3.833333,35 H 32.16667 C 33.73161,35 35,33.314212 35,31.234266 Z"
     id="path10-1"
     style="stroke-width:1.08882" />
  <path
     fill="#e1e8ed"
     d="m 35,22.363887 c 0,-2.088494 -1.26839,-3.78122 -2.83333,-3.78122 H 3.833333 C 2.268389,18.582667 1,20.275393 1,22.363887 c 0,2.088492 1.268389,3.781218 2.833333,3.781218 H 32.16667 C 33.73161,26.145105 35,24.452379 35,22.363887 Z"
     id="path10-3-7"
     style="stroke-width:1.09103" />
  <path
     fill="#e1e8ed"
     d="M 35,13.572553 C 35,11.48406 33.73161,9.791334 32.16667,9.791334 H 3.833333 C 2.268389,9.791334 1,11.48406 1,13.572553 c 0,2.088492 1.268389,3.781218 2.833333,3.781218 H 32.16667 C 33.73161,17.353771 35,15.661045 35,13.572553 Z"
     id="path10-3-6-7"
     inkscape:transform-center-x="-0.41975767"
     inkscape:transform-center-y="6.4576395"
     style="stroke-width:1.09103" />
  <path
     fill="#e1e8ed"
     d="M 35,4.7812188 C 35,2.6927256 33.73161,1 32.16667,1 H 3.833333 C 2.268389,1 1,2.6927256 1,4.7812188 1,6.8697119 2.268389,8.562438 3.833333,8.562438 H 32.16667 C 33.73161,8.562438 35,6.8697119 35,4.7812188 Z"
     id="path10-3-5-1"
     style="stroke-width:1.09103" />
  <rect
     style="fill:#aebbc1;fill-opacity:1;stroke-width:1.15721"
     id="rect72-1"
     width="1.8888888"
     height="5.6718283"
     x="3.8333359"
     y="28.413837" />
  <rect
     style="fill:#aebbc1;fill-opacity:1;stroke-width:1.15721"
     id="rect72-5-5"
     width="1.8888888"
     height="5.6718283"
     x="7.6111145"
     y="28.413837" />
  <rect
     style="fill:#aebbc1;fill-opacity:1;stroke-width:1.15721"
     id="rect72-5-6-97"
     width="1.8888888"
     height="5.6718283"
     x="11.388893"
     y="28.414248" />
  <rect
     style="fill:#aebbc1;fill-opacity:1;stroke-width:1.15721"
     id="rect72-5-9-7"
     width="1.8888888"
     height="5.6718283"
     x="15.166664"
     y="28.413837" />
  <rect
     style="fill:#aebbc1;fill-opacity:1;stroke-width:1.15721"
     id="rect72-5-6-1-67"
     width="1.8888888"
     height="5.6718283"
     x="18.944443"
     y="28.414248" />
  <rect
     style="fill:#aebbc1;fill-opacity:1;stroke-width:1.15721"
     id="rect72-27-36"
     width="1.8888888"
     height="5.6718283"
     x="22.722221"
     y="28.413837" />
  <rect
     style="fill:#aebbc1;fill-opacity:1;stroke-width:1.15721"
     id="rect72-5-6-9-5"
     width="1.8888888"
     height="5.6718283"
     x="26.5"
     y="28.413837" />
  <g
     id="g1090-6"
     transform="matrix(0.94444444,0,0,0.9453047,1.188889,1)">
    <circle
       style="fill:#aebbc1;fill-opacity:1"
       id="path973-3"
       cx="31.799999"
       cy="29.799999"
       r="0.80000001" />
    <circle
       style="fill:#aebbc1;fill-opacity:1"
       id="path973-6-9"
       cx="31.799999"
       cy="32"
       r="0.80000001" />
    <circle
       style="fill:#aebbc1;fill-opacity:1"
       id="path973-0-4"
       cx="31.799999"
       cy="34.220001"
       r="0.80000001" />
  </g>
  <path
     fill="#f5f8fa"
     d="m 3.866946,14.259517 h 1.888889 v 1.890609 H 3.866946 Z m 3.777777,0 h 1.888889 v 1.890609 H 7.644723 Z m 3.777779,0 h 1.888889 v 1.890609 h -1.888889 z m 3.777777,0 h 1.888889 v 1.890609 h -1.888889 z m 3.777777,0 h 1.888889 v 1.890609 h -1.888889 z m 3.77778,0 h 1.888888 v 1.890609 h -1.888888 z m 3.777777,0 H 28.4225 v 1.890609 h -1.888887 z m 3.777777,0 h 1.88889 v 1.890609 h -1.88889 z"
     id="path12-8"
     style="stroke-width:0.944874" />
  <path
     fill="#f5f8fa"
     d="m 3.845006,11.112684 h 1.888889 v 1.890609 H 3.845006 Z m 3.777779,0 h 1.888888 v 1.890609 H 7.622785 Z m 3.777777,0 h 1.888888 v 1.890609 h -1.888888 z m 3.777778,0 h 1.888889 v 1.890609 H 15.17834 Z m 3.777778,0 h 1.888889 v 1.890609 h -1.888889 z m 3.777777,0 h 1.888889 v 1.890609 h -1.888889 z m 3.777777,0 h 1.888888 v 1.890609 h -1.888888 z m 3.777778,0 h 1.88889 v 1.890609 h -1.88889 z"
     id="path12-4-1"
     style="stroke-width:0.944874" />
  <rect
     style="fill:#aebbc1;fill-opacity:1;stroke-width:1.15721"
     id="rect72-7-29"
     width="1.8888888"
     height="5.6718283"
     x="3.8333359"
     y="19.595646" />
  <rect
     style="fill:#aebbc1;fill-opacity:1;stroke-width:1.15721"
     id="rect72-5-8-3"
     width="1.8888888"
     height="5.6718283"
     x="7.6111145"
     y="19.595646" />
  <rect
     style="fill:#aebbc1;fill-opacity:1;stroke-width:1.15721"
     id="rect72-5-6-4-9"
     width="1.8888888"
     height="5.6718283"
     x="11.388893"
     y="19.596058" />
  <rect
     style="fill:#aebbc1;fill-opacity:1;stroke-width:1.15721"
     id="rect72-5-9-5-0"
     width="1.8888888"
     height="5.6718283"
     x="15.166664"
     y="19.595646" />
  <rect
     style="fill:#aebbc1;fill-opacity:1;stroke-width:1.15721"
     id="rect72-5-6-1-0-8"
     width="1.8888888"
     height="5.6718283"
     x="18.944443"
     y="19.596058" />
  <rect
     style="fill:#aebbc1;fill-opacity:1;stroke-width:1.15721"
     id="rect72-27-3-8"
     width="1.8888888"
     height="5.6718283"
     x="22.722221"
     y="19.595646" />
  <rect
     style="fill:#aebbc1;fill-opacity:1;stroke-width:1.15721"
     id="rect72-5-6-9-6-5"
     width="1.8888888"
     height="5.6718283"
     x="26.5"
     y="19.595646" />
  <g
     id="g1090-1-0"
     transform="matrix(0.94444444,0,0,0.9453047,1.188889,-7.8181906)">
    <circle
       style="fill:#aebbc1;fill-opacity:1"
       id="path973-06-9"
       cx="31.799999"
       cy="29.799999"
       r="0.80000001" />
    <circle
       style="fill:#aebbc1;fill-opacity:1"
       id="path973-6-3-6"
       cx="31.799999"
       cy="32"
       r="0.80000001" />
    <circle
       style="fill:#aebbc1;fill-opacity:1"
       id="path973-0-2-3"
       cx="31.799999"
       cy="34.220001"
       r="0.80000001" />
  </g>
  <rect
     style="fill:#f5f8fa;fill-opacity:1;stroke-width:1.15721"
     id="rect72-7-0-8"
     width="1.8888888"
     height="5.6718283"
     x="3.8333359"
     y="1.9453051" />
  <ellipse
     style="fill:#5c9031;fill-opacity:1;stroke-width:0.944874"
     id="path973-06-1-5"
     cx="31.222221"
     cy="2.7015481"
     rx="0.75555557"
     ry="0.75624382" />
  <ellipse
     style="fill:#aebbc1;fill-opacity:1;stroke-width:0.944874"
     id="path973-6-3-5-6"
     cx="31.222221"
     cy="4.7812195"
     rx="0.75555557"
     ry="0.75624382" />
  <ellipse
     style="fill:#eb2027;fill-opacity:1;stroke-width:0.944874"
     id="path973-0-2-5-1"
     cx="31.222221"
     cy="6.879797"
     rx="0.75555557"
     ry="0.75624382" />
</svg>
