<?xml version="1.0"?>
<svg version="1.1" viewBox="0 0 36 36" xmlns="http://www.w3.org/2000/svg">
 <path d="m18 18c-2.757 0-5 2.243-5 5v6c0 2.757 2.243 5 5 5s5-2.243 5-5v-6c0-2.757-2.243-5-5-5z" fill="#664500"/>
</svg>
