<?xml version="1.0" encoding="UTF-8" standalone="no"?>
<svg
   xmlns:dc="http://purl.org/dc/elements/1.1/"
   xmlns:cc="http://creativecommons.org/ns#"
   xmlns:rdf="http://www.w3.org/1999/02/22-rdf-syntax-ns#"
   xmlns:svg="http://www.w3.org/2000/svg"
   xmlns="http://www.w3.org/2000/svg"
   xmlns:sodipodi="http://sodipodi.sourceforge.net/DTD/sodipodi-0.dtd"
   xmlns:inkscape="http://www.inkscape.org/namespaces/inkscape"
   viewBox="0 0 36 36"
   version="1.1"
   id="svg14"
   sodipodi:docname="server.svg"
   inkscape:version="1.0.2 (e86c870879, 2021-01-15)"
   inkscape:export-filename="/home/jost/repos/tikz-twemojis/server.png"
   inkscape:export-xdpi="2666.6699"
   inkscape:export-ydpi="2666.6699">
  <metadata
     id="metadata20">
    <rdf:RDF>
      <cc:Work
         rdf:about="">
        <dc:format>image/svg+xml</dc:format>
        <dc:type
           rdf:resource="http://purl.org/dc/dcmitype/StillImage" />
        <dc:title></dc:title>
      </cc:Work>
    </rdf:RDF>
  </metadata>
  <defs
     id="defs18">
    <inkscape:perspective
       sodipodi:type="inkscape:persp3d"
       inkscape:vp_x="11.357269 : -1.0095978 : 1"
       inkscape:vp_y="0 : 1000 : 0"
       inkscape:vp_z="42.517197 : -0.99898911 : 1"
       inkscape:persp3d-origin="25.768219 : -0.29430005 : 1"
       id="perspective947" />
  </defs>
  <sodipodi:namedview
     pagecolor="#ffffff"
     bordercolor="#666666"
     borderopacity="1"
     objecttolerance="10"
     gridtolerance="10"
     guidetolerance="10"
     inkscape:pageopacity="0"
     inkscape:pageshadow="2"
     inkscape:window-width="2558"
     inkscape:window-height="1402"
     id="namedview16"
     showgrid="false"
     showguides="true"
     inkscape:guide-bbox="true"
     inkscape:zoom="4"
     inkscape:cx="146.66246"
     inkscape:cy="-41.9144"
     inkscape:window-x="1920"
     inkscape:window-y="18"
     inkscape:window-maximized="0"
     inkscape:current-layer="svg14"
     inkscape:document-rotation="0" />
  <path
     fill="#e1e8ed"
     d="M 36,31.98362 C 36,29.783327 34.657,28 33,28 H 3 c -1.657,0 -3,1.783327 -3,3.98362 0,2.200292 1.343,3.983619 3,3.983619 h 30 c 1.657,0 3,-1.783327 3,-3.983619 z"
     id="path10"
     style="stroke-width:1.15235" />
  <path
     fill="#e1e8ed"
     d="m 36,22.6 c 0,-2.209333 -1.343,-4 -3,-4 H 3 c -1.657,0 -3,1.790667 -3,4 0,2.209333 1.343,4 3,4 h 30 c 1.657,0 3,-1.790667 3,-4 z"
     id="path10-3"
     style="stroke-width:1.1547" />
  <path
     fill="#e1e8ed"
     d="m 36,13.3 c 0,-2.209333 -1.343,-4 -3,-4 H 3 c -1.657,0 -3,1.790667 -3,4 0,2.209333 1.343,4 3,4 h 30 c 1.657,0 3,-1.790667 3,-4 z"
     id="path10-3-6"
     inkscape:transform-center-x="-0.44444901"
     inkscape:transform-center-y="6.8312783"
     style="stroke-width:1.1547" />
  <path
     fill="#e1e8ed"
     d="M 36,4 C 36,1.7906667 34.657,0 33,0 H 3 C 1.343,0 0,1.7906667 0,4 0,6.2093333 1.343,8 3,8 h 30 c 1.657,0 3,-1.7906667 3,-4 z"
     id="path10-3-5"
     style="stroke-width:1.1547" />
  <rect
     style="fill:#aebbc1;fill-opacity:1;stroke-width:1.22474"
     id="rect72"
     width="2"
     height="6"
     x="3"
     y="29" />
  <rect
     style="fill:#aebbc1;fill-opacity:1;stroke-width:1.22474"
     id="rect72-5"
     width="2"
     height="6"
     x="7"
     y="29" />
  <rect
     style="fill:#aebbc1;fill-opacity:1;stroke-width:1.22474"
     id="rect72-5-6"
     width="2"
     height="6"
     x="11"
     y="29.000437" />
  <rect
     style="fill:#aebbc1;fill-opacity:1;stroke-width:1.22474"
     id="rect72-5-9"
     width="2"
     height="6"
     x="15"
     y="29" />
  <rect
     style="fill:#aebbc1;fill-opacity:1;stroke-width:1.22474"
     id="rect72-5-6-1"
     width="2"
     height="6"
     x="19"
     y="29.000437" />
  <rect
     style="fill:#aebbc1;fill-opacity:1;stroke-width:1.22474"
     id="rect72-27"
     width="2"
     height="6"
     x="23"
     y="29" />
  <rect
     style="fill:#aebbc1;fill-opacity:1;stroke-width:1.22474"
     id="rect72-5-6-9"
     width="2"
     height="6"
     x="27"
     y="29" />
  <g
     id="g1090"
     transform="translate(0.2)">
    <circle
       style="fill:#aebbc1;fill-opacity:1"
       id="path973"
       cx="31.799999"
       cy="29.799999"
       r="0.80000001" />
    <circle
       style="fill:#aebbc1;fill-opacity:1"
       id="path973-6"
       cx="31.799999"
       cy="32"
       r="0.80000001" />
    <circle
       style="fill:#aebbc1;fill-opacity:1"
       id="path973-0"
       cx="31.799999"
       cy="34.220001"
       r="0.80000001" />
  </g>
  <path
     fill="#f5f8fa"
     d="m 3.03559,14.026712 h 2 v 2 h -2 z m 4,0 h 2 v 2 h -2 z m 4,0 h 2 v 2 h -2 z m 4,0 h 2 v 2 h -2 z m 4,0 h 2 v 2 h -2 z m 4,0 h 2 v 2 h -2 z m 4,0 h 2 v 2 h -2 z m 4,0 h 2 v 2 h -2 z"
     id="path12" />
  <path
     fill="#f5f8fa"
     d="m 3.01236,10.697803 h 2 v 2 h -2 z m 4,0 h 2 v 2 h -2 z m 4,0 h 2 v 2 h -2 z m 4,0 h 2 v 2 h -2 z m 4,0 h 2 v 2 h -2 z m 4,0 h 2 v 2 h -2 z m 4,0 h 2 v 2 h -2 z m 4,0 h 2 v 2 h -2 z"
     id="path12-4" />
  <rect
     style="fill:#aebbc1;fill-opacity:1;stroke-width:1.22474"
     id="rect72-7"
     width="2"
     height="6"
     x="3"
     y="19.671589" />
  <rect
     style="fill:#aebbc1;fill-opacity:1;stroke-width:1.22474"
     id="rect72-5-8"
     width="2"
     height="6"
     x="7"
     y="19.671589" />
  <rect
     style="fill:#aebbc1;fill-opacity:1;stroke-width:1.22474"
     id="rect72-5-6-4"
     width="2"
     height="6"
     x="11"
     y="19.672026" />
  <rect
     style="fill:#aebbc1;fill-opacity:1;stroke-width:1.22474"
     id="rect72-5-9-5"
     width="2"
     height="6"
     x="15"
     y="19.671589" />
  <rect
     style="fill:#aebbc1;fill-opacity:1;stroke-width:1.22474"
     id="rect72-5-6-1-0"
     width="2"
     height="6"
     x="19"
     y="19.672026" />
  <rect
     style="fill:#aebbc1;fill-opacity:1;stroke-width:1.22474"
     id="rect72-27-3"
     width="2"
     height="6"
     x="23"
     y="19.671589" />
  <rect
     style="fill:#aebbc1;fill-opacity:1;stroke-width:1.22474"
     id="rect72-5-6-9-6"
     width="2"
     height="6"
     x="27"
     y="19.671589" />
  <g
     id="g1090-1"
     transform="translate(0.2,-9.3284114)">
    <circle
       style="fill:#aebbc1;fill-opacity:1"
       id="path973-06"
       cx="31.799999"
       cy="29.799999"
       r="0.80000001" />
    <circle
       style="fill:#aebbc1;fill-opacity:1"
       id="path973-6-3"
       cx="31.799999"
       cy="32"
       r="0.80000001" />
    <circle
       style="fill:#aebbc1;fill-opacity:1"
       id="path973-0-2"
       cx="31.799999"
       cy="34.220001"
       r="0.80000001" />
  </g>
  <rect
     style="fill:#f5f8fa;fill-opacity:1;stroke-width:1.22474"
     id="rect72-7-0"
     width="2"
     height="6"
     x="3"
     y="1" />
  <circle
     style="fill:#5c9031;fill-opacity:1"
     id="path973-06-1"
     cx="32"
     cy="1.8000002"
     r="0.80000001" />
  <circle
     style="fill:#aebbc1;fill-opacity:1"
     id="path973-6-3-5"
     cx="32"
     cy="4.000001"
     r="0.80000001" />
  <circle
     style="fill:#eb2027;fill-opacity:1"
     id="path973-0-2-5"
     cx="32"
     cy="6.2200022"
     r="0.80000001" />
</svg>
