<?xml version="1.0"?>
<svg version="1.1" viewBox="0 0 36 36" xmlns="http://www.w3.org/2000/svg">
 <path d="m11.805 8.0195c-0.226 0.045-5.5564 1.1694-7.7324 6.6094-0.205 0.513 0.043641 1.0938 0.55664 1.2988 0.122 0.049 0.24709 0.072266 0.37109 0.072266 0.396 0 0.77269-0.23791 0.92969-0.62891 1.765-4.411 6.0845-5.3526 6.2695-5.3906 0.539-0.11 0.88925-0.63578 0.78125-1.1758-0.109-0.541-0.63278-0.89116-1.1758-0.78516zm11.994 0c-0.38194 0.078422-0.6983 0.3767-0.7793 0.7832-0.109 0.542 0.2422 1.0697 0.7832 1.1777 0.045 0.01 4.4896 0.94563 6.2676 5.3906 0.157 0.391 0.53369 0.62891 0.92969 0.62891 0.124 0 0.24914-0.022266 0.36914-0.072266 0.513-0.205 0.76359-0.78778 0.55859-1.3008-2.176-5.44-7.5064-6.5624-7.7324-6.6074-0.1355-0.02675-0.26917-0.026141-0.39648 0zm-11.799 6.4805c-2.957 0-4.397 3.1619-4.457 3.2969-0.092 0.207-0.031469 0.4498 0.14453 0.5918s0.42638 0.14667 0.60938 0.013672c0.013-9e-3 1.2621-0.90234 3.7031-0.90234 2.426 0 3.6732 0.88039 3.7012 0.90039 0.088 0.066 0.19483 0.099609 0.29883 0.099609 0.11 0 0.2215-0.037375 0.3125-0.10938 0.178-0.142 0.23653-0.38575 0.14453-0.59375-0.06-0.135-1.499-3.2969-4.457-3.2969zm12 0c-2.957 0-4.397 3.1619-4.457 3.2969-0.092 0.207-0.032469 0.4498 0.14453 0.5918 0.175 0.142 0.42733 0.14667 0.61133 0.013672 0.012-9e-3 1.2612-0.90234 3.7012-0.90234 2.426 0 3.6732 0.88039 3.7012 0.90039 0.088 0.066 0.19483 0.099609 0.29883 0.099609 0.11 0 0.2215-0.037375 0.3125-0.10938 0.177-0.142 0.23753-0.38575 0.14453-0.59375-0.06-0.135-1.499-3.2969-4.457-3.2969z" fill="#664500"/>
</svg>
