<?xml version="1.0"?>
<svg version="1.1" viewBox="0 0 36 36" xmlns="http://www.w3.org/2000/svg">
 <path d="m7 12c-0.552 0-0.99805 0.44705-0.99805 0.99805-1e-3 0.552 0.44409 0.99995 0.99609 1.002 0.029 0 1.9264 0.022328 3.9844 0.73633-0.593 0.64-0.98242 1.6347-0.98242 2.7637 0 1.934 1.119 3.5 2.5 3.5s2.5-1.566 2.5-3.5c0-0.174-0.019109-0.34081-0.037109-0.50781 0.013 0 0.025109 0.007812 0.037109 0.007812 0.256 0 0.51203-0.097969 0.70703-0.29297 0.391-0.391 0.391-1.0231 0-1.4141-3.255-3.255-8.486-3.293-8.707-3.293zm22 0c-0.221 0-5.451 0.037969-8.707 3.293-0.391 0.391-0.391 1.0231 0 1.4141 0.195 0.195 0.45103 0.29297 0.70703 0.29297 0.013 0 0.023156-0.007813 0.035156-0.007812-0.016 0.167-0.035156 0.33381-0.035156 0.50781 0 1.934 1.119 3.5 2.5 3.5s2.5-1.566 2.5-3.5c0-1.129-0.38942-2.1237-0.98242-2.7637 2.058-0.714 3.9544-0.73633 3.9844-0.73633 0.551-2e-3 0.99709-0.44995 0.99609-1.002-1e-3 -0.551-0.44605-0.99805-0.99805-0.99805z" fill="#664500"/>
</svg>
