<?xml version="1.0"?>
<svg version="1.1" viewBox="0 0 36 36" xmlns="http://www.w3.org/2000/svg">
 <ellipse cx="11.5" cy="16.5" rx="2.5" ry="3.5" fill="#664500"/>
 <path d="m24 14.5c-2.957 0-4.397 3.1619-4.457 3.2969-0.092 0.207-0.032469 0.4498 0.14453 0.5918 0.175 0.142 0.42733 0.14667 0.61133 0.013672 0.012-9e-3 1.2612-0.90234 3.7012-0.90234 2.426 0 3.6732 0.88039 3.7012 0.90039 0.088 0.066 0.19483 0.099609 0.29883 0.099609 0.11 0 0.2215-0.037375 0.3125-0.10938 0.177-0.142 0.23753-0.38575 0.14453-0.59375-0.06-0.135-1.499-3.2969-4.457-3.2969z" fill="#664500"/>
</svg>
