ISO-10303-21;
HEADER;
FILE_DESCRIPTION(('STEP AP203'),'1');
FILE_NAME('Suporte do Roller Superior.stp','2022-12-07T19:14:52',(' '),(' '),'Spatial InterOp 3D',' ',' ');
FILE_SCHEMA(('CONFIG_CONTROL_DESIGN'));
ENDSEC;
DATA;
#1=DESIGN_CONTEXT('',#33,'design');
#2=APPLICATION_PROTOCOL_DEFINITION('INTERNATIONAL STANDARD','config_control_design',1994,#33);
#3=PRODUCT_CATEGORY_RELATIONSHIP('NONE','NONE',#34,#35);
#4=DATE_AND_TIME(#36,#37);
#5=DATE_TIME_ROLE('creation_date');
#6=DATE_TIME_ROLE('classification_date');
#7=PERSON_AND_ORGANIZATION_ROLE('creator');
#8=PERSON_AND_ORGANIZATION_ROLE('design_supplier');
#9=PERSON_AND_ORGANIZATION_ROLE('classification_officer');
#10=PERSON_AND_ORGANIZATION_ROLE('design_owner');
#11=APPROVAL_PERSON_ORGANIZATION(#38,#39,#40);
#12=APPROVAL_DATE_TIME(#4,#39);
#13=CC_DESIGN_APPROVAL(#39,(#41,#42,#43));
#14=CC_DESIGN_DATE_AND_TIME_ASSIGNMENT(#4,#5,(#43));
#15=CC_DESIGN_DATE_AND_TIME_ASSIGNMENT(#4,#6,(#41));
#16=CC_DESIGN_PERSON_AND_ORGANIZATION_ASSIGNMENT(#38,#10,(#44));
#17=CC_DESIGN_PERSON_AND_ORGANIZATION_ASSIGNMENT(#38,#7,(#43));
#18=CC_DESIGN_PERSON_AND_ORGANIZATION_ASSIGNMENT(#38,#7,(#42));
#19=CC_DESIGN_PERSON_AND_ORGANIZATION_ASSIGNMENT(#38,#8,(#42));
#20=CC_DESIGN_SECURITY_CLASSIFICATION(#41,(#42));
#21=CC_DESIGN_PERSON_AND_ORGANIZATION_ASSIGNMENT(#38,#9,(#41));
#22=SHAPE_DEFINITION_REPRESENTATION(#45,#46);
#23= (GEOMETRIC_REPRESENTATION_CONTEXT(3)GLOBAL_UNCERTAINTY_ASSIGNED_CONTEXT((#49))GLOBAL_UNIT_ASSIGNED_CONTEXT((#51,#52,#53))REPRESENTATION_CONTEXT('NONE','WORKSPACE'));
#24=PROPERTY_DEFINITION_REPRESENTATION(#55,#56);
#25=GENERAL_PROPERTY_ASSOCIATION('','',#57,#55);
#26=PROPERTY_DEFINITION_REPRESENTATION(#58,#59);
#27=GENERAL_PROPERTY_ASSOCIATION('','',#60,#58);
#28=PROPERTY_DEFINITION_REPRESENTATION(#61,#62);
#29=GENERAL_PROPERTY_ASSOCIATION('','',#63,#61);
#33=APPLICATION_CONTEXT('CONFIGURATION CONTROLLED 3D DESIGNS OF MECHANICAL PARTS AND ASSEMBLIES');
#34=PRODUCT_CATEGORY('part','NONE');
#35=PRODUCT_RELATED_PRODUCT_CATEGORY('detail',' ',(#44));
#36=CALENDAR_DATE(2022,7,11);
#37=LOCAL_TIME(16,14,52.0,#64);
#38=PERSON_AND_ORGANIZATION(#65,#66);
#39=APPROVAL(#67,'SOLID MODEL');
#40=APPROVAL_ROLE('APPROVED');
#41=SECURITY_CLASSIFICATION('','',#68);
#42=PRODUCT_DEFINITION_FORMATION_WITH_SPECIFIED_SOURCE('A','NONE',#44,.NOT_KNOWN.);
#43=PRODUCT_DEFINITION('','NONE',#42,#1);
#44=PRODUCT('Suporte do Roller Superior','','PART--DESC',(#69));
#45=PRODUCT_DEFINITION_SHAPE('NONE','NONE',#43);
#46=ADVANCED_BREP_SHAPE_REPRESENTATION('1',(#70,#71),#23);
#49=UNCERTAINTY_MEASURE_WITH_UNIT(LENGTH_MEASURE(0.001),#51,'','');
#51= (CONVERSION_BASED_UNIT('MILLIMETRE',#74)LENGTH_UNIT()NAMED_UNIT(#77));
#52= (NAMED_UNIT(#79)PLANE_ANGLE_UNIT()SI_UNIT($,.RADIAN.));
#53= (NAMED_UNIT(#79)SOLID_ANGLE_UNIT()SI_UNIT($,.STERADIAN.));
#55=PROPERTY_DEFINITION('PdmObjectId','',#43);
#56=REPRESENTATION('',(#85),#23);
#57=GENERAL_PROPERTY('','19_00f82d99-4513-4df2-a5c1-c16c200575b9&2_4_0_264','');
#58=PROPERTY_DEFINITION('CreationDate','',#43);
#59=REPRESENTATION('',(#86),#23);
#60=GENERAL_PROPERTY('','11/04/2022 19:03:57','');
#61=PROPERTY_DEFINITION('Minor Revision','',#43);
#62=REPRESENTATION('',(#87),#23);
#63=GENERAL_PROPERTY('','31','');
#64=COORDINATED_UNIVERSAL_TIME_OFFSET(3,0,.BEHIND.);
#65=PERSON('','UNSPECIFIED',$,$,$,$);
#66=ORGANIZATION('UNSPECIFIED','UNSPECIFIED','UNSPECIFIED');
#67=APPROVAL_STATUS('approved');
#68=SECURITY_CLASSIFICATION_LEVEL('unclassified');
#69=MECHANICAL_CONTEXT('',#33,'mechanical');
#70=MANIFOLD_SOLID_BREP('1',#88);
#71=AXIS2_PLACEMENT_3D('',#89,#90,#91);
#74=LENGTH_MEASURE_WITH_UNIT(LENGTH_MEASURE(1.0),#92);
#77=DIMENSIONAL_EXPONENTS(1.0,0.0,0.0,0.0,0.0,0.0,0.0);
#79=DIMENSIONAL_EXPONENTS(0.0,0.0,0.0,0.0,0.0,0.0,0.0);
#85=VALUE_REPRESENTATION_ITEM('19_00f82d99-4513-4df2-a5c1-c16c200575b9&2_4_0_264',);
#86=VALUE_REPRESENTATION_ITEM('11/04/2022 19:03:57',);
#87=VALUE_REPRESENTATION_ITEM('31',);
#88=CLOSED_SHELL('',(#93,#94,#95,#96,#97,#98,#99,#100,#101,#102,#103,#104,#105,#106,#107,#108,#109,#110,#111,#112,#113,#114));
#89=CARTESIAN_POINT('',(0.0,0.0,0.0));
#90=DIRECTION('',(0.0,0.0,1.0));
#91=DIRECTION('',(1.0,0.0,0.0));
#92= (NAMED_UNIT(#77)LENGTH_UNIT()SI_UNIT(.MILLI.,.METRE.));
#93=ADVANCED_FACE('',(#116),#117,.T.);
#94=ADVANCED_FACE('',(#118),#119,.T.);
#95=ADVANCED_FACE('',(#120),#121,.T.);
#96=ADVANCED_FACE('',(#122,#123,#124,#125,#126,#127),#128,.F.);
#97=ADVANCED_FACE('',(#129,#130,#131,#132,#133,#134),#135,.T.);
#98=ADVANCED_FACE('',(#136),#137,.T.);
#99=ADVANCED_FACE('',(#138,#139),#140,.F.);
#100=ADVANCED_FACE('',(#141,#142),#143,.F.);
#101=ADVANCED_FACE('',(#144),#145,.T.);
#102=ADVANCED_FACE('',(#146),#147,.T.);
#103=ADVANCED_FACE('',(#148),#149,.T.);
#104=ADVANCED_FACE('',(#150),#151,.T.);
#105=ADVANCED_FACE('',(#152),#153,.T.);
#106=ADVANCED_FACE('',(#154),#155,.T.);
#107=ADVANCED_FACE('',(#156),#157,.T.);
#108=ADVANCED_FACE('',(#158),#159,.T.);
#109=ADVANCED_FACE('',(#160),#161,.T.);
#110=ADVANCED_FACE('',(#162),#163,.T.);
#111=ADVANCED_FACE('',(#164,#165),#166,.F.);
#112=ADVANCED_FACE('',(#167,#168),#169,.F.);
#113=ADVANCED_FACE('',(#170),#171,.T.);
#114=ADVANCED_FACE('',(#172),#173,.T.);
#116=FACE_OUTER_BOUND('',#174,.T.);
#117=PLANE('',#175);
#118=FACE_OUTER_BOUND('',#176,.T.);
#119=PLANE('',#177);
#120=FACE_OUTER_BOUND('',#178,.T.);
#121=PLANE('',#179);
#122=FACE_OUTER_BOUND('',#180,.T.);
#123=FACE_BOUND('',#181,.T.);
#124=FACE_BOUND('',#182,.T.);
#125=FACE_BOUND('',#183,.T.);
#126=FACE_BOUND('',#184,.T.);
#127=FACE_BOUND('',#185,.T.);
#128=PLANE('',#186);
#129=FACE_OUTER_BOUND('',#187,.T.);
#130=FACE_BOUND('',#188,.T.);
#131=FACE_BOUND('',#189,.T.);
#132=FACE_BOUND('',#190,.T.);
#133=FACE_BOUND('',#191,.T.);
#134=FACE_BOUND('',#192,.T.);
#135=PLANE('',#193);
#136=FACE_OUTER_BOUND('',#194,.T.);
#137=PLANE('',#195);
#138=FACE_OUTER_BOUND('',#196,.T.);
#139=FACE_OUTER_BOUND('',#197,.T.);
#140=CYLINDRICAL_SURFACE('',#198,1.55);
#141=FACE_OUTER_BOUND('',#199,.T.);
#142=FACE_OUTER_BOUND('',#200,.T.);
#143=CYLINDRICAL_SURFACE('',#201,1.55);
#144=FACE_OUTER_BOUND('',#202,.T.);
#145=PLANE('',#203);
#146=FACE_OUTER_BOUND('',#204,.T.);
#147=PLANE('',#205);
#148=FACE_OUTER_BOUND('',#206,.T.);
#149=PLANE('',#207);
#150=FACE_OUTER_BOUND('',#208,.T.);
#151=PLANE('',#209);
#152=FACE_OUTER_BOUND('',#210,.T.);
#153=PLANE('',#211);
#154=FACE_OUTER_BOUND('',#212,.T.);
#155=PLANE('',#213);
#156=FACE_OUTER_BOUND('',#214,.T.);
#157=PLANE('',#215);
#158=FACE_OUTER_BOUND('',#216,.T.);
#159=PLANE('',#217);
#160=FACE_OUTER_BOUND('',#218,.T.);
#161=PLANE('',#219);
#162=FACE_OUTER_BOUND('',#220,.T.);
#163=PLANE('',#221);
#164=FACE_OUTER_BOUND('',#222,.T.);
#165=FACE_OUTER_BOUND('',#223,.T.);
#166=CYLINDRICAL_SURFACE('',#224,1.7);
#167=FACE_OUTER_BOUND('',#225,.T.);
#168=FACE_OUTER_BOUND('',#226,.T.);
#169=CYLINDRICAL_SURFACE('',#227,1.7);
#170=FACE_OUTER_BOUND('',#228,.T.);
#171=PLANE('',#229);
#172=FACE_OUTER_BOUND('',#230,.T.);
#173=PLANE('',#231);
#174=EDGE_LOOP('',(#232,#233,#234,#235));
#175=AXIS2_PLACEMENT_3D('',#236,#237,#238);
#176=EDGE_LOOP('',(#239,#240,#241,#242));
#177=AXIS2_PLACEMENT_3D('',#243,#244,#245);
#178=EDGE_LOOP('',(#246,#247,#248,#249));
#179=AXIS2_PLACEMENT_3D('',#250,#251,#252);
#180=EDGE_LOOP('',(#253,#254,#255,#256,#257,#258,#259,#260,#261,#262,#263,#264));
#181=EDGE_LOOP('',(#265));
#182=EDGE_LOOP('',(#266));
#183=EDGE_LOOP('',(#267));
#184=EDGE_LOOP('',(#268));
#185=EDGE_LOOP('',(#269,#270,#271,#272));
#186=AXIS2_PLACEMENT_3D('',#273,#274,#275);
#187=EDGE_LOOP('',(#276,#277,#278,#279,#280,#281,#282,#283,#284,#285,#286,#287));
#188=EDGE_LOOP('',(#288));
#189=EDGE_LOOP('',(#289));
#190=EDGE_LOOP('',(#290));
#191=EDGE_LOOP('',(#291));
#192=EDGE_LOOP('',(#292,#293,#294,#295));
#193=AXIS2_PLACEMENT_3D('',#296,#297,#298);
#194=EDGE_LOOP('',(#299,#300,#301,#302));
#195=AXIS2_PLACEMENT_3D('',#303,#304,#305);
#196=EDGE_LOOP('',(#306));
#197=EDGE_LOOP('',(#307));
#198=AXIS2_PLACEMENT_3D('',#308,#309,#310);
#199=EDGE_LOOP('',(#311));
#200=EDGE_LOOP('',(#312));
#201=AXIS2_PLACEMENT_3D('',#313,#314,#315);
#202=EDGE_LOOP('',(#316,#317,#318,#319));
#203=AXIS2_PLACEMENT_3D('',#320,#321,#322);
#204=EDGE_LOOP('',(#323,#324,#325,#326));
#205=AXIS2_PLACEMENT_3D('',#327,#328,#329);
#206=EDGE_LOOP('',(#330,#331,#332,#333));
#207=AXIS2_PLACEMENT_3D('',#334,#335,#336);
#208=EDGE_LOOP('',(#337,#338,#339,#340));
#209=AXIS2_PLACEMENT_3D('',#341,#342,#343);
#210=EDGE_LOOP('',(#344,#345,#346,#347));
#211=AXIS2_PLACEMENT_3D('',#348,#349,#350);
#212=EDGE_LOOP('',(#351,#352,#353,#354));
#213=AXIS2_PLACEMENT_3D('',#355,#356,#357);
#214=EDGE_LOOP('',(#358,#359,#360,#361));
#215=AXIS2_PLACEMENT_3D('',#362,#363,#364);
#216=EDGE_LOOP('',(#365,#366,#367,#368));
#217=AXIS2_PLACEMENT_3D('',#369,#370,#371);
#218=EDGE_LOOP('',(#372,#373,#374,#375));
#219=AXIS2_PLACEMENT_3D('',#376,#377,#378);
#220=EDGE_LOOP('',(#379,#380,#381,#382));
#221=AXIS2_PLACEMENT_3D('',#383,#384,#385);
#222=EDGE_LOOP('',(#386));
#223=EDGE_LOOP('',(#387));
#224=AXIS2_PLACEMENT_3D('',#388,#389,#390);
#225=EDGE_LOOP('',(#391));
#226=EDGE_LOOP('',(#392));
#227=AXIS2_PLACEMENT_3D('',#393,#394,#395);
#228=EDGE_LOOP('',(#396,#397,#398,#399));
#229=AXIS2_PLACEMENT_3D('',#400,#401,#402);
#230=EDGE_LOOP('',(#403,#404,#405,#406));
#231=AXIS2_PLACEMENT_3D('',#407,#408,#409);
#232=ORIENTED_EDGE('',*,*,#410,.F.);
#233=ORIENTED_EDGE('',*,*,#411,.F.);
#234=ORIENTED_EDGE('',*,*,#412,.T.);
#235=ORIENTED_EDGE('',*,*,#413,.T.);
#236=CARTESIAN_POINT('',(4.02435425180223E-14,44.9999999999393,-58.9999999999216));
#237=DIRECTION('',(-1.62287435757787E-29,-1.0,3.3446381819994E-12));
#238=DIRECTION('',(-1.0,2.80259692864963E-44,-4.85216716807234E-18));
#239=ORIENTED_EDGE('',*,*,#414,.F.);
#240=ORIENTED_EDGE('',*,*,#415,.F.);
#241=ORIENTED_EDGE('',*,*,#413,.F.);
#242=ORIENTED_EDGE('',*,*,#416,.T.);
#243=CARTESIAN_POINT('',(-38.0,59.4999999999723,-58.9999999999701));
#244=DIRECTION('',(-1.0,-6.12303176911189E-17,-4.85216716786755E-18));
#245=DIRECTION('',(-6.12303176911027E-17,1.0,-3.3446381819994E-12));
#246=ORIENTED_EDGE('',*,*,#417,.F.);
#247=ORIENTED_EDGE('',*,*,#418,.F.);
#248=ORIENTED_EDGE('',*,*,#419,.F.);
#249=ORIENTED_EDGE('',*,*,#420,.T.);
#250=CARTESIAN_POINT('',(38.0,59.4999999999727,-58.9999999999701));
#251=DIRECTION('',(1.0,-6.12303176911189E-17,4.85216716827714E-18));
#252=DIRECTION('',(-6.12303176911351E-17,-1.0,3.3446381819994E-12));
#253=ORIENTED_EDGE('',*,*,#421,.F.);
#254=ORIENTED_EDGE('',*,*,#422,.F.);
#255=ORIENTED_EDGE('',*,*,#423,.F.);
#256=ORIENTED_EDGE('',*,*,#420,.F.);
#257=ORIENTED_EDGE('',*,*,#424,.F.);
#258=ORIENTED_EDGE('',*,*,#425,.F.);
#259=ORIENTED_EDGE('',*,*,#426,.F.);
#260=ORIENTED_EDGE('',*,*,#427,.F.);
#261=ORIENTED_EDGE('',*,*,#428,.F.);
#262=ORIENTED_EDGE('',*,*,#416,.F.);
#263=ORIENTED_EDGE('',*,*,#412,.F.);
#264=ORIENTED_EDGE('',*,*,#429,.F.);
#265=ORIENTED_EDGE('',*,*,#430,.F.);
#266=ORIENTED_EDGE('',*,*,#431,.F.);
#267=ORIENTED_EDGE('',*,*,#432,.F.);
#268=ORIENTED_EDGE('',*,*,#433,.F.);
#269=ORIENTED_EDGE('',*,*,#434,.F.);
#270=ORIENTED_EDGE('',*,*,#435,.F.);
#271=ORIENTED_EDGE('',*,*,#436,.F.);
#272=ORIENTED_EDGE('',*,*,#437,.F.);
#273=CARTESIAN_POINT('',(0.0,-1.97325313640502E-10,-58.9999999997711));
#274=DIRECTION('',(4.85216716807234E-18,-3.3446381819994E-12,-1.0));
#275=DIRECTION('',(-1.0,0.0,-4.85216716807234E-18));
#276=ORIENTED_EDGE('',*,*,#438,.F.);
#277=ORIENTED_EDGE('',*,*,#439,.T.);
#278=ORIENTED_EDGE('',*,*,#410,.T.);
#279=ORIENTED_EDGE('',*,*,#415,.T.);
#280=ORIENTED_EDGE('',*,*,#440,.F.);
#281=ORIENTED_EDGE('',*,*,#441,.F.);
#282=ORIENTED_EDGE('',*,*,#442,.F.);
#283=ORIENTED_EDGE('',*,*,#443,.T.);
#284=ORIENTED_EDGE('',*,*,#444,.T.);
#285=ORIENTED_EDGE('',*,*,#418,.T.);
#286=ORIENTED_EDGE('',*,*,#445,.F.);
#287=ORIENTED_EDGE('',*,*,#446,.F.);
#288=ORIENTED_EDGE('',*,*,#447,.F.);
#289=ORIENTED_EDGE('',*,*,#448,.F.);
#290=ORIENTED_EDGE('',*,*,#449,.F.);
#291=ORIENTED_EDGE('',*,*,#450,.F.);
#292=ORIENTED_EDGE('',*,*,#451,.F.);
#293=ORIENTED_EDGE('',*,*,#452,.F.);
#294=ORIENTED_EDGE('',*,*,#453,.F.);
#295=ORIENTED_EDGE('',*,*,#454,.F.);
#296=CARTESIAN_POINT('',(1.94086686722894E-17,-2.107038663685E-10,-62.9999999997711));
#297=DIRECTION('',(4.85216716807234E-18,-3.3446381819994E-12,-1.0));
#298=DIRECTION('',(-1.0,0.0,-4.85216716807234E-18));
#299=ORIENTED_EDGE('',*,*,#444,.F.);
#300=ORIENTED_EDGE('',*,*,#455,.F.);
#301=ORIENTED_EDGE('',*,*,#424,.T.);
#302=ORIENTED_EDGE('',*,*,#419,.T.);
#303=CARTESIAN_POINT('',(4.02435425180228E-14,74.0000000000057,-59.0000000000186));
#304=DIRECTION('',(1.22460635382254E-16,1.0,-3.3446381819994E-12));
#305=DIRECTION('',(1.0,-1.22460635382238E-16,4.85216716848193E-18));
#306=ORIENTED_EDGE('',*,*,#450,.T.);
#307=ORIENTED_EDGE('',*,*,#430,.T.);
#308=CARTESIAN_POINT('',(-35.5,71.4999999999285,-63.0000000000102));
#309=DIRECTION('',(-4.85216716807234E-18,3.3446381819994E-12,1.0));
#310=DIRECTION('',(-1.0,0.0,-4.85216716807234E-18));
#311=ORIENTED_EDGE('',*,*,#449,.T.);
#312=ORIENTED_EDGE('',*,*,#431,.T.);
#313=CARTESIAN_POINT('',(35.4999999999993,71.4999999999043,-63.0000000000102));
#314=DIRECTION('',(-4.85216716807234E-18,3.3446381819994E-12,1.0));
#315=DIRECTION('',(-1.0,0.0,-4.85216716807234E-18));
#316=ORIENTED_EDGE('',*,*,#436,.T.);
#317=ORIENTED_EDGE('',*,*,#456,.F.);
#318=ORIENTED_EDGE('',*,*,#454,.T.);
#319=ORIENTED_EDGE('',*,*,#457,.T.);
#320=CARTESIAN_POINT('',(-3.99999999999993,56.999999999926,-62.9999999999617));
#321=DIRECTION('',(1.0,6.12303176911189E-17,4.85216716786755E-18));
#322=DIRECTION('',(-6.12303176911027E-17,1.0,-3.3446381819994E-12));
#323=ORIENTED_EDGE('',*,*,#437,.T.);
#324=ORIENTED_EDGE('',*,*,#457,.F.);
#325=ORIENTED_EDGE('',*,*,#453,.T.);
#326=ORIENTED_EDGE('',*,*,#458,.T.);
#327=CARTESIAN_POINT('',(14.0,64.999999999926,-62.9999999999885));
#328=DIRECTION('',(-1.22460635382254E-16,-1.0,3.3446381819994E-12));
#329=DIRECTION('',(1.0,-1.22460635382238E-16,4.85216716848193E-18));
#330=ORIENTED_EDGE('',*,*,#435,.T.);
#331=ORIENTED_EDGE('',*,*,#459,.F.);
#332=ORIENTED_EDGE('',*,*,#451,.T.);
#333=ORIENTED_EDGE('',*,*,#456,.T.);
#334=CARTESIAN_POINT('',(14.0,48.999999999926,-62.999999999935));
#335=DIRECTION('',(1.62287435757787E-29,1.0,-3.3446381819994E-12));
#336=DIRECTION('',(-1.0,2.81672766946636E-44,-4.85216716807234E-18));
#337=ORIENTED_EDGE('',*,*,#434,.T.);
#338=ORIENTED_EDGE('',*,*,#458,.F.);
#339=ORIENTED_EDGE('',*,*,#452,.T.);
#340=ORIENTED_EDGE('',*,*,#459,.T.);
#341=CARTESIAN_POINT('',(32.0,56.999999999926,-62.9999999999617));
#342=DIRECTION('',(-1.0,6.12303176911189E-17,-4.85216716827714E-18));
#343=DIRECTION('',(-6.12303176911351E-17,-1.0,3.3446381819994E-12));
#344=ORIENTED_EDGE('',*,*,#423,.T.);
#345=ORIENTED_EDGE('',*,*,#460,.F.);
#346=ORIENTED_EDGE('',*,*,#445,.T.);
#347=ORIENTED_EDGE('',*,*,#417,.T.);
#348=CARTESIAN_POINT('',(37.0,50.0999999998822,-62.9999999999387));
#349=DIRECTION('',(-3.55271367880052E-15,-1.0,3.3446381819994E-12));
#350=DIRECTION('',(1.0,-3.5527136788005E-15,4.85216717995489E-18));
#351=ORIENTED_EDGE('',*,*,#422,.T.);
#352=ORIENTED_EDGE('',*,*,#461,.F.);
#353=ORIENTED_EDGE('',*,*,#446,.T.);
#354=ORIENTED_EDGE('',*,*,#460,.T.);
#355=CARTESIAN_POINT('',(36.0,48.5499999998821,-62.9999999999335));
#356=DIRECTION('',(1.0,-4.62458305157398E-15,4.8521671835399E-18));
#357=DIRECTION('',(4.624583051574E-15,1.0,-3.3446381819994E-12));
#358=ORIENTED_EDGE('',*,*,#421,.T.);
#359=ORIENTED_EDGE('',*,*,#462,.F.);
#360=ORIENTED_EDGE('',*,*,#438,.T.);
#361=ORIENTED_EDGE('',*,*,#461,.T.);
#362=CARTESIAN_POINT('',(37.0,46.9999999998821,-62.9999999999283));
#363=DIRECTION('',(3.55271367880052E-15,1.0,-3.3446381819994E-12));
#364=DIRECTION('',(-1.0,3.5527136788005E-15,-4.85216717995489E-18));
#365=ORIENTED_EDGE('',*,*,#428,.T.);
#366=ORIENTED_EDGE('',*,*,#463,.F.);
#367=ORIENTED_EDGE('',*,*,#440,.T.);
#368=ORIENTED_EDGE('',*,*,#414,.T.);
#369=CARTESIAN_POINT('',(-37.0,46.999999999926,-62.9999999999283));
#370=DIRECTION('',(3.67517431418276E-15,1.0,-3.3446381819994E-12));
#371=DIRECTION('',(-1.0,3.67517431418274E-15,-4.85216718036447E-18));
#372=ORIENTED_EDGE('',*,*,#426,.T.);
#373=ORIENTED_EDGE('',*,*,#464,.F.);
#374=ORIENTED_EDGE('',*,*,#442,.T.);
#375=ORIENTED_EDGE('',*,*,#465,.T.);
#376=CARTESIAN_POINT('',(-37.0,50.099999999926,-62.9999999999387));
#377=DIRECTION('',(-3.67517431418276E-15,-1.0,3.3446381819994E-12));
#378=DIRECTION('',(1.0,-3.67517431418274E-15,4.85216718036447E-18));
#379=ORIENTED_EDGE('',*,*,#427,.T.);
#380=ORIENTED_EDGE('',*,*,#465,.F.);
#381=ORIENTED_EDGE('',*,*,#441,.T.);
#382=ORIENTED_EDGE('',*,*,#463,.T.);
#383=CARTESIAN_POINT('',(-36.0,48.549999999926,-62.9999999999335));
#384=DIRECTION('',(-1.0,2.28167636694143E-15,-4.85216717570373E-18));
#385=DIRECTION('',(-2.28167636694145E-15,-1.0,3.3446381819994E-12));
#386=ORIENTED_EDGE('',*,*,#447,.T.);
#387=ORIENTED_EDGE('',*,*,#433,.T.);
#388=CARTESIAN_POINT('',(35.5,53.999999999926,-62.9999999999517));
#389=DIRECTION('',(-4.85214882888335E-18,3.34463818199525E-12,1.0));
#390=DIRECTION('',(1.0,-3.71054829767437E-17,4.85214882900745E-18));
#391=ORIENTED_EDGE('',*,*,#448,.T.);
#392=ORIENTED_EDGE('',*,*,#432,.T.);
#393=CARTESIAN_POINT('',(-35.5,53.999999999926,-62.9999999999517));
#394=DIRECTION('',(-4.85220176876357E-18,3.3446381820027E-12,1.0));
#395=DIRECTION('',(-1.0,-5.88741539490848E-17,-4.85220176856666E-18));
#396=ORIENTED_EDGE('',*,*,#439,.F.);
#397=ORIENTED_EDGE('',*,*,#462,.T.);
#398=ORIENTED_EDGE('',*,*,#429,.T.);
#399=ORIENTED_EDGE('',*,*,#411,.T.);
#400=CARTESIAN_POINT('',(38.0,59.4999999999727,-58.9999999999701));
#401=DIRECTION('',(1.0,-6.12303176911189E-17,4.85216716827714E-18));
#402=DIRECTION('',(-6.12303176911351E-17,-1.0,3.3446381819994E-12));
#403=ORIENTED_EDGE('',*,*,#443,.F.);
#404=ORIENTED_EDGE('',*,*,#464,.T.);
#405=ORIENTED_EDGE('',*,*,#425,.T.);
#406=ORIENTED_EDGE('',*,*,#455,.T.);
#407=CARTESIAN_POINT('',(-38.0,59.4999999999723,-58.9999999999701));
#408=DIRECTION('',(-1.0,-6.12303176911189E-17,-4.85216716786755E-18));
#409=DIRECTION('',(-6.12303176911027E-17,1.0,-3.3446381819994E-12));
#410=EDGE_CURVE('',#466,#467,#468,.T.);
#411=EDGE_CURVE('',#469,#466,#470,.T.);
#412=EDGE_CURVE('',#469,#471,#472,.T.);
#413=EDGE_CURVE('',#471,#467,#473,.T.);
#414=EDGE_CURVE('',#474,#475,#476,.T.);
#415=EDGE_CURVE('',#467,#474,#477,.T.);
#416=EDGE_CURVE('',#471,#475,#478,.T.);
#417=EDGE_CURVE('',#479,#480,#481,.T.);
#418=EDGE_CURVE('',#482,#479,#483,.T.);
#419=EDGE_CURVE('',#484,#482,#485,.T.);
#420=EDGE_CURVE('',#484,#480,#486,.T.);
#421=EDGE_CURVE('',#487,#488,#489,.T.);
#422=EDGE_CURVE('',#490,#487,#491,.T.);
#423=EDGE_CURVE('',#480,#490,#492,.T.);
#424=EDGE_CURVE('',#493,#484,#494,.T.);
#425=EDGE_CURVE('',#495,#493,#496,.T.);
#426=EDGE_CURVE('',#497,#495,#498,.T.);
#427=EDGE_CURVE('',#499,#497,#500,.T.);
#428=EDGE_CURVE('',#475,#499,#501,.T.);
#429=EDGE_CURVE('',#488,#469,#502,.T.);
#430=EDGE_CURVE('',#503,#503,#504,.F.);
#431=EDGE_CURVE('',#505,#505,#506,.F.);
#432=EDGE_CURVE('',#507,#507,#508,.F.);
#433=EDGE_CURVE('',#509,#509,#510,.F.);
#434=EDGE_CURVE('',#511,#512,#513,.T.);
#435=EDGE_CURVE('',#514,#511,#515,.T.);
#436=EDGE_CURVE('',#516,#514,#517,.T.);
#437=EDGE_CURVE('',#512,#516,#518,.T.);
#438=EDGE_CURVE('',#519,#520,#521,.T.);
#439=EDGE_CURVE('',#519,#466,#522,.T.);
#440=EDGE_CURVE('',#523,#474,#524,.T.);
#441=EDGE_CURVE('',#525,#523,#526,.T.);
#442=EDGE_CURVE('',#527,#525,#528,.T.);
#443=EDGE_CURVE('',#527,#529,#530,.T.);
#444=EDGE_CURVE('',#529,#482,#531,.T.);
#445=EDGE_CURVE('',#532,#479,#533,.T.);
#446=EDGE_CURVE('',#520,#532,#534,.T.);
#447=EDGE_CURVE('',#535,#535,#536,.T.);
#448=EDGE_CURVE('',#537,#537,#538,.T.);
#449=EDGE_CURVE('',#539,#539,#540,.T.);
#450=EDGE_CURVE('',#541,#541,#542,.T.);
#451=EDGE_CURVE('',#543,#544,#545,.T.);
#452=EDGE_CURVE('',#546,#543,#547,.T.);
#453=EDGE_CURVE('',#548,#546,#549,.T.);
#454=EDGE_CURVE('',#544,#548,#550,.T.);
#455=EDGE_CURVE('',#493,#529,#551,.T.);
#456=EDGE_CURVE('',#544,#514,#552,.T.);
#457=EDGE_CURVE('',#548,#516,#553,.T.);
#458=EDGE_CURVE('',#546,#512,#554,.T.);
#459=EDGE_CURVE('',#543,#511,#555,.T.);
#460=EDGE_CURVE('',#532,#490,#556,.T.);
#461=EDGE_CURVE('',#520,#487,#557,.T.);
#462=EDGE_CURVE('',#519,#488,#558,.T.);
#463=EDGE_CURVE('',#523,#499,#559,.T.);
#464=EDGE_CURVE('',#527,#495,#560,.T.);
#465=EDGE_CURVE('',#525,#497,#561,.T.);
#466=VERTEX_POINT('',#562);
#467=VERTEX_POINT('',#563);
#468=LINE('',#564,#565);
#469=VERTEX_POINT('',#566);
#470=LINE('',#567,#568);
#471=VERTEX_POINT('',#569);
#472=LINE('',#570,#571);
#473=LINE('',#572,#573);
#474=VERTEX_POINT('',#574);
#475=VERTEX_POINT('',#575);
#476=LINE('',#576,#577);
#477=LINE('',#578,#579);
#478=LINE('',#580,#581);
#479=VERTEX_POINT('',#582);
#480=VERTEX_POINT('',#583);
#481=LINE('',#584,#585);
#482=VERTEX_POINT('',#586);
#483=LINE('',#587,#588);
#484=VERTEX_POINT('',#589);
#485=LINE('',#590,#591);
#486=LINE('',#592,#593);
#487=VERTEX_POINT('',#594);
#488=VERTEX_POINT('',#595);
#489=LINE('',#596,#597);
#490=VERTEX_POINT('',#598);
#491=LINE('',#599,#600);
#492=LINE('',#601,#602);
#493=VERTEX_POINT('',#603);
#494=LINE('',#604,#605);
#495=VERTEX_POINT('',#606);
#496=LINE('',#607,#608);
#497=VERTEX_POINT('',#609);
#498=LINE('',#610,#611);
#499=VERTEX_POINT('',#612);
#500=LINE('',#613,#614);
#501=LINE('',#615,#616);
#502=LINE('',#617,#618);
#503=VERTEX_POINT('',#619);
#504=CIRCLE('',#620,1.55);
#505=VERTEX_POINT('',#621);
#506=CIRCLE('',#622,1.55);
#507=VERTEX_POINT('',#623);
#508=CIRCLE('',#624,1.7);
#509=VERTEX_POINT('',#625);
#510=CIRCLE('',#626,1.7);
#511=VERTEX_POINT('',#627);
#512=VERTEX_POINT('',#628);
#513=LINE('',#629,#630);
#514=VERTEX_POINT('',#631);
#515=LINE('',#632,#633);
#516=VERTEX_POINT('',#634);
#517=LINE('',#635,#636);
#518=LINE('',#637,#638);
#519=VERTEX_POINT('',#639);
#520=VERTEX_POINT('',#640);
#521=LINE('',#641,#642);
#522=LINE('',#643,#644);
#523=VERTEX_POINT('',#645);
#524=LINE('',#646,#647);
#525=VERTEX_POINT('',#648);
#526=LINE('',#649,#650);
#527=VERTEX_POINT('',#651);
#528=LINE('',#652,#653);
#529=VERTEX_POINT('',#654);
#530=LINE('',#655,#656);
#531=LINE('',#657,#658);
#532=VERTEX_POINT('',#659);
#533=LINE('',#660,#661);
#534=LINE('',#662,#663);
#535=VERTEX_POINT('',#664);
#536=CIRCLE('',#665,1.7);
#537=VERTEX_POINT('',#666);
#538=CIRCLE('',#667,1.7);
#539=VERTEX_POINT('',#668);
#540=CIRCLE('',#669,1.55);
#541=VERTEX_POINT('',#670);
#542=CIRCLE('',#671,1.55);
#543=VERTEX_POINT('',#672);
#544=VERTEX_POINT('',#673);
#545=LINE('',#674,#675);
#546=VERTEX_POINT('',#676);
#547=LINE('',#677,#678);
#548=VERTEX_POINT('',#679);
#549=LINE('',#680,#681);
#550=LINE('',#682,#683);
#551=LINE('',#684,#685);
#552=LINE('',#686,#687);
#553=LINE('',#688,#689);
#554=LINE('',#690,#691);
#555=LINE('',#692,#693);
#556=LINE('',#694,#695);
#557=LINE('',#696,#697);
#558=LINE('',#698,#699);
#559=LINE('',#700,#701);
#560=LINE('',#702,#703);
#561=LINE('',#704,#705);
#562=CARTESIAN_POINT('',(38.0,44.999999999926,-62.9999999999216));
#563=CARTESIAN_POINT('',(-38.0,44.999999999926,-62.9999999999216));
#564=CARTESIAN_POINT('',(4.02629511866946E-14,44.999999999926,-62.9999999999216));
#565=VECTOR('',#706,1.0);
#566=CARTESIAN_POINT('',(38.0,44.9999999999393,-58.9999999999216));
#567=CARTESIAN_POINT('',(38.0,44.9999999999393,-58.9999999999216));
#568=VECTOR('',#707,1.0);
#569=CARTESIAN_POINT('',(-38.0,44.9999999999393,-58.9999999999216));
#570=CARTESIAN_POINT('',(4.02435425180223E-14,44.9999999999393,-58.9999999999216));
#571=VECTOR('',#708,1.0);
#572=CARTESIAN_POINT('',(-38.0,44.9999999999393,-58.9999999999216));
#573=VECTOR('',#709,1.0);
#574=CARTESIAN_POINT('',(-38.0,46.999999999926,-62.9999999999283));
#575=CARTESIAN_POINT('',(-38.0,46.9999999999393,-58.9999999999283));
#576=CARTESIAN_POINT('',(-38.0,46.999999999926,-62.9999999999283));
#577=VECTOR('',#710,1.0);
#578=CARTESIAN_POINT('',(-38.0,59.4999999999589,-62.9999999999701));
#579=VECTOR('',#711,1.0);
#580=CARTESIAN_POINT('',(-38.0,59.4999999999723,-58.9999999999701));
#581=VECTOR('',#712,1.0);
#582=CARTESIAN_POINT('',(38.0,50.0999999998822,-62.9999999999387));
#583=CARTESIAN_POINT('',(38.0,50.0999999998956,-58.9999999999387));
#584=CARTESIAN_POINT('',(38.0,50.0999999998822,-62.9999999999387));
#585=VECTOR('',#713,1.0);
#586=CARTESIAN_POINT('',(38.0,73.9999999999923,-63.0000000000186));
#587=CARTESIAN_POINT('',(38.0,59.4999999999593,-62.9999999999701));
#588=VECTOR('',#714,1.0);
#589=CARTESIAN_POINT('',(38.0,74.0000000000057,-59.0000000000186));
#590=CARTESIAN_POINT('',(38.0,74.0000000000057,-59.0000000000186));
#591=VECTOR('',#715,1.0);
#592=CARTESIAN_POINT('',(38.0,59.4999999999727,-58.9999999999701));
#593=VECTOR('',#716,1.0);
#594=CARTESIAN_POINT('',(36.0,46.9999999998955,-58.9999999999335));
#595=CARTESIAN_POINT('',(38.0,46.9999999998955,-58.9999999999283));
#596=CARTESIAN_POINT('',(1.66977542903954E-13,46.9999999998956,-58.9999999999283));
#597=VECTOR('',#717,1.0);
#598=CARTESIAN_POINT('',(36.0,50.0999999998956,-58.9999999999387));
#599=CARTESIAN_POINT('',(36.0,-1.97491798630359E-10,-58.9999999997711));
#600=VECTOR('',#718,1.0);
#601=CARTESIAN_POINT('',(1.77990955308236E-13,50.0999999998957,-58.9999999999387));
#602=VECTOR('',#719,1.0);
#603=CARTESIAN_POINT('',(-38.0,74.0000000000053,-59.0000000000186));
#604=CARTESIAN_POINT('',(4.02435425180228E-14,74.0000000000057,-59.0000000000186));
#605=VECTOR('',#720,1.0);
#606=CARTESIAN_POINT('',(-38.0,50.0999999999393,-58.9999999999387));
#607=CARTESIAN_POINT('',(-38.0,59.4999999999723,-58.9999999999701));
#608=VECTOR('',#721,1.0);
#609=CARTESIAN_POINT('',(-36.0,50.0999999999393,-58.9999999999335));
#610=CARTESIAN_POINT('',(1.84126233141058E-13,50.0999999999392,-58.9999999999387));
#611=VECTOR('',#722,1.0);
#612=CARTESIAN_POINT('',(-36.0,46.9999999999393,-58.9999999999335));
#613=CARTESIAN_POINT('',(-36.0,-1.97243173291293E-10,-58.9999999997711));
#614=VECTOR('',#723,1.0);
#615=CARTESIAN_POINT('',(1.72733192767092E-13,46.9999999999392,-58.9999999999283));
#616=VECTOR('',#724,1.0);
#617=CARTESIAN_POINT('',(38.0,59.4999999999727,-58.9999999999701));
#618=VECTOR('',#725,1.0);
#619=CARTESIAN_POINT('',(-35.5,73.0499999999419,-59.0000000000155));
#620=AXIS2_PLACEMENT_3D('',#726,#727,#728);
#621=CARTESIAN_POINT('',(35.4999999999993,73.0499999999177,-59.0000000000155));
#622=AXIS2_PLACEMENT_3D('',#729,#730,#731);
#623=CARTESIAN_POINT('',(-35.5,55.6999999999394,-58.9999999999574));
#624=AXIS2_PLACEMENT_3D('',#732,#733,#734);
#625=CARTESIAN_POINT('',(35.5,55.6999999999394,-58.9999999999574));
#626=AXIS2_PLACEMENT_3D('',#735,#736,#737);
#627=CARTESIAN_POINT('',(32.0,48.9999999999394,-58.999999999935));
#628=CARTESIAN_POINT('',(32.0,64.9999999999394,-58.9999999999885));
#629=CARTESIAN_POINT('',(32.0,-1.97327273010669E-10,-58.9999999997711));
#630=VECTOR('',#738,1.0);
#631=CARTESIAN_POINT('',(-3.99999999999993,48.9999999999394,-58.9999999999618));
#632=CARTESIAN_POINT('',(7.95208435215371E-28,48.9999999999394,-58.999999999935));
#633=VECTOR('',#739,1.0);
#634=CARTESIAN_POINT('',(-3.99999999999993,64.9999999999394,-58.9999999999885));
#635=CARTESIAN_POINT('',(-3.99999999999993,-1.97325558561773E-10,-58.9999999997711));
#636=VECTOR('',#740,1.0);
#637=CARTESIAN_POINT('',(7.95994129986325E-15,64.9999999999394,-58.9999999999885));
#638=VECTOR('',#741,1.0);
#639=CARTESIAN_POINT('',(38.0,46.9999999998821,-62.9999999999283));
#640=CARTESIAN_POINT('',(36.0,46.9999999998821,-62.9999999999283));
#641=CARTESIAN_POINT('',(37.0,46.9999999998821,-62.9999999999283));
#642=VECTOR('',#742,1.0);
#643=CARTESIAN_POINT('',(38.0,59.4999999999593,-62.9999999999701));
#644=VECTOR('',#743,1.0);
#645=CARTESIAN_POINT('',(-36.0,46.999999999926,-62.9999999999283));
#646=CARTESIAN_POINT('',(-37.0,46.999999999926,-62.9999999999283));
#647=VECTOR('',#744,1.0);
#648=CARTESIAN_POINT('',(-36.0,50.0999999999594,-62.9999999999387));
#649=CARTESIAN_POINT('',(-36.0,48.549999999926,-62.9999999999335));
#650=VECTOR('',#745,1.0);
#651=CARTESIAN_POINT('',(-38.0,50.099999999926,-62.9999999999387));
#652=CARTESIAN_POINT('',(-37.0,50.099999999926,-62.9999999999387));
#653=VECTOR('',#746,1.0);
#654=CARTESIAN_POINT('',(-38.0,73.9999999999919,-63.0000000000186));
#655=CARTESIAN_POINT('',(-38.0,59.4999999999589,-62.9999999999701));
#656=VECTOR('',#747,1.0);
#657=CARTESIAN_POINT('',(4.02629511866951E-14,73.9999999999923,-63.0000000000186));
#658=VECTOR('',#748,1.0);
#659=CARTESIAN_POINT('',(36.0,50.0999999998822,-62.9999999999387));
#660=CARTESIAN_POINT('',(37.0,50.0999999998822,-62.9999999999387));
#661=VECTOR('',#749,1.0);
#662=CARTESIAN_POINT('',(36.0,48.5499999998821,-62.9999999999335));
#663=VECTOR('',#750,1.0);
#664=CARTESIAN_POINT('',(37.2,53.999999999926,-62.9999999999517));
#665=AXIS2_PLACEMENT_3D('',#751,#752,#753);
#666=CARTESIAN_POINT('',(-37.2,53.999999999926,-62.9999999999517));
#667=AXIS2_PLACEMENT_3D('',#754,#755,#756);
#668=CARTESIAN_POINT('',(33.9499999999993,71.4999999999043,-63.0000000000102));
#669=AXIS2_PLACEMENT_3D('',#757,#758,#759);
#670=CARTESIAN_POINT('',(-37.05,71.4999999999285,-63.0000000000102));
#671=AXIS2_PLACEMENT_3D('',#760,#761,#762);
#672=CARTESIAN_POINT('',(32.0,48.999999999926,-62.999999999935));
#673=CARTESIAN_POINT('',(-3.99999999999993,48.999999999926,-62.999999999935));
#674=CARTESIAN_POINT('',(14.0,48.999999999926,-62.999999999935));
#675=VECTOR('',#763,1.0);
#676=CARTESIAN_POINT('',(32.0,64.999999999926,-62.9999999999885));
#677=CARTESIAN_POINT('',(32.0,56.999999999926,-62.9999999999617));
#678=VECTOR('',#764,1.0);
#679=CARTESIAN_POINT('',(-3.99999999999994,64.999999999926,-62.9999999999885));
#680=CARTESIAN_POINT('',(14.0,64.999999999926,-62.9999999999885));
#681=VECTOR('',#765,1.0);
#682=CARTESIAN_POINT('',(-3.99999999999993,56.999999999926,-62.9999999999617));
#683=VECTOR('',#766,1.0);
#684=CARTESIAN_POINT('',(-38.0,74.0000000000053,-59.0000000000186));
#685=VECTOR('',#767,1.0);
#686=CARTESIAN_POINT('',(-3.99999999999993,48.999999999926,-62.999999999935));
#687=VECTOR('',#768,1.0);
#688=CARTESIAN_POINT('',(-3.99999999999993,64.999999999926,-62.9999999999885));
#689=VECTOR('',#769,1.0);
#690=CARTESIAN_POINT('',(32.0,64.999999999926,-62.9999999999885));
#691=VECTOR('',#770,1.0);
#692=CARTESIAN_POINT('',(32.0,48.999999999926,-62.999999999935));
#693=VECTOR('',#771,1.0);
#694=CARTESIAN_POINT('',(36.0,50.0999999998822,-62.9999999999387));
#695=VECTOR('',#772,1.0);
#696=CARTESIAN_POINT('',(36.0,46.9999999998821,-62.9999999999283));
#697=VECTOR('',#773,1.0);
#698=CARTESIAN_POINT('',(38.0,46.9999999998821,-62.9999999999283));
#699=VECTOR('',#774,1.0);
#700=CARTESIAN_POINT('',(-36.0,46.999999999926,-62.9999999999283));
#701=VECTOR('',#775,1.0);
#702=CARTESIAN_POINT('',(-38.0,50.099999999926,-62.9999999999387));
#703=VECTOR('',#776,1.0);
#704=CARTESIAN_POINT('',(-36.0,50.099999999926,-62.9999999999387));
#705=VECTOR('',#777,1.0);
#706=DIRECTION('',(-1.0,0.0,-4.85216716807234E-18));
#707=DIRECTION('',(4.85216716807234E-18,-3.3446381819994E-12,-1.0));
#708=DIRECTION('',(-1.0,0.0,-4.85216716807234E-18));
#709=DIRECTION('',(4.85216716807234E-18,-3.3446381819994E-12,-1.0));
#710=DIRECTION('',(-4.85216716807234E-18,3.3446381819994E-12,1.0));
#711=DIRECTION('',(-6.12303176911026E-17,1.0,-3.3446381819994E-12));
#712=DIRECTION('',(-6.12303176911026E-17,1.0,-3.3446381819994E-12));
#713=DIRECTION('',(-4.85216716807234E-18,3.3446381819994E-12,1.0));
#714=DIRECTION('',(-6.12303176911351E-17,-1.0,3.3446381819994E-12));
#715=DIRECTION('',(4.85216716807234E-18,-3.3446381819994E-12,-1.0));
#716=DIRECTION('',(-6.12303176911351E-17,-1.0,3.3446381819994E-12));
#717=DIRECTION('',(1.0,-3.5527136788005E-15,4.85216717995489E-18));
#718=DIRECTION('',(-4.624583051574E-15,-1.0,3.3446381819994E-12));
#719=DIRECTION('',(-1.0,3.5527136788005E-15,-4.85216717995489E-18));
#720=DIRECTION('',(1.0,-1.22460635382238E-16,4.85216716848193E-18));
#721=DIRECTION('',(-6.12303176911026E-17,1.0,-3.3446381819994E-12));
#722=DIRECTION('',(-1.0,3.67517431418274E-15,-4.85216718036447E-18));
#723=DIRECTION('',(2.28167636694145E-15,1.0,-3.3446381819994E-12));
#724=DIRECTION('',(1.0,-3.67517431418274E-15,4.85216718036447E-18));
#725=DIRECTION('',(-6.12303176911351E-17,-1.0,3.3446381819994E-12));
#726=CARTESIAN_POINT('',(-35.5,71.4999999999419,-59.0000000000103));
#727=DIRECTION('',(4.85216716807234E-18,-3.3446381819994E-12,-1.0));
#728=DIRECTION('',(0.0,1.0,-3.3446381819994E-12));
#729=CARTESIAN_POINT('',(35.4999999999993,71.4999999999177,-59.0000000000103));
#730=DIRECTION('',(4.85216716807234E-18,-3.3446381819994E-12,-1.0));
#731=DIRECTION('',(0.0,1.0,-3.3446381819994E-12));
#732=CARTESIAN_POINT('',(-35.5,53.9999999999394,-58.9999999999517));
#733=DIRECTION('',(4.85216716807234E-18,-3.3446381819994E-12,-1.0));
#734=DIRECTION('',(0.0,1.0,-3.3446381819994E-12));
#735=CARTESIAN_POINT('',(35.5,53.9999999999394,-58.9999999999517));
#736=DIRECTION('',(4.85216716807234E-18,-3.3446381819994E-12,-1.0));
#737=DIRECTION('',(0.0,1.0,-3.3446381819994E-12));
#738=DIRECTION('',(6.12303176911351E-17,1.0,-3.3446381819994E-12));
#739=DIRECTION('',(1.0,-2.80259692864964E-45,4.85216716807234E-18));
#740=DIRECTION('',(6.12303176911026E-17,-1.0,3.3446381819994E-12));
#741=DIRECTION('',(-1.0,1.22460635382238E-16,-4.85216716848193E-18));
#742=DIRECTION('',(-1.0,3.5527136788005E-15,-4.85216717995489E-18));
#743=DIRECTION('',(-6.12303176911351E-17,-1.0,3.3446381819994E-12));
#744=DIRECTION('',(-1.0,3.67517431418274E-15,-4.85216718036447E-18));
#745=DIRECTION('',(-2.28167636694145E-15,-1.0,3.3446381819994E-12));
#746=DIRECTION('',(1.0,-3.67517431418274E-15,4.85216718036447E-18));
#747=DIRECTION('',(-6.12303176911026E-17,1.0,-3.3446381819994E-12));
#748=DIRECTION('',(1.0,-1.22460635382238E-16,4.85216716848193E-18));
#749=DIRECTION('',(1.0,-3.5527136788005E-15,4.85216717995489E-18));
#750=DIRECTION('',(4.624583051574E-15,1.0,-3.3446381819994E-12));
#751=CARTESIAN_POINT('',(35.5,53.999999999926,-62.9999999999517));
#752=DIRECTION('',(4.85214882888335E-18,-3.34463818199526E-12,-1.0));
#753=DIRECTION('',(1.0,-3.71054829767437E-17,4.85214882900745E-18));
#754=CARTESIAN_POINT('',(-35.5,53.999999999926,-62.9999999999517));
#755=DIRECTION('',(4.85220176876357E-18,-3.3446381820027E-12,-1.0));
#756=DIRECTION('',(-1.0,-5.88741539490848E-17,-4.85220176856666E-18));
#757=CARTESIAN_POINT('',(35.4999999999993,71.4999999999043,-63.0000000000102));
#758=DIRECTION('',(4.85216716807234E-18,-3.3446381819994E-12,-1.0));
#759=DIRECTION('',(-1.0,0.0,-4.85216716807234E-18));
#760=CARTESIAN_POINT('',(-35.5,71.4999999999285,-63.0000000000102));
#761=DIRECTION('',(4.85216716807234E-18,-3.3446381819994E-12,-1.0));
#762=DIRECTION('',(-1.0,0.0,-4.85216716807234E-18));
#763=DIRECTION('',(-1.0,0.0,-4.85216716807234E-18));
#764=DIRECTION('',(-6.12303176911351E-17,-1.0,3.3446381819994E-12));
#765=DIRECTION('',(1.0,-1.22460635382238E-16,4.85216716848193E-18));
#766=DIRECTION('',(-6.12303176911026E-17,1.0,-3.3446381819994E-12));
#767=DIRECTION('',(4.85216716807234E-18,-3.3446381819994E-12,-1.0));
#768=DIRECTION('',(-4.85216716807234E-18,3.3446381819994E-12,1.0));
#769=DIRECTION('',(-4.85216716807234E-18,3.3446381819994E-12,1.0));
#770=DIRECTION('',(-4.85216716807234E-18,3.3446381819994E-12,1.0));
#771=DIRECTION('',(-4.85216716807234E-18,3.3446381819994E-12,1.0));
#772=DIRECTION('',(-4.85216716807234E-18,3.3446381819994E-12,1.0));
#773=DIRECTION('',(-4.85216716807234E-18,3.3446381819994E-12,1.0));
#774=DIRECTION('',(-4.85216716807234E-18,3.3446381819994E-12,1.0));
#775=DIRECTION('',(-4.85216716807234E-18,3.3446381819994E-12,1.0));
#776=DIRECTION('',(-4.85216716807234E-18,3.3446381819994E-12,1.0));
#777=DIRECTION('',(-4.85216716807234E-18,3.3446381819994E-12,1.0));
ENDSEC;
END-ISO-10303-21;
