ISO-10303-21;
HEADER;
FILE_DESCRIPTION(('STEP AP203'),'1');
FILE_NAME('EspelharEspelharEncoder_4.stp','2022-12-07T21:40:54',(' '),(' '),'Spatial InterOp 3D',' ',' ');
FILE_SCHEMA(('CONFIG_CONTROL_DESIGN'));
ENDSEC;
DATA;
#1=DESIGN_CONTEXT('',#33,'design');
#2=APPLICATION_PROTOCOL_DEFINITION('INTERNATIONAL STANDARD','config_control_design',1994,#33);
#3=PRODUCT_CATEGORY_RELATIONSHIP('NONE','NONE',#34,#35);
#4=DATE_AND_TIME(#36,#37);
#5=DATE_TIME_ROLE('creation_date');
#6=DATE_TIME_ROLE('classification_date');
#7=PERSON_AND_ORGANIZATION_ROLE('creator');
#8=PERSON_AND_ORGANIZATION_ROLE('design_supplier');
#9=PERSON_AND_ORGANIZATION_ROLE('classification_officer');
#10=PERSON_AND_ORGANIZATION_ROLE('design_owner');
#11=APPROVAL_PERSON_ORGANIZATION(#38,#39,#40);
#12=APPROVAL_DATE_TIME(#4,#39);
#13=CC_DESIGN_APPROVAL(#39,(#41,#42,#43));
#14=CC_DESIGN_DATE_AND_TIME_ASSIGNMENT(#4,#5,(#43));
#15=CC_DESIGN_DATE_AND_TIME_ASSIGNMENT(#4,#6,(#41));
#16=CC_DESIGN_PERSON_AND_ORGANIZATION_ASSIGNMENT(#38,#10,(#44));
#17=CC_DESIGN_PERSON_AND_ORGANIZATION_ASSIGNMENT(#38,#7,(#43));
#18=CC_DESIGN_PERSON_AND_ORGANIZATION_ASSIGNMENT(#38,#7,(#42));
#19=CC_DESIGN_PERSON_AND_ORGANIZATION_ASSIGNMENT(#38,#8,(#42));
#20=CC_DESIGN_SECURITY_CLASSIFICATION(#41,(#42));
#21=CC_DESIGN_PERSON_AND_ORGANIZATION_ASSIGNMENT(#38,#9,(#41));
#22=SHAPE_DEFINITION_REPRESENTATION(#45,#46);
#23= (GEOMETRIC_REPRESENTATION_CONTEXT(3)GLOBAL_UNCERTAINTY_ASSIGNED_CONTEXT((#49))GLOBAL_UNIT_ASSIGNED_CONTEXT((#51,#52,#53))REPRESENTATION_CONTEXT('NONE','WORKSPACE'));
#24=PROPERTY_DEFINITION_REPRESENTATION(#55,#56);
#25=GENERAL_PROPERTY_ASSOCIATION('','',#57,#55);
#26=PROPERTY_DEFINITION_REPRESENTATION(#58,#59);
#27=GENERAL_PROPERTY_ASSOCIATION('','',#60,#58);
#28=PROPERTY_DEFINITION_REPRESENTATION(#61,#62);
#29=GENERAL_PROPERTY_ASSOCIATION('','',#63,#61);
#33=APPLICATION_CONTEXT('CONFIGURATION CONTROLLED 3D DESIGNS OF MECHANICAL PARTS AND ASSEMBLIES');
#34=PRODUCT_CATEGORY('part','NONE');
#35=PRODUCT_RELATED_PRODUCT_CATEGORY('detail',' ',(#44));
#36=CALENDAR_DATE(2022,7,11);
#37=LOCAL_TIME(18,40,54.0,#64);
#38=PERSON_AND_ORGANIZATION(#65,#66);
#39=APPROVAL(#67,'SOLID MODEL');
#40=APPROVAL_ROLE('APPROVED');
#41=SECURITY_CLASSIFICATION('','',#68);
#42=PRODUCT_DEFINITION_FORMATION_WITH_SPECIFIED_SOURCE('A','NONE',#44,.NOT_KNOWN.);
#43=PRODUCT_DEFINITION('','NONE',#42,#1);
#44=PRODUCT('EspelharEspelharEncoder_4','','EspelharEspelharEncoder_4',(#69));
#45=PRODUCT_DEFINITION_SHAPE('NONE','NONE',#43);
#46=ADVANCED_BREP_SHAPE_REPRESENTATION('1',(#70,#71),#23);
#49=UNCERTAINTY_MEASURE_WITH_UNIT(LENGTH_MEASURE(0.001),#51,'','');
#51= (CONVERSION_BASED_UNIT('MILLIMETRE',#74)LENGTH_UNIT()NAMED_UNIT(#77));
#52= (NAMED_UNIT(#79)PLANE_ANGLE_UNIT()SI_UNIT($,.RADIAN.));
#53= (NAMED_UNIT(#79)SOLID_ANGLE_UNIT()SI_UNIT($,.STERADIAN.));
#55=PROPERTY_DEFINITION('PdmObjectId','',#43);
#56=REPRESENTATION('',(#85),#23);
#57=GENERAL_PROPERTY('','19_5f3e0fdf-4568-47a5-9503-c19d6208099e&2_29_0_0','');
#58=PROPERTY_DEFINITION('CreationDate','',#43);
#59=REPRESENTATION('',(#86),#23);
#60=GENERAL_PROPERTY('','12/01/2022 12:58:11','');
#61=PROPERTY_DEFINITION('Minor Revision','',#43);
#62=REPRESENTATION('',(#87),#23);
#63=GENERAL_PROPERTY('','0','');
#64=COORDINATED_UNIVERSAL_TIME_OFFSET(3,0,.BEHIND.);
#65=PERSON('','UNSPECIFIED',$,$,$,$);
#66=ORGANIZATION('UNSPECIFIED','UNSPECIFIED','UNSPECIFIED');
#67=APPROVAL_STATUS('approved');
#68=SECURITY_CLASSIFICATION_LEVEL('unclassified');
#69=MECHANICAL_CONTEXT('',#33,'mechanical');
#70=MANIFOLD_SOLID_BREP('1',#88);
#71=AXIS2_PLACEMENT_3D('',#89,#90,#91);
#74=LENGTH_MEASURE_WITH_UNIT(LENGTH_MEASURE(1.0),#92);
#77=DIMENSIONAL_EXPONENTS(1.0,0.0,0.0,0.0,0.0,0.0,0.0);
#79=DIMENSIONAL_EXPONENTS(0.0,0.0,0.0,0.0,0.0,0.0,0.0);
#85=VALUE_REPRESENTATION_ITEM('19_5f3e0fdf-4568-47a5-9503-c19d6208099e&2_29_0_0',);
#86=VALUE_REPRESENTATION_ITEM('12/01/2022 12:58:11',);
#87=VALUE_REPRESENTATION_ITEM('0',);
#88=CLOSED_SHELL('',(#93,#94,#95,#96,#97,#98,#99,#100,#101,#102,#103,#104,#105,#106,#107,#108,#109,#110,#111,#112,#113,#114,#115,#116,#117,#118,#119,#120,#121,#122,#123,#124,#125,#126,#127,#128,#129,#130,#131,#132,#133,#134,#135,#136,#137,#138,#139,#140,#141,#142,#143,#144,#145,#146,#147,#148,#149,#150,#151));
#89=CARTESIAN_POINT('',(0.0,0.0,0.0));
#90=DIRECTION('',(0.0,0.0,1.0));
#91=DIRECTION('',(1.0,0.0,0.0));
#92= (NAMED_UNIT(#77)LENGTH_UNIT()SI_UNIT(.MILLI.,.METRE.));
#93=ADVANCED_FACE('',(#153,#154,#155,#156,#157,#158,#159,#160,#161,#162,#163,#164,#165,#166),#167,.T.);
#94=ADVANCED_FACE('',(#168),#169,.F.);
#95=ADVANCED_FACE('',(#170),#171,.F.);
#96=ADVANCED_FACE('',(#172),#173,.T.);
#97=ADVANCED_FACE('',(#174),#175,.F.);
#98=ADVANCED_FACE('',(#176),#177,.T.);
#99=ADVANCED_FACE('',(#178),#179,.F.);
#100=ADVANCED_FACE('',(#180),#181,.F.);
#101=ADVANCED_FACE('',(#182),#183,.F.);
#102=ADVANCED_FACE('',(#184),#185,.T.);
#103=ADVANCED_FACE('',(#186),#187,.F.);
#104=ADVANCED_FACE('',(#188),#189,.T.);
#105=ADVANCED_FACE('',(#190),#191,.T.);
#106=ADVANCED_FACE('',(#192),#193,.F.);
#107=ADVANCED_FACE('',(#194),#195,.F.);
#108=ADVANCED_FACE('',(#196),#197,.F.);
#109=ADVANCED_FACE('',(#198),#199,.F.);
#110=ADVANCED_FACE('',(#200),#201,.F.);
#111=ADVANCED_FACE('',(#202),#203,.T.);
#112=ADVANCED_FACE('',(#204),#205,.F.);
#113=ADVANCED_FACE('',(#206),#207,.F.);
#114=ADVANCED_FACE('',(#208),#209,.T.);
#115=ADVANCED_FACE('',(#210),#211,.F.);
#116=ADVANCED_FACE('',(#212),#213,.F.);
#117=ADVANCED_FACE('',(#214),#215,.T.);
#118=ADVANCED_FACE('',(#216),#217,.F.);
#119=ADVANCED_FACE('',(#218),#219,.F.);
#120=ADVANCED_FACE('',(#220),#221,.F.);
#121=ADVANCED_FACE('',(#222),#223,.T.);
#122=ADVANCED_FACE('',(#224),#225,.T.);
#123=ADVANCED_FACE('',(#226),#227,.F.);
#124=ADVANCED_FACE('',(#228),#229,.F.);
#125=ADVANCED_FACE('',(#230),#231,.F.);
#126=ADVANCED_FACE('',(#232),#233,.F.);
#127=ADVANCED_FACE('',(#234),#235,.F.);
#128=ADVANCED_FACE('',(#236),#237,.T.);
#129=ADVANCED_FACE('',(#238),#239,.F.);
#130=ADVANCED_FACE('',(#240),#241,.T.);
#131=ADVANCED_FACE('',(#242),#243,.F.);
#132=ADVANCED_FACE('',(#244),#245,.F.);
#133=ADVANCED_FACE('',(#246),#247,.F.);
#134=ADVANCED_FACE('',(#248),#249,.F.);
#135=ADVANCED_FACE('',(#250),#251,.F.);
#136=ADVANCED_FACE('',(#252),#253,.F.);
#137=ADVANCED_FACE('',(#254),#255,.F.);
#138=ADVANCED_FACE('',(#256,#257,#258,#259,#260,#261,#262,#263),#264,.F.);
#139=ADVANCED_FACE('',(#265),#266,.F.);
#140=ADVANCED_FACE('',(#267),#268,.F.);
#141=ADVANCED_FACE('',(#269),#270,.F.);
#142=ADVANCED_FACE('',(#271),#272,.F.);
#143=ADVANCED_FACE('',(#273),#274,.F.);
#144=ADVANCED_FACE('',(#275),#276,.T.);
#145=ADVANCED_FACE('',(#277),#278,.F.);
#146=ADVANCED_FACE('',(#279),#280,.T.);
#147=ADVANCED_FACE('',(#281),#282,.F.);
#148=ADVANCED_FACE('',(#283),#284,.T.);
#149=ADVANCED_FACE('',(#285),#286,.F.);
#150=ADVANCED_FACE('',(#287),#288,.F.);
#151=ADVANCED_FACE('',(#289),#290,.F.);
#153=FACE_BOUND('',#291,.T.);
#154=FACE_BOUND('',#292,.T.);
#155=FACE_BOUND('',#293,.T.);
#156=FACE_BOUND('',#294,.T.);
#157=FACE_BOUND('',#295,.T.);
#158=FACE_BOUND('',#296,.T.);
#159=FACE_BOUND('',#297,.T.);
#160=FACE_BOUND('',#298,.T.);
#161=FACE_BOUND('',#299,.T.);
#162=FACE_BOUND('',#300,.T.);
#163=FACE_BOUND('',#301,.T.);
#164=FACE_BOUND('',#302,.T.);
#165=FACE_BOUND('',#303,.T.);
#166=FACE_OUTER_BOUND('',#304,.T.);
#167=PLANE('',#305);
#168=FACE_OUTER_BOUND('',#306,.T.);
#169=PLANE('',#307);
#170=FACE_OUTER_BOUND('',#308,.T.);
#171=PLANE('',#309);
#172=FACE_OUTER_BOUND('',#310,.T.);
#173=PLANE('',#311);
#174=FACE_OUTER_BOUND('',#312,.T.);
#175=CYLINDRICAL_SURFACE('',#313,4.1656);
#176=FACE_OUTER_BOUND('',#314,.T.);
#177=PLANE('',#315);
#178=FACE_OUTER_BOUND('',#316,.T.);
#179=CYLINDRICAL_SURFACE('',#317,1.27);
#180=FACE_OUTER_BOUND('',#318,.T.);
#181=PLANE('',#319);
#182=FACE_OUTER_BOUND('',#320,.T.);
#183=CYLINDRICAL_SURFACE('',#321,1.2192);
#184=FACE_OUTER_BOUND('',#322,.T.);
#185=PLANE('',#323);
#186=FACE_OUTER_BOUND('',#324,.T.);
#187=PLANE('',#325);
#188=FACE_OUTER_BOUND('',#326,.T.);
#189=PLANE('',#327);
#190=FACE_OUTER_BOUND('',#328,.T.);
#191=CYLINDRICAL_SURFACE('',#329,9.525);
#192=FACE_OUTER_BOUND('',#330,.T.);
#193=PLANE('',#331);
#194=FACE_OUTER_BOUND('',#332,.T.);
#195=CYLINDRICAL_SURFACE('',#333,1.2192);
#196=FACE_OUTER_BOUND('',#334,.T.);
#197=PLANE('',#335);
#198=FACE_OUTER_BOUND('',#336,.T.);
#199=PLANE('',#337);
#200=FACE_OUTER_BOUND('',#338,.T.);
#201=PLANE('',#339);
#202=FACE_OUTER_BOUND('',#340,.T.);
#203=CYLINDRICAL_SURFACE('',#341,9.525);
#204=FACE_OUTER_BOUND('',#342,.T.);
#205=PLANE('',#343);
#206=FACE_OUTER_BOUND('',#344,.T.);
#207=CYLINDRICAL_SURFACE('',#345,1.27);
#208=FACE_OUTER_BOUND('',#346,.T.);
#209=CYLINDRICAL_SURFACE('',#347,9.017);
#210=FACE_OUTER_BOUND('',#348,.T.);
#211=CYLINDRICAL_SURFACE('',#349,0.3048);
#212=FACE_OUTER_BOUND('',#350,.T.);
#213=PLANE('',#351);
#214=FACE_OUTER_BOUND('',#352,.T.);
#215=CYLINDRICAL_SURFACE('',#353,9.525);
#216=FACE_OUTER_BOUND('',#354,.T.);
#217=PLANE('',#355);
#218=FACE_OUTER_BOUND('',#356,.T.);
#219=PLANE('',#357);
#220=FACE_OUTER_BOUND('',#358,.T.);
#221=PLANE('',#359);
#222=FACE_OUTER_BOUND('',#360,.T.);
#223=PLANE('',#361);
#224=FACE_OUTER_BOUND('',#362,.T.);
#225=CYLINDRICAL_SURFACE('',#363,9.525);
#226=FACE_OUTER_BOUND('',#364,.T.);
#227=PLANE('',#365);
#228=FACE_OUTER_BOUND('',#366,.T.);
#229=PLANE('',#367);
#230=FACE_OUTER_BOUND('',#368,.T.);
#231=PLANE('',#369);
#232=FACE_OUTER_BOUND('',#370,.T.);
#233=PLANE('',#371);
#234=FACE_OUTER_BOUND('',#372,.T.);
#235=PLANE('',#373);
#236=FACE_OUTER_BOUND('',#374,.T.);
#237=PLANE('',#375);
#238=FACE_OUTER_BOUND('',#376,.T.);
#239=PLANE('',#377);
#240=FACE_OUTER_BOUND('',#378,.T.);
#241=PLANE('',#379);
#242=FACE_OUTER_BOUND('',#380,.T.);
#243=PLANE('',#381);
#244=FACE_OUTER_BOUND('',#382,.T.);
#245=PLANE('',#383);
#246=FACE_OUTER_BOUND('',#384,.T.);
#247=PLANE('',#385);
#248=FACE_OUTER_BOUND('',#386,.T.);
#249=CYLINDRICAL_SURFACE('',#387,1.2192);
#250=FACE_OUTER_BOUND('',#388,.T.);
#251=PLANE('',#389);
#252=FACE_OUTER_BOUND('',#390,.T.);
#253=PLANE('',#391);
#254=FACE_OUTER_BOUND('',#392,.T.);
#255=PLANE('',#393);
#256=FACE_BOUND('',#394,.T.);
#257=FACE_BOUND('',#395,.T.);
#258=FACE_BOUND('',#396,.T.);
#259=FACE_BOUND('',#397,.T.);
#260=FACE_BOUND('',#398,.T.);
#261=FACE_BOUND('',#399,.T.);
#262=FACE_BOUND('',#400,.T.);
#263=FACE_OUTER_BOUND('',#401,.T.);
#264=PLANE('',#402);
#265=FACE_OUTER_BOUND('',#403,.T.);
#266=CYLINDRICAL_SURFACE('',#404,0.3048);
#267=FACE_OUTER_BOUND('',#405,.T.);
#268=CYLINDRICAL_SURFACE('',#406,0.3048);
#269=FACE_OUTER_BOUND('',#407,.T.);
#270=PLANE('',#408);
#271=FACE_OUTER_BOUND('',#409,.T.);
#272=CYLINDRICAL_SURFACE('',#410,1.2192);
#273=FACE_OUTER_BOUND('',#411,.T.);
#274=CYLINDRICAL_SURFACE('',#412,1.2192);
#275=FACE_OUTER_BOUND('',#413,.T.);
#276=CYLINDRICAL_SURFACE('',#414,9.017);
#277=FACE_OUTER_BOUND('',#415,.T.);
#278=CYLINDRICAL_SURFACE('',#416,1.2192);
#279=FACE_OUTER_BOUND('',#417,.T.);
#280=PLANE('',#418);
#281=FACE_OUTER_BOUND('',#419,.T.);
#282=PLANE('',#420);
#283=FACE_OUTER_BOUND('',#421,.T.);
#284=PLANE('',#422);
#285=FACE_OUTER_BOUND('',#423,.T.);
#286=CYLINDRICAL_SURFACE('',#424,0.3048);
#287=FACE_OUTER_BOUND('',#425,.T.);
#288=CYLINDRICAL_SURFACE('',#426,1.2192);
#289=FACE_OUTER_BOUND('',#427,.T.);
#290=CYLINDRICAL_SURFACE('',#428,1.2192);
#291=EDGE_LOOP('',(#429,#430));
#292=EDGE_LOOP('',(#431,#432));
#293=EDGE_LOOP('',(#433));
#294=EDGE_LOOP('',(#434));
#295=EDGE_LOOP('',(#435,#436,#437,#438));
#296=EDGE_LOOP('',(#439,#440,#441,#442));
#297=EDGE_LOOP('',(#443,#444,#445,#446));
#298=EDGE_LOOP('',(#447,#448,#449,#450));
#299=EDGE_LOOP('',(#451,#452,#453,#454));
#300=EDGE_LOOP('',(#455,#456,#457,#458));
#301=EDGE_LOOP('',(#459,#460));
#302=EDGE_LOOP('',(#461));
#303=EDGE_LOOP('',(#462,#463));
#304=EDGE_LOOP('',(#464,#465,#466,#467,#468,#469,#470,#471,#472,#473,#474,#475,#476,#477,#478,#479,#480,#481,#482,#483));
#305=AXIS2_PLACEMENT_3D('',#484,#485,#486);
#306=EDGE_LOOP('',(#487,#488,#489,#490));
#307=AXIS2_PLACEMENT_3D('',#491,#492,#493);
#308=EDGE_LOOP('',(#494,#495,#496,#497));
#309=AXIS2_PLACEMENT_3D('',#498,#499,#500);
#310=EDGE_LOOP('',(#501,#502,#503,#504));
#311=AXIS2_PLACEMENT_3D('',#505,#506,#507);
#312=EDGE_LOOP('',(#508,#509,#510,#511,#512,#513));
#313=AXIS2_PLACEMENT_3D('',#514,#515,#516);
#314=EDGE_LOOP('',(#517,#518,#519,#520));
#315=AXIS2_PLACEMENT_3D('',#521,#522,#523);
#316=EDGE_LOOP('',(#524,#525,#526,#527,#528,#529));
#317=AXIS2_PLACEMENT_3D('',#530,#531,#532);
#318=EDGE_LOOP('',(#533,#534,#535,#536));
#319=AXIS2_PLACEMENT_3D('',#537,#538,#539);
#320=EDGE_LOOP('',(#540,#541,#542,#543));
#321=AXIS2_PLACEMENT_3D('',#544,#545,#546);
#322=EDGE_LOOP('',(#547,#548,#549,#550));
#323=AXIS2_PLACEMENT_3D('',#551,#552,#553);
#324=EDGE_LOOP('',(#554,#555,#556,#557));
#325=AXIS2_PLACEMENT_3D('',#558,#559,#560);
#326=EDGE_LOOP('',(#561,#562,#563,#564));
#327=AXIS2_PLACEMENT_3D('',#565,#566,#567);
#328=EDGE_LOOP('',(#568,#569,#570,#571));
#329=AXIS2_PLACEMENT_3D('',#572,#573,#574);
#330=EDGE_LOOP('',(#575,#576,#577,#578));
#331=AXIS2_PLACEMENT_3D('',#579,#580,#581);
#332=EDGE_LOOP('',(#582,#583,#584,#585));
#333=AXIS2_PLACEMENT_3D('',#586,#587,#588);
#334=EDGE_LOOP('',(#589,#590,#591,#592));
#335=AXIS2_PLACEMENT_3D('',#593,#594,#595);
#336=EDGE_LOOP('',(#596,#597,#598,#599));
#337=AXIS2_PLACEMENT_3D('',#600,#601,#602);
#338=EDGE_LOOP('',(#603,#604,#605,#606));
#339=AXIS2_PLACEMENT_3D('',#607,#608,#609);
#340=EDGE_LOOP('',(#610,#611,#612,#613));
#341=AXIS2_PLACEMENT_3D('',#614,#615,#616);
#342=EDGE_LOOP('',(#617,#618,#619,#620));
#343=AXIS2_PLACEMENT_3D('',#621,#622,#623);
#344=EDGE_LOOP('',(#624,#625,#626,#627));
#345=AXIS2_PLACEMENT_3D('',#628,#629,#630);
#346=EDGE_LOOP('',(#631,#632,#633,#634));
#347=AXIS2_PLACEMENT_3D('',#635,#636,#637);
#348=EDGE_LOOP('',(#638,#639,#640,#641,#642,#643));
#349=AXIS2_PLACEMENT_3D('',#644,#645,#646);
#350=EDGE_LOOP('',(#647,#648,#649,#650));
#351=AXIS2_PLACEMENT_3D('',#651,#652,#653);
#352=EDGE_LOOP('',(#654,#655,#656,#657));
#353=AXIS2_PLACEMENT_3D('',#658,#659,#660);
#354=EDGE_LOOP('',(#661,#662,#663,#664));
#355=AXIS2_PLACEMENT_3D('',#665,#666,#667);
#356=EDGE_LOOP('',(#668,#669,#670,#671));
#357=AXIS2_PLACEMENT_3D('',#672,#673,#674);
#358=EDGE_LOOP('',(#675,#676,#677,#678));
#359=AXIS2_PLACEMENT_3D('',#679,#680,#681);
#360=EDGE_LOOP('',(#682,#683,#684,#685));
#361=AXIS2_PLACEMENT_3D('',#686,#687,#688);
#362=EDGE_LOOP('',(#689,#690,#691,#692));
#363=AXIS2_PLACEMENT_3D('',#693,#694,#695);
#364=EDGE_LOOP('',(#696,#697,#698,#699));
#365=AXIS2_PLACEMENT_3D('',#700,#701,#702);
#366=EDGE_LOOP('',(#703,#704,#705,#706));
#367=AXIS2_PLACEMENT_3D('',#707,#708,#709);
#368=EDGE_LOOP('',(#710,#711,#712,#713));
#369=AXIS2_PLACEMENT_3D('',#714,#715,#716);
#370=EDGE_LOOP('',(#717,#718,#719,#720));
#371=AXIS2_PLACEMENT_3D('',#721,#722,#723);
#372=EDGE_LOOP('',(#724,#725,#726,#727));
#373=AXIS2_PLACEMENT_3D('',#728,#729,#730);
#374=EDGE_LOOP('',(#731,#732,#733,#734));
#375=AXIS2_PLACEMENT_3D('',#735,#736,#737);
#376=EDGE_LOOP('',(#738,#739,#740,#741));
#377=AXIS2_PLACEMENT_3D('',#742,#743,#744);
#378=EDGE_LOOP('',(#745,#746,#747,#748));
#379=AXIS2_PLACEMENT_3D('',#749,#750,#751);
#380=EDGE_LOOP('',(#752,#753,#754,#755));
#381=AXIS2_PLACEMENT_3D('',#756,#757,#758);
#382=EDGE_LOOP('',(#759,#760,#761,#762));
#383=AXIS2_PLACEMENT_3D('',#763,#764,#765);
#384=EDGE_LOOP('',(#766,#767,#768,#769));
#385=AXIS2_PLACEMENT_3D('',#770,#771,#772);
#386=EDGE_LOOP('',(#773,#774,#775,#776));
#387=AXIS2_PLACEMENT_3D('',#777,#778,#779);
#388=EDGE_LOOP('',(#780,#781,#782,#783));
#389=AXIS2_PLACEMENT_3D('',#784,#785,#786);
#390=EDGE_LOOP('',(#787,#788,#789,#790));
#391=AXIS2_PLACEMENT_3D('',#791,#792,#793);
#392=EDGE_LOOP('',(#794,#795,#796,#797));
#393=AXIS2_PLACEMENT_3D('',#798,#799,#800);
#394=EDGE_LOOP('',(#801,#802));
#395=EDGE_LOOP('',(#803,#804));
#396=EDGE_LOOP('',(#805));
#397=EDGE_LOOP('',(#806));
#398=EDGE_LOOP('',(#807,#808));
#399=EDGE_LOOP('',(#809));
#400=EDGE_LOOP('',(#810,#811));
#401=EDGE_LOOP('',(#812,#813,#814,#815,#816,#817,#818,#819,#820,#821,#822,#823,#824,#825,#826,#827,#828,#829,#830,#831));
#402=AXIS2_PLACEMENT_3D('',#832,#833,#834);
#403=EDGE_LOOP('',(#835,#836,#837,#838));
#404=AXIS2_PLACEMENT_3D('',#839,#840,#841);
#405=EDGE_LOOP('',(#842,#843,#844,#845));
#406=AXIS2_PLACEMENT_3D('',#846,#847,#848);
#407=EDGE_LOOP('',(#849,#850,#851,#852));
#408=AXIS2_PLACEMENT_3D('',#853,#854,#855);
#409=EDGE_LOOP('',(#856,#857,#858,#859));
#410=AXIS2_PLACEMENT_3D('',#860,#861,#862);
#411=EDGE_LOOP('',(#863,#864,#865,#866));
#412=AXIS2_PLACEMENT_3D('',#867,#868,#869);
#413=EDGE_LOOP('',(#870,#871,#872,#873));
#414=AXIS2_PLACEMENT_3D('',#874,#875,#876);
#415=EDGE_LOOP('',(#877,#878,#879,#880));
#416=AXIS2_PLACEMENT_3D('',#881,#882,#883);
#417=EDGE_LOOP('',(#884,#885,#886,#887));
#418=AXIS2_PLACEMENT_3D('',#888,#889,#890);
#419=EDGE_LOOP('',(#891,#892,#893,#894));
#420=AXIS2_PLACEMENT_3D('',#895,#896,#897);
#421=EDGE_LOOP('',(#898,#899,#900,#901));
#422=AXIS2_PLACEMENT_3D('',#902,#903,#904);
#423=EDGE_LOOP('',(#905,#906,#907,#908,#909,#910));
#424=AXIS2_PLACEMENT_3D('',#911,#912,#913);
#425=EDGE_LOOP('',(#914,#915,#916,#917));
#426=AXIS2_PLACEMENT_3D('',#918,#919,#920);
#427=EDGE_LOOP('',(#921,#922,#923,#924));
#428=AXIS2_PLACEMENT_3D('',#925,#926,#927);
#429=ORIENTED_EDGE('',*,*,#928,.F.);
#430=ORIENTED_EDGE('',*,*,#929,.F.);
#431=ORIENTED_EDGE('',*,*,#930,.F.);
#432=ORIENTED_EDGE('',*,*,#931,.F.);
#433=ORIENTED_EDGE('',*,*,#932,.F.);
#434=ORIENTED_EDGE('',*,*,#933,.F.);
#435=ORIENTED_EDGE('',*,*,#934,.F.);
#436=ORIENTED_EDGE('',*,*,#935,.F.);
#437=ORIENTED_EDGE('',*,*,#936,.F.);
#438=ORIENTED_EDGE('',*,*,#937,.F.);
#439=ORIENTED_EDGE('',*,*,#938,.F.);
#440=ORIENTED_EDGE('',*,*,#939,.F.);
#441=ORIENTED_EDGE('',*,*,#940,.F.);
#442=ORIENTED_EDGE('',*,*,#941,.F.);
#443=ORIENTED_EDGE('',*,*,#942,.F.);
#444=ORIENTED_EDGE('',*,*,#943,.F.);
#445=ORIENTED_EDGE('',*,*,#944,.F.);
#446=ORIENTED_EDGE('',*,*,#945,.F.);
#447=ORIENTED_EDGE('',*,*,#946,.F.);
#448=ORIENTED_EDGE('',*,*,#947,.F.);
#449=ORIENTED_EDGE('',*,*,#948,.F.);
#450=ORIENTED_EDGE('',*,*,#949,.F.);
#451=ORIENTED_EDGE('',*,*,#950,.F.);
#452=ORIENTED_EDGE('',*,*,#951,.F.);
#453=ORIENTED_EDGE('',*,*,#952,.F.);
#454=ORIENTED_EDGE('',*,*,#953,.F.);
#455=ORIENTED_EDGE('',*,*,#954,.F.);
#456=ORIENTED_EDGE('',*,*,#955,.F.);
#457=ORIENTED_EDGE('',*,*,#956,.F.);
#458=ORIENTED_EDGE('',*,*,#957,.F.);
#459=ORIENTED_EDGE('',*,*,#958,.F.);
#460=ORIENTED_EDGE('',*,*,#959,.F.);
#461=ORIENTED_EDGE('',*,*,#960,.F.);
#462=ORIENTED_EDGE('',*,*,#961,.T.);
#463=ORIENTED_EDGE('',*,*,#962,.T.);
#464=ORIENTED_EDGE('',*,*,#963,.F.);
#465=ORIENTED_EDGE('',*,*,#964,.F.);
#466=ORIENTED_EDGE('',*,*,#965,.F.);
#467=ORIENTED_EDGE('',*,*,#966,.T.);
#468=ORIENTED_EDGE('',*,*,#967,.T.);
#469=ORIENTED_EDGE('',*,*,#968,.F.);
#470=ORIENTED_EDGE('',*,*,#969,.T.);
#471=ORIENTED_EDGE('',*,*,#970,.T.);
#472=ORIENTED_EDGE('',*,*,#971,.F.);
#473=ORIENTED_EDGE('',*,*,#972,.T.);
#474=ORIENTED_EDGE('',*,*,#973,.F.);
#475=ORIENTED_EDGE('',*,*,#974,.F.);
#476=ORIENTED_EDGE('',*,*,#975,.F.);
#477=ORIENTED_EDGE('',*,*,#976,.T.);
#478=ORIENTED_EDGE('',*,*,#977,.T.);
#479=ORIENTED_EDGE('',*,*,#978,.T.);
#480=ORIENTED_EDGE('',*,*,#979,.F.);
#481=ORIENTED_EDGE('',*,*,#980,.F.);
#482=ORIENTED_EDGE('',*,*,#981,.F.);
#483=ORIENTED_EDGE('',*,*,#982,.T.);
#484=CARTESIAN_POINT('',(-1.0302277549575E-12,3.4798,-2243.79808459707));
#485=DIRECTION('',(-2.96059473233375E-13,1.0,0.0));
#486=DIRECTION('',(1.0,2.96059473233375E-13,0.0));
#487=ORIENTED_EDGE('',*,*,#941,.T.);
#488=ORIENTED_EDGE('',*,*,#983,.F.);
#489=ORIENTED_EDGE('',*,*,#984,.F.);
#490=ORIENTED_EDGE('',*,*,#985,.T.);
#491=CARTESIAN_POINT('',(-3.95730442085763,3.22579999999043,-2240.2048322791));
#492=DIRECTION('',(-0.49999999999999,-1.48029736616685E-13,0.866025403784445));
#493=DIRECTION('',(-2.96059473233376E-13,1.0,-2.18615546871613E-29));
#494=ORIENTED_EDGE('',*,*,#940,.T.);
#495=ORIENTED_EDGE('',*,*,#986,.F.);
#496=ORIENTED_EDGE('',*,*,#987,.F.);
#497=ORIENTED_EDGE('',*,*,#983,.T.);
#498=CARTESIAN_POINT('',(-2.75212838197877,3.22579999999078,-2240.2422584105));
#499=DIRECTION('',(0.866025403784577,2.56395024851183E-13,0.499999999999761));
#500=DIRECTION('',(4.37231093743292E-29,-1.0,5.12790049702611E-13));
#501=ORIENTED_EDGE('',*,*,#988,.T.);
#502=ORIENTED_EDGE('',*,*,#984,.T.);
#503=ORIENTED_EDGE('',*,*,#987,.T.);
#504=ORIENTED_EDGE('',*,*,#989,.T.);
#505=CARTESIAN_POINT('',(-3.95730442085763,3.22579999999043,-2240.2048322791));
#506=DIRECTION('',(-2.96059473233375E-13,1.0,0.0));
#507=DIRECTION('',(1.0,2.96059473233375E-13,0.0));
#508=ORIENTED_EDGE('',*,*,#990,.F.);
#509=ORIENTED_EDGE('',*,*,#991,.F.);
#510=ORIENTED_EDGE('',*,*,#992,.T.);
#511=ORIENTED_EDGE('',*,*,#959,.T.);
#512=ORIENTED_EDGE('',*,*,#958,.T.);
#513=ORIENTED_EDGE('',*,*,#992,.F.);
#514=CARTESIAN_POINT('',(-8.57269810694561E-13,2.8956,-2243.79808459707));
#515=DIRECTION('',(-2.96059473233375E-13,1.0,8.67497526682324E-43));
#516=DIRECTION('',(1.39818712163731E-15,4.1394654271363E-28,1.0));
#517=ORIENTED_EDGE('',*,*,#993,.T.);
#518=ORIENTED_EDGE('',*,*,#994,.T.);
#519=ORIENTED_EDGE('',*,*,#995,.T.);
#520=ORIENTED_EDGE('',*,*,#996,.T.);
#521=CARTESIAN_POINT('',(-1.79469557914421,3.22579999999107,-2237.42858066991));
#522=DIRECTION('',(-2.96059473233375E-13,1.0,0.0));
#523=DIRECTION('',(1.0,2.96059473233375E-13,0.0));
#524=ORIENTED_EDGE('',*,*,#961,.F.);
#525=ORIENTED_EDGE('',*,*,#962,.F.);
#526=ORIENTED_EDGE('',*,*,#997,.T.);
#527=ORIENTED_EDGE('',*,*,#998,.T.);
#528=ORIENTED_EDGE('',*,*,#999,.T.);
#529=ORIENTED_EDGE('',*,*,#997,.F.);
#530=CARTESIAN_POINT('',(-7.44220000000103,3.4797999999978,-2243.79808459707));
#531=DIRECTION('',(2.96059473233375E-13,-1.0,-9.54499642267409E-43));
#532=DIRECTION('',(-1.39818712163731E-15,-4.1394654271363E-28,-1.0));
#533=ORIENTED_EDGE('',*,*,#945,.T.);
#534=ORIENTED_EDGE('',*,*,#1000,.F.);
#535=ORIENTED_EDGE('',*,*,#1001,.F.);
#536=ORIENTED_EDGE('',*,*,#1002,.T.);
#537=CARTESIAN_POINT('',(-5.02762838197876,3.22579999999011,-2236.30097679788));
#538=DIRECTION('',(0.8660254037843,2.56395024851101E-13,0.50000000000024));
#539=DIRECTION('',(-1.31169328122946E-28,-1.0,5.12790049701956E-13));
#540=ORIENTED_EDGE('',*,*,#1003,.F.);
#541=ORIENTED_EDGE('',*,*,#1004,.F.);
#542=ORIENTED_EDGE('',*,*,#971,.T.);
#543=ORIENTED_EDGE('',*,*,#1005,.T.);
#544=CARTESIAN_POINT('',(-1.17966660641974,3.47979999999965,-2233.11884209876));
#545=DIRECTION('',(2.96059473233375E-13,-1.0,-8.05543197322515E-43));
#546=DIRECTION('',(-1.39818712163731E-15,-4.1394654271363E-28,-1.0));
#547=ORIENTED_EDGE('',*,*,#1006,.T.);
#548=ORIENTED_EDGE('',*,*,#1007,.T.);
#549=ORIENTED_EDGE('',*,*,#1008,.T.);
#550=ORIENTED_EDGE('',*,*,#1009,.T.);
#551=CARTESIAN_POINT('',(-4.93630442085762,3.22579999999014,-2238.50915453849));
#552=DIRECTION('',(-2.96059473233375E-13,1.0,0.0));
#553=DIRECTION('',(1.0,2.96059473233375E-13,0.0));
#554=ORIENTED_EDGE('',*,*,#948,.T.);
#555=ORIENTED_EDGE('',*,*,#1010,.F.);
#556=ORIENTED_EDGE('',*,*,#1011,.F.);
#557=ORIENTED_EDGE('',*,*,#1012,.T.);
#558=CARTESIAN_POINT('',(-3.97887161802296,3.22579999999042,-2235.6954767979));
#559=DIRECTION('',(-0.866025403784319,-2.56395024851106E-13,-0.500000000000208));
#560=DIRECTION('',(-0.500000000000208,0.0,0.866025403784319));
#561=ORIENTED_EDGE('',*,*,#1013,.T.);
#562=ORIENTED_EDGE('',*,*,#1001,.T.);
#563=ORIENTED_EDGE('',*,*,#1014,.T.);
#564=ORIENTED_EDGE('',*,*,#1015,.T.);
#565=CARTESIAN_POINT('',(-5.02762838197876,3.22579999999011,-2236.30097679788));
#566=DIRECTION('',(-2.96059473233375E-13,1.0,0.0));
#567=DIRECTION('',(1.0,2.96059473233375E-13,0.0));
#568=ORIENTED_EDGE('',*,*,#966,.F.);
#569=ORIENTED_EDGE('',*,*,#1016,.F.);
#570=ORIENTED_EDGE('',*,*,#1017,.T.);
#571=ORIENTED_EDGE('',*,*,#1018,.F.);
#572=CARTESIAN_POINT('',(-1.0302277549575E-12,3.4798,-2243.79808459707));
#573=DIRECTION('',(2.96059473233375E-13,-1.0,-7.84339459127392E-43));
#574=DIRECTION('',(-1.39818712163731E-15,-4.1394654271363E-28,-1.0));
#575=ORIENTED_EDGE('',*,*,#953,.T.);
#576=ORIENTED_EDGE('',*,*,#1019,.F.);
#577=ORIENTED_EDGE('',*,*,#1020,.F.);
#578=ORIENTED_EDGE('',*,*,#1021,.T.);
#579=CARTESIAN_POINT('',(-1.70337161802297,3.22579999999109,-2239.63675841052));
#580=DIRECTION('',(-0.866025403784557,-2.56395024851177E-13,-0.499999999999794));
#581=DIRECTION('',(-0.499999999999794,0.0,0.866025403784557));
#582=ORIENTED_EDGE('',*,*,#963,.T.);
#583=ORIENTED_EDGE('',*,*,#1022,.F.);
#584=ORIENTED_EDGE('',*,*,#1023,.F.);
#585=ORIENTED_EDGE('',*,*,#1024,.T.);
#586=CARTESIAN_POINT('',(-0.062270256034072,2.8956,-2254.03409518984));
#587=DIRECTION('',(-2.96059473233375E-13,1.0,8.05543197322515E-43));
#588=DIRECTION('',(1.39818712163731E-15,4.1394654271363E-28,1.0));
#589=ORIENTED_EDGE('',*,*,#955,.T.);
#590=ORIENTED_EDGE('',*,*,#1025,.F.);
#591=ORIENTED_EDGE('',*,*,#996,.F.);
#592=ORIENTED_EDGE('',*,*,#1026,.T.);
#593=CARTESIAN_POINT('',(-1.79469557914421,3.22579999999107,-2237.42858066991));
#594=DIRECTION('',(0.866025403784443,2.56395024851143E-13,0.499999999999993));
#595=DIRECTION('',(8.74462187486449E-29,-1.0,5.12790049702293E-13));
#596=ORIENTED_EDGE('',*,*,#952,.T.);
#597=ORIENTED_EDGE('',*,*,#1027,.F.);
#598=ORIENTED_EDGE('',*,*,#1028,.F.);
#599=ORIENTED_EDGE('',*,*,#1019,.T.);
#600=CARTESIAN_POINT('',(-1.13319557914421,3.22579999999126,-2238.57433227912));
#601=DIRECTION('',(-0.499999999999991,-1.48029736616685E-13,0.866025403784444));
#602=DIRECTION('',(-2.96059473233375E-13,1.0,-6.55846640614837E-29));
#603=ORIENTED_EDGE('',*,*,#951,.T.);
#604=ORIENTED_EDGE('',*,*,#1029,.F.);
#605=ORIENTED_EDGE('',*,*,#1030,.F.);
#606=ORIENTED_EDGE('',*,*,#1027,.T.);
#607=CARTESIAN_POINT('',(-0.815695579143799,3.22579999999136,-2239.12425841052));
#608=DIRECTION('',(0.866025403784066,2.56395024851031E-13,0.500000000000646));
#609=DIRECTION('',(1.74892437497214E-28,-1.0,5.12790049701399E-13));
#610=ORIENTED_EDGE('',*,*,#976,.F.);
#611=ORIENTED_EDGE('',*,*,#1031,.F.);
#612=ORIENTED_EDGE('',*,*,#1032,.T.);
#613=ORIENTED_EDGE('',*,*,#1033,.F.);
#614=CARTESIAN_POINT('',(-1.0302277549575E-12,3.4798,-2243.79808459707));
#615=DIRECTION('',(2.96059473233375E-13,-1.0,-7.84339459127392E-43));
#616=DIRECTION('',(-1.39818712163731E-15,-4.1394654271363E-28,-1.0));
#617=ORIENTED_EDGE('',*,*,#935,.T.);
#618=ORIENTED_EDGE('',*,*,#1034,.F.);
#619=ORIENTED_EDGE('',*,*,#1009,.F.);
#620=ORIENTED_EDGE('',*,*,#1035,.T.);
#621=CARTESIAN_POINT('',(-4.61880442085763,3.22579999999023,-2239.05908066989));
#622=DIRECTION('',(0.499999999999992,1.48029736616685E-13,-0.866025403784444));
#623=DIRECTION('',(-2.5243548967072E-29,-1.0,-1.70930016567424E-13));
#624=ORIENTED_EDGE('',*,*,#960,.T.);
#625=ORIENTED_EDGE('',*,*,#1036,.T.);
#626=ORIENTED_EDGE('',*,*,#1037,.F.);
#627=ORIENTED_EDGE('',*,*,#1036,.F.);
#628=CARTESIAN_POINT('',(7.44219999999897,3.4798000000022,-2243.79808459707));
#629=DIRECTION('',(2.96059473233375E-13,-1.0,-9.54499642267409E-43));
#630=DIRECTION('',(-1.39818712163731E-15,-4.1394654271363E-28,-1.0));
#631=ORIENTED_EDGE('',*,*,#964,.T.);
#632=ORIENTED_EDGE('',*,*,#1024,.F.);
#633=ORIENTED_EDGE('',*,*,#1038,.F.);
#634=ORIENTED_EDGE('',*,*,#1039,.T.);
#635=CARTESIAN_POINT('',(-8.57269810694561E-13,2.8956,-2243.79808459707));
#636=DIRECTION('',(-2.96059473233375E-13,1.0,8.07881731205636E-43));
#637=DIRECTION('',(1.39818712163731E-15,4.1394654271363E-28,1.0));
#638=ORIENTED_EDGE('',*,*,#1040,.F.);
#639=ORIENTED_EDGE('',*,*,#1041,.F.);
#640=ORIENTED_EDGE('',*,*,#1042,.T.);
#641=ORIENTED_EDGE('',*,*,#931,.T.);
#642=ORIENTED_EDGE('',*,*,#930,.T.);
#643=ORIENTED_EDGE('',*,*,#1042,.F.);
#644=CARTESIAN_POINT('',(4.86561587736444,2.89560000000144,-2250.97557850678));
#645=DIRECTION('',(-2.96059473233375E-13,1.0,8.05543197322515E-43));
#646=DIRECTION('',(1.39818712163731E-15,4.1394654271363E-28,1.0));
#647=ORIENTED_EDGE('',*,*,#947,.T.);
#648=ORIENTED_EDGE('',*,*,#1043,.F.);
#649=ORIENTED_EDGE('',*,*,#1044,.F.);
#650=ORIENTED_EDGE('',*,*,#1010,.T.);
#651=CARTESIAN_POINT('',(-3.09119557914378,3.22579999999068,-2235.1829767979));
#652=DIRECTION('',(-0.499999999999989,-1.48029736616684E-13,0.866025403784445));
#653=DIRECTION('',(-2.96059473233375E-13,1.0,2.18615546871613E-29));
#654=ORIENTED_EDGE('',*,*,#1045,.T.);
#655=ORIENTED_EDGE('',*,*,#1046,.T.);
#656=ORIENTED_EDGE('',*,*,#972,.F.);
#657=ORIENTED_EDGE('',*,*,#1004,.T.);
#658=CARTESIAN_POINT('',(-1.0302277549575E-12,3.4798,-2243.79808459707));
#659=DIRECTION('',(2.96059473233375E-13,-1.0,-7.84339459127392E-43));
#660=DIRECTION('',(-1.39818712163731E-15,-4.1394654271363E-28,-1.0));
#661=ORIENTED_EDGE('',*,*,#1047,.T.);
#662=ORIENTED_EDGE('',*,*,#1005,.F.);
#663=ORIENTED_EDGE('',*,*,#970,.F.);
#664=ORIENTED_EDGE('',*,*,#1048,.T.);
#665=CARTESIAN_POINT('',(-2.56146047875382,3.47979999999924,-2233.16390490629));
#666=DIRECTION('',(-0.866025403784439,-2.56395024851142E-13,-0.499999999999999));
#667=DIRECTION('',(-0.499999999999999,0.0,0.866025403784439));
#668=ORIENTED_EDGE('',*,*,#1049,.T.);
#669=ORIENTED_EDGE('',*,*,#1048,.F.);
#670=ORIENTED_EDGE('',*,*,#969,.F.);
#671=ORIENTED_EDGE('',*,*,#1050,.T.);
#672=CARTESIAN_POINT('',(-7.92873952124826,3.47979999999765,-2236.26270490629));
#673=DIRECTION('',(0.5,1.48029736616687E-13,-0.866025403784439));
#674=DIRECTION('',(1.0097419586829E-28,-1.0,-1.70930016567427E-13));
#675=ORIENTED_EDGE('',*,*,#949,.T.);
#676=ORIENTED_EDGE('',*,*,#1012,.F.);
#677=ORIENTED_EDGE('',*,*,#1051,.F.);
#678=ORIENTED_EDGE('',*,*,#1052,.T.);
#679=CARTESIAN_POINT('',(-2.7736955791442,3.22579999999078,-2235.7329029293));
#680=DIRECTION('',(0.500000000000001,1.48029736616688E-13,-0.866025403784438));
#681=DIRECTION('',(-8.83524213847533E-29,-1.0,-1.70930016567429E-13));
#682=ORIENTED_EDGE('',*,*,#1053,.T.);
#683=ORIENTED_EDGE('',*,*,#1051,.T.);
#684=ORIENTED_EDGE('',*,*,#1011,.T.);
#685=ORIENTED_EDGE('',*,*,#1044,.T.);
#686=CARTESIAN_POINT('',(-3.09119557914378,3.22579999999068,-2235.1829767979));
#687=DIRECTION('',(-2.96059473233375E-13,1.0,0.0));
#688=DIRECTION('',(1.0,2.96059473233375E-13,0.0));
#689=ORIENTED_EDGE('',*,*,#1054,.T.);
#690=ORIENTED_EDGE('',*,*,#1022,.T.);
#691=ORIENTED_EDGE('',*,*,#982,.F.);
#692=ORIENTED_EDGE('',*,*,#1055,.T.);
#693=CARTESIAN_POINT('',(-1.0302277549575E-12,3.4798,-2243.79808459707));
#694=DIRECTION('',(2.96059473233375E-13,-1.0,-7.84339459127392E-43));
#695=DIRECTION('',(-1.39818712163731E-15,-4.1394654271363E-28,-1.0));
#696=ORIENTED_EDGE('',*,*,#950,.T.);
#697=ORIENTED_EDGE('',*,*,#1021,.F.);
#698=ORIENTED_EDGE('',*,*,#1056,.F.);
#699=ORIENTED_EDGE('',*,*,#1029,.T.);
#700=CARTESIAN_POINT('',(-0.815695579143799,3.22579999999136,-2239.12425841052));
#701=DIRECTION('',(0.49999999999999,1.48029736616685E-13,-0.866025403784444));
#702=DIRECTION('',(-2.52435489670719E-29,-1.0,-1.70930016567424E-13));
#703=ORIENTED_EDGE('',*,*,#946,.T.);
#704=ORIENTED_EDGE('',*,*,#1052,.F.);
#705=ORIENTED_EDGE('',*,*,#1053,.F.);
#706=ORIENTED_EDGE('',*,*,#1043,.T.);
#707=CARTESIAN_POINT('',(-3.09119557914378,3.22579999999068,-2235.1829767979));
#708=DIRECTION('',(0.866025403784816,2.56395024851254E-13,0.499999999999346));
#709=DIRECTION('',(-1.31169328123024E-28,-1.0,5.12790049703179E-13));
#710=ORIENTED_EDGE('',*,*,#944,.T.);
#711=ORIENTED_EDGE('',*,*,#1057,.F.);
#712=ORIENTED_EDGE('',*,*,#1014,.F.);
#713=ORIENTED_EDGE('',*,*,#1000,.T.);
#714=CARTESIAN_POINT('',(-5.59780442085743,3.22579999998994,-2237.36340292928));
#715=DIRECTION('',(0.499999999999976,1.4802973661668E-13,-0.866025403784453));
#716=DIRECTION('',(-5.04870979341423E-29,-1.0,-1.70930016567416E-13));
#717=ORIENTED_EDGE('',*,*,#943,.T.);
#718=ORIENTED_EDGE('',*,*,#1058,.F.);
#719=ORIENTED_EDGE('',*,*,#1015,.F.);
#720=ORIENTED_EDGE('',*,*,#1057,.T.);
#721=CARTESIAN_POINT('',(-5.91530442085765,3.22579999998985,-2236.81347679788));
#722=DIRECTION('',(-0.866025403784234,-2.56395024851081E-13,-0.500000000000354));
#723=DIRECTION('',(-0.500000000000354,0.0,0.866025403784234));
#724=ORIENTED_EDGE('',*,*,#942,.T.);
#725=ORIENTED_EDGE('',*,*,#1002,.F.);
#726=ORIENTED_EDGE('',*,*,#1013,.F.);
#727=ORIENTED_EDGE('',*,*,#1058,.T.);
#728=CARTESIAN_POINT('',(-5.91530442085765,3.22579999998985,-2236.81347679788));
#729=DIRECTION('',(-0.500000000000001,-1.48029736616689E-13,0.866025403784438));
#730=DIRECTION('',(-2.96059473233376E-13,1.0,1.07121617967089E-27));
#731=ORIENTED_EDGE('',*,*,#1059,.F.);
#732=ORIENTED_EDGE('',*,*,#1050,.F.);
#733=ORIENTED_EDGE('',*,*,#968,.T.);
#734=ORIENTED_EDGE('',*,*,#1060,.T.);
#735=CARTESIAN_POINT('',(-7.92873952124826,3.47979999999765,-2236.26270490629));
#736=DIRECTION('',(-0.866025403784438,-2.56395024851142E-13,-0.5));
#737=DIRECTION('',(-0.5,0.0,0.866025403784438));
#738=ORIENTED_EDGE('',*,*,#938,.T.);
#739=ORIENTED_EDGE('',*,*,#985,.F.);
#740=ORIENTED_EDGE('',*,*,#988,.F.);
#741=ORIENTED_EDGE('',*,*,#1061,.T.);
#742=CARTESIAN_POINT('',(-3.63980442085785,3.22579999999052,-2240.7547584105));
#743=DIRECTION('',(-0.866025403784638,-2.56395024851201E-13,-0.499999999999654));
#744=DIRECTION('',(-0.499999999999654,0.0,0.866025403784638));
#745=ORIENTED_EDGE('',*,*,#1056,.T.);
#746=ORIENTED_EDGE('',*,*,#1020,.T.);
#747=ORIENTED_EDGE('',*,*,#1028,.T.);
#748=ORIENTED_EDGE('',*,*,#1030,.T.);
#749=CARTESIAN_POINT('',(-1.70337161802297,3.22579999999109,-2239.63675841052));
#750=DIRECTION('',(-2.96059473233375E-13,1.0,0.0));
#751=DIRECTION('',(1.0,2.96059473233375E-13,0.0));
#752=ORIENTED_EDGE('',*,*,#937,.T.);
#753=ORIENTED_EDGE('',*,*,#1062,.F.);
#754=ORIENTED_EDGE('',*,*,#1007,.F.);
#755=ORIENTED_EDGE('',*,*,#1063,.T.);
#756=CARTESIAN_POINT('',(-4.93630442085762,3.22579999999014,-2238.50915453849));
#757=DIRECTION('',(-0.499999999999982,-1.48029736616682E-13,0.866025403784449));
#758=DIRECTION('',(-2.96059473233375E-13,1.0,8.74462187486455E-29));
#759=ORIENTED_EDGE('',*,*,#956,.T.);
#760=ORIENTED_EDGE('',*,*,#1026,.F.);
#761=ORIENTED_EDGE('',*,*,#995,.F.);
#762=ORIENTED_EDGE('',*,*,#1064,.T.);
#763=CARTESIAN_POINT('',(-2.1121955791442,3.22579999999097,-2236.87865453851));
#764=DIRECTION('',(-0.500000000000001,-1.48029736616689E-13,0.866025403784438));
#765=DIRECTION('',(-2.96059473233376E-13,1.0,1.2898317265425E-27));
#766=ORIENTED_EDGE('',*,*,#934,.T.);
#767=ORIENTED_EDGE('',*,*,#1063,.F.);
#768=ORIENTED_EDGE('',*,*,#1006,.F.);
#769=ORIENTED_EDGE('',*,*,#1034,.T.);
#770=CARTESIAN_POINT('',(-4.61880442085763,3.22579999999023,-2239.05908066989));
#771=DIRECTION('',(-0.866025403784447,-2.56395024851144E-13,-0.499999999999986));
#772=DIRECTION('',(-0.499999999999986,0.0,0.866025403784447));
#773=ORIENTED_EDGE('',*,*,#973,.T.);
#774=ORIENTED_EDGE('',*,*,#1046,.F.);
#775=ORIENTED_EDGE('',*,*,#1065,.F.);
#776=ORIENTED_EDGE('',*,*,#1066,.T.);
#777=CARTESIAN_POINT('',(0.0622702560323601,2.8956,-2233.56207400431));
#778=DIRECTION('',(-2.96059473233375E-13,1.0,8.05543197322515E-43));
#779=DIRECTION('',(1.39818712163731E-15,4.1394654271363E-28,1.0));
#780=ORIENTED_EDGE('',*,*,#1067,.T.);
#781=ORIENTED_EDGE('',*,*,#1068,.F.);
#782=ORIENTED_EDGE('',*,*,#978,.F.);
#783=ORIENTED_EDGE('',*,*,#1069,.T.);
#784=CARTESIAN_POINT('',(7.60280382120604,3.47980000000225,-2250.76892709538));
#785=DIRECTION('',(-0.866025403784444,-2.56395024851143E-13,-0.499999999999992));
#786=DIRECTION('',(-0.499999999999992,0.0,0.866025403784444));
#787=ORIENTED_EDGE('',*,*,#957,.T.);
#788=ORIENTED_EDGE('',*,*,#1064,.F.);
#789=ORIENTED_EDGE('',*,*,#994,.F.);
#790=ORIENTED_EDGE('',*,*,#1070,.T.);
#791=CARTESIAN_POINT('',(-2.68237161802284,3.2257999999908,-2237.94108066991));
#792=DIRECTION('',(-0.866025403784439,-2.56395024851141E-13,-0.499999999999999));
#793=DIRECTION('',(-0.499999999999999,0.0,0.866025403784439));
#794=ORIENTED_EDGE('',*,*,#954,.T.);
#795=ORIENTED_EDGE('',*,*,#1070,.F.);
#796=ORIENTED_EDGE('',*,*,#993,.F.);
#797=ORIENTED_EDGE('',*,*,#1025,.T.);
#798=CARTESIAN_POINT('',(-1.79469557914421,3.22579999999107,-2237.42858066991));
#799=DIRECTION('',(0.49999999999999,1.48029736616685E-13,-0.866025403784444));
#800=DIRECTION('',(-2.52435489670719E-29,-1.0,-1.70930016567424E-13));
#801=ORIENTED_EDGE('',*,*,#1071,.T.);
#802=ORIENTED_EDGE('',*,*,#1072,.T.);
#803=ORIENTED_EDGE('',*,*,#1040,.T.);
#804=ORIENTED_EDGE('',*,*,#1041,.T.);
#805=ORIENTED_EDGE('',*,*,#1073,.T.);
#806=ORIENTED_EDGE('',*,*,#1074,.T.);
#807=ORIENTED_EDGE('',*,*,#990,.T.);
#808=ORIENTED_EDGE('',*,*,#991,.T.);
#809=ORIENTED_EDGE('',*,*,#1037,.T.);
#810=ORIENTED_EDGE('',*,*,#999,.F.);
#811=ORIENTED_EDGE('',*,*,#998,.F.);
#812=ORIENTED_EDGE('',*,*,#1038,.T.);
#813=ORIENTED_EDGE('',*,*,#1023,.T.);
#814=ORIENTED_EDGE('',*,*,#1054,.F.);
#815=ORIENTED_EDGE('',*,*,#1075,.T.);
#816=ORIENTED_EDGE('',*,*,#1076,.T.);
#817=ORIENTED_EDGE('',*,*,#1077,.T.);
#818=ORIENTED_EDGE('',*,*,#1067,.F.);
#819=ORIENTED_EDGE('',*,*,#1078,.F.);
#820=ORIENTED_EDGE('',*,*,#1032,.F.);
#821=ORIENTED_EDGE('',*,*,#1079,.T.);
#822=ORIENTED_EDGE('',*,*,#1080,.T.);
#823=ORIENTED_EDGE('',*,*,#1065,.T.);
#824=ORIENTED_EDGE('',*,*,#1045,.F.);
#825=ORIENTED_EDGE('',*,*,#1003,.T.);
#826=ORIENTED_EDGE('',*,*,#1047,.F.);
#827=ORIENTED_EDGE('',*,*,#1049,.F.);
#828=ORIENTED_EDGE('',*,*,#1059,.T.);
#829=ORIENTED_EDGE('',*,*,#1081,.F.);
#830=ORIENTED_EDGE('',*,*,#1017,.F.);
#831=ORIENTED_EDGE('',*,*,#1082,.T.);
#832=CARTESIAN_POINT('',(-8.57269810694561E-13,2.8956,-2243.79808459707));
#833=DIRECTION('',(-2.96059473233375E-13,1.0,0.0));
#834=DIRECTION('',(1.0,2.96059473233375E-13,0.0));
#835=ORIENTED_EDGE('',*,*,#1074,.F.);
#836=ORIENTED_EDGE('',*,*,#1083,.T.);
#837=ORIENTED_EDGE('',*,*,#933,.T.);
#838=ORIENTED_EDGE('',*,*,#1083,.F.);
#839=CARTESIAN_POINT('',(2.70055236790335,2.8956000000008,-2252.22557850678));
#840=DIRECTION('',(-2.96059473233375E-13,1.0,8.05543197322515E-43));
#841=DIRECTION('',(1.39818712163731E-15,4.1394654271363E-28,1.0));
#842=ORIENTED_EDGE('',*,*,#1073,.F.);
#843=ORIENTED_EDGE('',*,*,#1084,.T.);
#844=ORIENTED_EDGE('',*,*,#932,.T.);
#845=ORIENTED_EDGE('',*,*,#1084,.F.);
#846=CARTESIAN_POINT('',(3.78308412263389,2.89560000000112,-2251.60057850678));
#847=DIRECTION('',(-2.96059473233375E-13,1.0,8.05543197322515E-43));
#848=DIRECTION('',(1.39818712163731E-15,4.1394654271363E-28,1.0));
#849=ORIENTED_EDGE('',*,*,#939,.T.);
#850=ORIENTED_EDGE('',*,*,#1061,.F.);
#851=ORIENTED_EDGE('',*,*,#989,.F.);
#852=ORIENTED_EDGE('',*,*,#986,.T.);
#853=CARTESIAN_POINT('',(-3.63980442085785,3.22579999999052,-2240.7547584105));
#854=DIRECTION('',(0.5,1.48029736616687E-13,-0.866025403784439));
#855=DIRECTION('',(1.0097419586829E-28,-1.0,-1.70930016567427E-13));
#856=ORIENTED_EDGE('',*,*,#1081,.T.);
#857=ORIENTED_EDGE('',*,*,#1060,.F.);
#858=ORIENTED_EDGE('',*,*,#967,.F.);
#859=ORIENTED_EDGE('',*,*,#1018,.T.);
#860=CARTESIAN_POINT('',(-8.65866199350216,3.47979999999744,-2237.43684209876));
#861=DIRECTION('',(2.96059473233375E-13,-1.0,-8.05543197322515E-43));
#862=DIRECTION('',(-1.39818712163731E-15,-4.1394654271363E-28,-1.0));
#863=ORIENTED_EDGE('',*,*,#975,.T.);
#864=ORIENTED_EDGE('',*,*,#1085,.F.);
#865=ORIENTED_EDGE('',*,*,#1079,.F.);
#866=ORIENTED_EDGE('',*,*,#1031,.T.);
#867=CARTESIAN_POINT('',(6.4212026452919,2.8956000000019,-2235.82638797539));
#868=DIRECTION('',(-2.96059473233375E-13,1.0,-4.04893308403183E-29));
#869=DIRECTION('',(-0.226742739199353,-6.7129335926853E-14,-0.973954685917355));
#870=ORIENTED_EDGE('',*,*,#974,.T.);
#871=ORIENTED_EDGE('',*,*,#1066,.F.);
#872=ORIENTED_EDGE('',*,*,#1080,.F.);
#873=ORIENTED_EDGE('',*,*,#1085,.T.);
#874=CARTESIAN_POINT('',(-8.57269810694561E-13,2.8956,-2243.79808459707));
#875=DIRECTION('',(-2.96059473233375E-13,1.0,8.07881731205636E-43));
#876=DIRECTION('',(1.39818712163731E-15,4.1394654271363E-28,1.0));
#877=ORIENTED_EDGE('',*,*,#1075,.F.);
#878=ORIENTED_EDGE('',*,*,#1055,.F.);
#879=ORIENTED_EDGE('',*,*,#981,.T.);
#880=ORIENTED_EDGE('',*,*,#1086,.T.);
#881=CARTESIAN_POINT('',(1.17966660641757,3.47980000000035,-2254.47732709538));
#882=DIRECTION('',(2.96059473233375E-13,-1.0,4.85871970083819E-29));
#883=DIRECTION('',(0.451628759703717,1.33708972694925E-13,0.892205953470656));
#884=ORIENTED_EDGE('',*,*,#1076,.F.);
#885=ORIENTED_EDGE('',*,*,#1086,.F.);
#886=ORIENTED_EDGE('',*,*,#980,.T.);
#887=ORIENTED_EDGE('',*,*,#1087,.T.);
#888=CARTESIAN_POINT('',(2.23552477871157,3.47980000000066,-2253.86772709538));
#889=DIRECTION('',(-0.866025403784443,-2.56395024851143E-13,-0.499999999999993));
#890=DIRECTION('',(-0.499999999999993,0.0,0.866025403784443));
#891=ORIENTED_EDGE('',*,*,#936,.T.);
#892=ORIENTED_EDGE('',*,*,#1035,.F.);
#893=ORIENTED_EDGE('',*,*,#1008,.F.);
#894=ORIENTED_EDGE('',*,*,#1062,.T.);
#895=CARTESIAN_POINT('',(-3.73112838197861,3.22579999999049,-2238.54658066989));
#896=DIRECTION('',(0.866025403784439,2.56395024851142E-13,0.499999999999999));
#897=DIRECTION('',(-2.18615546871612E-27,-1.0,5.1279004970229E-13));
#898=ORIENTED_EDGE('',*,*,#1077,.F.);
#899=ORIENTED_EDGE('',*,*,#1087,.F.);
#900=ORIENTED_EDGE('',*,*,#979,.T.);
#901=ORIENTED_EDGE('',*,*,#1068,.T.);
#902=CARTESIAN_POINT('',(3.62826047875164,3.47980000000107,-2256.28001608937));
#903=DIRECTION('',(0.499999999999993,1.48029736616685E-13,-0.866025403784443));
#904=DIRECTION('',(6.31088724176801E-29,-1.0,-1.70930016567424E-13));
#905=ORIENTED_EDGE('',*,*,#1071,.F.);
#906=ORIENTED_EDGE('',*,*,#1072,.F.);
#907=ORIENTED_EDGE('',*,*,#1088,.T.);
#908=ORIENTED_EDGE('',*,*,#929,.T.);
#909=ORIENTED_EDGE('',*,*,#928,.T.);
#910=ORIENTED_EDGE('',*,*,#1088,.F.);
#911=CARTESIAN_POINT('',(5.94814763209499,2.89560000000176,-2250.35057850678));
#912=DIRECTION('',(-2.96059473233375E-13,1.0,8.05543197322515E-43));
#913=DIRECTION('',(1.39818712163731E-15,4.1394654271363E-28,1.0));
#914=ORIENTED_EDGE('',*,*,#965,.T.);
#915=ORIENTED_EDGE('',*,*,#1039,.F.);
#916=ORIENTED_EDGE('',*,*,#1082,.F.);
#917=ORIENTED_EDGE('',*,*,#1016,.T.);
#918=CARTESIAN_POINT('',(-6.42120264529361,2.8955999999981,-2251.76978121875));
#919=DIRECTION('',(-2.96059473233375E-13,1.0,8.05543197322515E-43));
#920=DIRECTION('',(1.39818712163731E-15,4.1394654271363E-28,1.0));
#921=ORIENTED_EDGE('',*,*,#1078,.T.);
#922=ORIENTED_EDGE('',*,*,#1069,.F.);
#923=ORIENTED_EDGE('',*,*,#977,.F.);
#924=ORIENTED_EDGE('',*,*,#1033,.T.);
#925=CARTESIAN_POINT('',(8.65866199350003,3.47980000000256,-2250.15932709538));
#926=DIRECTION('',(2.96059473233375E-13,-1.0,-8.05543197322515E-43));
#927=DIRECTION('',(-1.39818712163731E-15,-4.1394654271363E-28,-1.0));
#928=EDGE_CURVE('',#1089,#1090,#1091,.T.);
#929=EDGE_CURVE('',#1090,#1089,#1092,.T.);
#930=EDGE_CURVE('',#1093,#1094,#1095,.T.);
#931=EDGE_CURVE('',#1094,#1093,#1096,.T.);
#932=EDGE_CURVE('',#1097,#1097,#1098,.T.);
#933=EDGE_CURVE('',#1099,#1099,#1100,.T.);
#934=EDGE_CURVE('',#1101,#1102,#1103,.T.);
#935=EDGE_CURVE('',#1104,#1101,#1105,.T.);
#936=EDGE_CURVE('',#1106,#1104,#1107,.T.);
#937=EDGE_CURVE('',#1102,#1106,#1108,.T.);
#938=EDGE_CURVE('',#1109,#1110,#1111,.T.);
#939=EDGE_CURVE('',#1112,#1109,#1113,.T.);
#940=EDGE_CURVE('',#1114,#1112,#1115,.T.);
#941=EDGE_CURVE('',#1110,#1114,#1116,.T.);
#942=EDGE_CURVE('',#1117,#1118,#1119,.T.);
#943=EDGE_CURVE('',#1120,#1117,#1121,.T.);
#944=EDGE_CURVE('',#1122,#1120,#1123,.T.);
#945=EDGE_CURVE('',#1118,#1122,#1124,.T.);
#946=EDGE_CURVE('',#1125,#1126,#1127,.T.);
#947=EDGE_CURVE('',#1128,#1125,#1129,.T.);
#948=EDGE_CURVE('',#1130,#1128,#1131,.T.);
#949=EDGE_CURVE('',#1126,#1130,#1132,.T.);
#950=EDGE_CURVE('',#1133,#1134,#1135,.T.);
#951=EDGE_CURVE('',#1136,#1133,#1137,.T.);
#952=EDGE_CURVE('',#1138,#1136,#1139,.T.);
#953=EDGE_CURVE('',#1134,#1138,#1140,.T.);
#954=EDGE_CURVE('',#1141,#1142,#1143,.T.);
#955=EDGE_CURVE('',#1144,#1141,#1145,.T.);
#956=EDGE_CURVE('',#1146,#1144,#1147,.T.);
#957=EDGE_CURVE('',#1142,#1146,#1148,.T.);
#958=EDGE_CURVE('',#1149,#1150,#1151,.T.);
#959=EDGE_CURVE('',#1150,#1149,#1152,.T.);
#960=EDGE_CURVE('',#1153,#1153,#1154,.T.);
#961=EDGE_CURVE('',#1155,#1156,#1157,.T.);
#962=EDGE_CURVE('',#1156,#1155,#1158,.T.);
#963=EDGE_CURVE('',#1159,#1160,#1161,.T.);
#964=EDGE_CURVE('',#1162,#1159,#1163,.T.);
#965=EDGE_CURVE('',#1164,#1162,#1165,.T.);
#966=EDGE_CURVE('',#1164,#1166,#1167,.T.);
#967=EDGE_CURVE('',#1166,#1168,#1169,.T.);
#968=EDGE_CURVE('',#1170,#1168,#1171,.T.);
#969=EDGE_CURVE('',#1170,#1172,#1173,.T.);
#970=EDGE_CURVE('',#1172,#1174,#1175,.T.);
#971=EDGE_CURVE('',#1176,#1174,#1177,.T.);
#972=EDGE_CURVE('',#1176,#1178,#1179,.T.);
#973=EDGE_CURVE('',#1180,#1178,#1181,.T.);
#974=EDGE_CURVE('',#1182,#1180,#1183,.T.);
#975=EDGE_CURVE('',#1184,#1182,#1185,.T.);
#976=EDGE_CURVE('',#1184,#1186,#1187,.T.);
#977=EDGE_CURVE('',#1186,#1188,#1189,.T.);
#978=EDGE_CURVE('',#1188,#1190,#1191,.T.);
#979=EDGE_CURVE('',#1192,#1190,#1193,.T.);
#980=EDGE_CURVE('',#1194,#1192,#1195,.T.);
#981=EDGE_CURVE('',#1196,#1194,#1197,.T.);
#982=EDGE_CURVE('',#1196,#1160,#1198,.T.);
#983=EDGE_CURVE('',#1199,#1114,#1200,.T.);
#984=EDGE_CURVE('',#1201,#1199,#1202,.T.);
#985=EDGE_CURVE('',#1201,#1110,#1203,.T.);
#986=EDGE_CURVE('',#1204,#1112,#1205,.T.);
#987=EDGE_CURVE('',#1199,#1204,#1206,.T.);
#988=EDGE_CURVE('',#1207,#1201,#1208,.T.);
#989=EDGE_CURVE('',#1204,#1207,#1209,.T.);
#990=EDGE_CURVE('',#1210,#1211,#1212,.T.);
#991=EDGE_CURVE('',#1211,#1210,#1213,.T.);
#992=EDGE_CURVE('',#1211,#1150,#1214,.T.);
#993=EDGE_CURVE('',#1215,#1216,#1217,.T.);
#994=EDGE_CURVE('',#1216,#1218,#1219,.T.);
#995=EDGE_CURVE('',#1218,#1220,#1221,.T.);
#996=EDGE_CURVE('',#1220,#1215,#1222,.T.);
#997=EDGE_CURVE('',#1156,#1223,#1224,.T.);
#998=EDGE_CURVE('',#1223,#1225,#1226,.T.);
#999=EDGE_CURVE('',#1225,#1223,#1227,.T.);
#1000=EDGE_CURVE('',#1228,#1122,#1229,.T.);
#1001=EDGE_CURVE('',#1230,#1228,#1231,.T.);
#1002=EDGE_CURVE('',#1230,#1118,#1232,.T.);
#1003=EDGE_CURVE('',#1233,#1234,#1235,.T.);
#1004=EDGE_CURVE('',#1176,#1233,#1236,.T.);
#1005=EDGE_CURVE('',#1174,#1234,#1237,.T.);
#1006=EDGE_CURVE('',#1238,#1239,#1240,.T.);
#1007=EDGE_CURVE('',#1239,#1241,#1242,.T.);
#1008=EDGE_CURVE('',#1241,#1243,#1244,.T.);
#1009=EDGE_CURVE('',#1243,#1238,#1245,.T.);
#1010=EDGE_CURVE('',#1246,#1128,#1247,.T.);
#1011=EDGE_CURVE('',#1248,#1246,#1249,.T.);
#1012=EDGE_CURVE('',#1248,#1130,#1250,.T.);
#1013=EDGE_CURVE('',#1251,#1230,#1252,.T.);
#1014=EDGE_CURVE('',#1228,#1253,#1254,.T.);
#1015=EDGE_CURVE('',#1253,#1251,#1255,.T.);
#1016=EDGE_CURVE('',#1256,#1164,#1257,.T.);
#1017=EDGE_CURVE('',#1256,#1258,#1259,.T.);
#1018=EDGE_CURVE('',#1166,#1258,#1260,.T.);
#1019=EDGE_CURVE('',#1261,#1138,#1262,.T.);
#1020=EDGE_CURVE('',#1263,#1261,#1264,.T.);
#1021=EDGE_CURVE('',#1263,#1134,#1265,.T.);
#1022=EDGE_CURVE('',#1266,#1160,#1267,.T.);
#1023=EDGE_CURVE('',#1268,#1266,#1269,.T.);
#1024=EDGE_CURVE('',#1268,#1159,#1270,.T.);
#1025=EDGE_CURVE('',#1215,#1141,#1271,.T.);
#1026=EDGE_CURVE('',#1220,#1144,#1272,.T.);
#1027=EDGE_CURVE('',#1273,#1136,#1274,.T.);
#1028=EDGE_CURVE('',#1261,#1273,#1275,.T.);
#1029=EDGE_CURVE('',#1276,#1133,#1277,.T.);
#1030=EDGE_CURVE('',#1273,#1276,#1278,.T.);
#1031=EDGE_CURVE('',#1279,#1184,#1280,.T.);
#1032=EDGE_CURVE('',#1279,#1281,#1282,.T.);
#1033=EDGE_CURVE('',#1186,#1281,#1283,.T.);
#1034=EDGE_CURVE('',#1238,#1101,#1284,.T.);
#1035=EDGE_CURVE('',#1243,#1104,#1285,.T.);
#1036=EDGE_CURVE('',#1153,#1286,#1287,.T.);
#1037=EDGE_CURVE('',#1286,#1286,#1288,.T.);
#1038=EDGE_CURVE('',#1289,#1268,#1290,.T.);
#1039=EDGE_CURVE('',#1289,#1162,#1291,.T.);
#1040=EDGE_CURVE('',#1292,#1293,#1294,.T.);
#1041=EDGE_CURVE('',#1293,#1292,#1295,.T.);
#1042=EDGE_CURVE('',#1293,#1094,#1296,.T.);
#1043=EDGE_CURVE('',#1297,#1125,#1298,.T.);
#1044=EDGE_CURVE('',#1246,#1297,#1299,.T.);
#1045=EDGE_CURVE('',#1233,#1300,#1301,.T.);
#1046=EDGE_CURVE('',#1300,#1178,#1302,.T.);
#1047=EDGE_CURVE('',#1303,#1234,#1304,.T.);
#1048=EDGE_CURVE('',#1172,#1303,#1305,.T.);
#1049=EDGE_CURVE('',#1306,#1303,#1307,.T.);
#1050=EDGE_CURVE('',#1170,#1306,#1308,.T.);
#1051=EDGE_CURVE('',#1309,#1248,#1310,.T.);
#1052=EDGE_CURVE('',#1309,#1126,#1311,.T.);
#1053=EDGE_CURVE('',#1297,#1309,#1312,.T.);
#1054=EDGE_CURVE('',#1313,#1266,#1314,.T.);
#1055=EDGE_CURVE('',#1196,#1313,#1315,.T.);
#1056=EDGE_CURVE('',#1276,#1263,#1316,.T.);
#1057=EDGE_CURVE('',#1253,#1120,#1317,.T.);
#1058=EDGE_CURVE('',#1251,#1117,#1318,.T.);
#1059=EDGE_CURVE('',#1306,#1319,#1320,.T.);
#1060=EDGE_CURVE('',#1168,#1319,#1321,.T.);
#1061=EDGE_CURVE('',#1207,#1109,#1322,.T.);
#1062=EDGE_CURVE('',#1241,#1106,#1323,.T.);
#1063=EDGE_CURVE('',#1239,#1102,#1324,.T.);
#1064=EDGE_CURVE('',#1218,#1146,#1325,.T.);
#1065=EDGE_CURVE('',#1326,#1300,#1327,.T.);
#1066=EDGE_CURVE('',#1326,#1180,#1328,.T.);
#1067=EDGE_CURVE('',#1329,#1330,#1331,.T.);
#1068=EDGE_CURVE('',#1190,#1330,#1332,.T.);
#1069=EDGE_CURVE('',#1188,#1329,#1333,.T.);
#1070=EDGE_CURVE('',#1216,#1142,#1334,.T.);
#1071=EDGE_CURVE('',#1335,#1336,#1337,.T.);
#1072=EDGE_CURVE('',#1336,#1335,#1338,.T.);
#1073=EDGE_CURVE('',#1339,#1339,#1340,.T.);
#1074=EDGE_CURVE('',#1341,#1341,#1342,.T.);
#1075=EDGE_CURVE('',#1313,#1343,#1344,.T.);
#1076=EDGE_CURVE('',#1343,#1345,#1346,.T.);
#1077=EDGE_CURVE('',#1345,#1330,#1347,.T.);
#1078=EDGE_CURVE('',#1281,#1329,#1348,.T.);
#1079=EDGE_CURVE('',#1279,#1349,#1350,.T.);
#1080=EDGE_CURVE('',#1349,#1326,#1351,.T.);
#1081=EDGE_CURVE('',#1258,#1319,#1352,.T.);
#1082=EDGE_CURVE('',#1256,#1289,#1353,.T.);
#1083=EDGE_CURVE('',#1341,#1099,#1354,.T.);
#1084=EDGE_CURVE('',#1339,#1097,#1355,.T.);
#1085=EDGE_CURVE('',#1349,#1182,#1356,.T.);
#1086=EDGE_CURVE('',#1194,#1343,#1357,.T.);
#1087=EDGE_CURVE('',#1192,#1345,#1358,.T.);
#1088=EDGE_CURVE('',#1336,#1090,#1359,.T.);
#1089=VERTEX_POINT('',#1360);
#1090=VERTEX_POINT('',#1361);
#1091=CIRCLE('',#1362,0.3048);
#1092=CIRCLE('',#1363,0.3048);
#1093=VERTEX_POINT('',#1364);
#1094=VERTEX_POINT('',#1365);
#1095=CIRCLE('',#1366,0.3048);
#1096=CIRCLE('',#1367,0.3048);
#1097=VERTEX_POINT('',#1368);
#1098=CIRCLE('',#1369,0.3048);
#1099=VERTEX_POINT('',#1370);
#1100=CIRCLE('',#1371,0.3048);
#1101=VERTEX_POINT('',#1372);
#1102=VERTEX_POINT('',#1373);
#1103=LINE('',#1374,#1375);
#1104=VERTEX_POINT('',#1376);
#1105=LINE('',#1377,#1378);
#1106=VERTEX_POINT('',#1379);
#1107=LINE('',#1380,#1381);
#1108=LINE('',#1382,#1383);
#1109=VERTEX_POINT('',#1384);
#1110=VERTEX_POINT('',#1385);
#1111=LINE('',#1386,#1387);
#1112=VERTEX_POINT('',#1388);
#1113=LINE('',#1389,#1390);
#1114=VERTEX_POINT('',#1391);
#1115=LINE('',#1392,#1393);
#1116=LINE('',#1394,#1395);
#1117=VERTEX_POINT('',#1396);
#1118=VERTEX_POINT('',#1397);
#1119=LINE('',#1398,#1399);
#1120=VERTEX_POINT('',#1400);
#1121=LINE('',#1401,#1402);
#1122=VERTEX_POINT('',#1403);
#1123=LINE('',#1404,#1405);
#1124=LINE('',#1406,#1407);
#1125=VERTEX_POINT('',#1408);
#1126=VERTEX_POINT('',#1409);
#1127=LINE('',#1410,#1411);
#1128=VERTEX_POINT('',#1412);
#1129=LINE('',#1413,#1414);
#1130=VERTEX_POINT('',#1415);
#1131=LINE('',#1416,#1417);
#1132=LINE('',#1418,#1419);
#1133=VERTEX_POINT('',#1420);
#1134=VERTEX_POINT('',#1421);
#1135=LINE('',#1422,#1423);
#1136=VERTEX_POINT('',#1424);
#1137=LINE('',#1425,#1426);
#1138=VERTEX_POINT('',#1427);
#1139=LINE('',#1428,#1429);
#1140=LINE('',#1430,#1431);
#1141=VERTEX_POINT('',#1432);
#1142=VERTEX_POINT('',#1433);
#1143=LINE('',#1434,#1435);
#1144=VERTEX_POINT('',#1436);
#1145=LINE('',#1437,#1438);
#1146=VERTEX_POINT('',#1439);
#1147=LINE('',#1440,#1441);
#1148=LINE('',#1442,#1443);
#1149=VERTEX_POINT('',#1444);
#1150=VERTEX_POINT('',#1445);
#1151=CIRCLE('',#1446,4.1656);
#1152=CIRCLE('',#1447,4.1656);
#1153=VERTEX_POINT('',#1448);
#1154=CIRCLE('',#1449,1.27);
#1155=VERTEX_POINT('',#1450);
#1156=VERTEX_POINT('',#1451);
#1157=CIRCLE('',#1452,1.27);
#1158=CIRCLE('',#1453,1.27);
#1159=VERTEX_POINT('',#1454);
#1160=VERTEX_POINT('',#1455);
#1161=CIRCLE('',#1456,1.2192);
#1162=VERTEX_POINT('',#1457);
#1163=CIRCLE('',#1458,9.017);
#1164=VERTEX_POINT('',#1459);
#1165=CIRCLE('',#1460,1.2192);
#1166=VERTEX_POINT('',#1461);
#1167=CIRCLE('',#1462,9.525);
#1168=VERTEX_POINT('',#1463);
#1169=CIRCLE('',#1464,1.2192);
#1170=VERTEX_POINT('',#1465);
#1171=LINE('',#1466,#1467);
#1172=VERTEX_POINT('',#1468);
#1173=LINE('',#1469,#1470);
#1174=VERTEX_POINT('',#1471);
#1175=LINE('',#1472,#1473);
#1176=VERTEX_POINT('',#1474);
#1177=CIRCLE('',#1475,1.2192);
#1178=VERTEX_POINT('',#1476);
#1179=CIRCLE('',#1477,9.525);
#1180=VERTEX_POINT('',#1478);
#1181=CIRCLE('',#1479,1.2192);
#1182=VERTEX_POINT('',#1480);
#1183=CIRCLE('',#1481,9.017);
#1184=VERTEX_POINT('',#1482);
#1185=CIRCLE('',#1483,1.2192);
#1186=VERTEX_POINT('',#1484);
#1187=CIRCLE('',#1485,9.525);
#1188=VERTEX_POINT('',#1486);
#1189=CIRCLE('',#1487,1.2192);
#1190=VERTEX_POINT('',#1488);
#1191=LINE('',#1489,#1490);
#1192=VERTEX_POINT('',#1491);
#1193=LINE('',#1492,#1493);
#1194=VERTEX_POINT('',#1494);
#1195=LINE('',#1495,#1496);
#1196=VERTEX_POINT('',#1497);
#1197=CIRCLE('',#1498,1.2192);
#1198=CIRCLE('',#1499,9.525);
#1199=VERTEX_POINT('',#1500);
#1200=LINE('',#1501,#1502);
#1201=VERTEX_POINT('',#1503);
#1202=LINE('',#1504,#1505);
#1203=LINE('',#1506,#1507);
#1204=VERTEX_POINT('',#1508);
#1205=LINE('',#1509,#1510);
#1206=LINE('',#1511,#1512);
#1207=VERTEX_POINT('',#1513);
#1208=LINE('',#1514,#1515);
#1209=LINE('',#1516,#1517);
#1210=VERTEX_POINT('',#1518);
#1211=VERTEX_POINT('',#1519);
#1212=CIRCLE('',#1520,4.1656);
#1213=CIRCLE('',#1521,4.1656);
#1214=LINE('',#1522,#1523);
#1215=VERTEX_POINT('',#1524);
#1216=VERTEX_POINT('',#1525);
#1217=LINE('',#1526,#1527);
#1218=VERTEX_POINT('',#1528);
#1219=LINE('',#1529,#1530);
#1220=VERTEX_POINT('',#1531);
#1221=LINE('',#1532,#1533);
#1222=LINE('',#1534,#1535);
#1223=VERTEX_POINT('',#1536);
#1224=LINE('',#1537,#1538);
#1225=VERTEX_POINT('',#1539);
#1226=CIRCLE('',#1540,1.27);
#1227=CIRCLE('',#1541,1.27);
#1228=VERTEX_POINT('',#1542);
#1229=LINE('',#1543,#1544);
#1230=VERTEX_POINT('',#1545);
#1231=LINE('',#1546,#1547);
#1232=LINE('',#1548,#1549);
#1233=VERTEX_POINT('',#1550);
#1234=VERTEX_POINT('',#1551);
#1235=CIRCLE('',#1552,1.2192);
#1236=LINE('',#1553,#1554);
#1237=LINE('',#1555,#1556);
#1238=VERTEX_POINT('',#1557);
#1239=VERTEX_POINT('',#1558);
#1240=LINE('',#1559,#1560);
#1241=VERTEX_POINT('',#1561);
#1242=LINE('',#1562,#1563);
#1243=VERTEX_POINT('',#1564);
#1244=LINE('',#1565,#1566);
#1245=LINE('',#1567,#1568);
#1246=VERTEX_POINT('',#1569);
#1247=LINE('',#1570,#1571);
#1248=VERTEX_POINT('',#1572);
#1249=LINE('',#1573,#1574);
#1250=LINE('',#1575,#1576);
#1251=VERTEX_POINT('',#1577);
#1252=LINE('',#1578,#1579);
#1253=VERTEX_POINT('',#1580);
#1254=LINE('',#1581,#1582);
#1255=LINE('',#1583,#1584);
#1256=VERTEX_POINT('',#1585);
#1257=LINE('',#1586,#1587);
#1258=VERTEX_POINT('',#1588);
#1259=CIRCLE('',#1589,9.525);
#1260=LINE('',#1590,#1591);
#1261=VERTEX_POINT('',#1592);
#1262=LINE('',#1593,#1594);
#1263=VERTEX_POINT('',#1595);
#1264=LINE('',#1596,#1597);
#1265=LINE('',#1598,#1599);
#1266=VERTEX_POINT('',#1600);
#1267=LINE('',#1601,#1602);
#1268=VERTEX_POINT('',#1603);
#1269=CIRCLE('',#1604,1.2192);
#1270=LINE('',#1605,#1606);
#1271=LINE('',#1607,#1608);
#1272=LINE('',#1609,#1610);
#1273=VERTEX_POINT('',#1611);
#1274=LINE('',#1612,#1613);
#1275=LINE('',#1614,#1615);
#1276=VERTEX_POINT('',#1616);
#1277=LINE('',#1617,#1618);
#1278=LINE('',#1619,#1620);
#1279=VERTEX_POINT('',#1621);
#1280=LINE('',#1622,#1623);
#1281=VERTEX_POINT('',#1624);
#1282=CIRCLE('',#1625,9.525);
#1283=LINE('',#1626,#1627);
#1284=LINE('',#1628,#1629);
#1285=LINE('',#1630,#1631);
#1286=VERTEX_POINT('',#1632);
#1287=LINE('',#1633,#1634);
#1288=CIRCLE('',#1635,1.27);
#1289=VERTEX_POINT('',#1636);
#1290=CIRCLE('',#1637,9.017);
#1291=LINE('',#1638,#1639);
#1292=VERTEX_POINT('',#1640);
#1293=VERTEX_POINT('',#1641);
#1294=CIRCLE('',#1642,0.3048);
#1295=CIRCLE('',#1643,0.3048);
#1296=LINE('',#1644,#1645);
#1297=VERTEX_POINT('',#1646);
#1298=LINE('',#1647,#1648);
#1299=LINE('',#1649,#1650);
#1300=VERTEX_POINT('',#1651);
#1301=CIRCLE('',#1652,9.525);
#1302=LINE('',#1653,#1654);
#1303=VERTEX_POINT('',#1655);
#1304=LINE('',#1656,#1657);
#1305=LINE('',#1658,#1659);
#1306=VERTEX_POINT('',#1660);
#1307=LINE('',#1661,#1662);
#1308=LINE('',#1663,#1664);
#1309=VERTEX_POINT('',#1665);
#1310=LINE('',#1666,#1667);
#1311=LINE('',#1668,#1669);
#1312=LINE('',#1670,#1671);
#1313=VERTEX_POINT('',#1672);
#1314=CIRCLE('',#1673,9.525);
#1315=LINE('',#1674,#1675);
#1316=LINE('',#1676,#1677);
#1317=LINE('',#1678,#1679);
#1318=LINE('',#1680,#1681);
#1319=VERTEX_POINT('',#1682);
#1320=LINE('',#1683,#1684);
#1321=LINE('',#1685,#1686);
#1322=LINE('',#1687,#1688);
#1323=LINE('',#1689,#1690);
#1324=LINE('',#1691,#1692);
#1325=LINE('',#1693,#1694);
#1326=VERTEX_POINT('',#1695);
#1327=CIRCLE('',#1696,1.2192);
#1328=LINE('',#1697,#1698);
#1329=VERTEX_POINT('',#1699);
#1330=VERTEX_POINT('',#1700);
#1331=LINE('',#1701,#1702);
#1332=LINE('',#1703,#1704);
#1333=LINE('',#1705,#1706);
#1334=LINE('',#1707,#1708);
#1335=VERTEX_POINT('',#1709);
#1336=VERTEX_POINT('',#1710);
#1337=CIRCLE('',#1711,0.3048);
#1338=CIRCLE('',#1712,0.3048);
#1339=VERTEX_POINT('',#1713);
#1340=CIRCLE('',#1714,0.3048);
#1341=VERTEX_POINT('',#1715);
#1342=CIRCLE('',#1716,0.3048);
#1343=VERTEX_POINT('',#1717);
#1344=CIRCLE('',#1718,1.2192);
#1345=VERTEX_POINT('',#1719);
#1346=LINE('',#1720,#1721);
#1347=LINE('',#1722,#1723);
#1348=CIRCLE('',#1724,1.2192);
#1349=VERTEX_POINT('',#1725);
#1350=CIRCLE('',#1726,1.2192);
#1351=CIRCLE('',#1727,9.017);
#1352=CIRCLE('',#1728,1.2192);
#1353=CIRCLE('',#1729,1.2192);
#1354=LINE('',#1730,#1731);
#1355=LINE('',#1732,#1733);
#1356=LINE('',#1734,#1735);
#1357=LINE('',#1736,#1737);
#1358=LINE('',#1738,#1739);
#1359=LINE('',#1740,#1741);
#1360=CARTESIAN_POINT('',(5.94814763209481,3.47979999987967,-2250.04577850678));
#1361=CARTESIAN_POINT('',(5.94814763209481,3.47979999987967,-2250.65537850678));
#1362=AXIS2_PLACEMENT_3D('',#1742,#1743,#1744);
#1363=AXIS2_PLACEMENT_3D('',#1745,#1746,#1747);
#1364=CARTESIAN_POINT('',(4.86561587736427,3.47979999987935,-2250.67077850678));
#1365=CARTESIAN_POINT('',(4.86561587736427,3.47979999987935,-2251.28037850678));
#1366=AXIS2_PLACEMENT_3D('',#1748,#1749,#1750);
#1367=AXIS2_PLACEMENT_3D('',#1751,#1752,#1753);
#1368=CARTESIAN_POINT('',(3.78308412263372,3.47979999987903,-2251.90537850678));
#1369=AXIS2_PLACEMENT_3D('',#1754,#1755,#1756);
#1370=CARTESIAN_POINT('',(2.70055236790317,3.47979999987871,-2252.53037850678));
#1371=AXIS2_PLACEMENT_3D('',#1757,#1758,#1759);
#1372=CARTESIAN_POINT('',(-4.6188044208577,3.47979999999023,-2239.05908066989));
#1373=CARTESIAN_POINT('',(-4.9363044208577,3.47979999999854,-2238.50915453849));
#1374=CARTESIAN_POINT('',(-4.6188044208577,3.47979999999023,-2239.05908066989));
#1375=VECTOR('',#1760,1.0);
#1376=CARTESIAN_POINT('',(-3.73112838197869,3.47979999999049,-2238.54658066989));
#1377=CARTESIAN_POINT('',(-3.73112838197861,3.47979999999049,-2238.54658066989));
#1378=VECTOR('',#1761,1.0);
#1379=CARTESIAN_POINT('',(-4.04862838197868,3.4797999999904,-2237.99665453849));
#1380=CARTESIAN_POINT('',(-4.04862838197865,3.4797999999904,-2237.99665453849));
#1381=VECTOR('',#1762,1.0);
#1382=CARTESIAN_POINT('',(-4.9363044208577,3.47979999999014,-2238.50915453849));
#1383=VECTOR('',#1763,1.0);
#1384=CARTESIAN_POINT('',(-3.63980442085792,3.47979999999052,-2240.7547584105));
#1385=CARTESIAN_POINT('',(-3.9573044208577,3.47979999999883,-2240.2048322791));
#1386=CARTESIAN_POINT('',(-3.63980442085792,3.47979999999052,-2240.7547584105));
#1387=VECTOR('',#1764,1.0);
#1388=CARTESIAN_POINT('',(-2.75212838197885,3.47979999999078,-2240.2422584105));
#1389=CARTESIAN_POINT('',(-2.75212838197899,3.47979999999078,-2240.2422584105));
#1390=VECTOR('',#1765,1.0);
#1391=CARTESIAN_POINT('',(-3.0696283819787,3.47979999999069,-2239.6923322791));
#1392=CARTESIAN_POINT('',(-3.06962838197882,3.47979999999069,-2239.6923322791));
#1393=VECTOR('',#1766,1.0);
#1394=CARTESIAN_POINT('',(-3.9573044208577,3.47979999999043,-2240.2048322791));
#1395=VECTOR('',#1767,1.0);
#1396=CARTESIAN_POINT('',(-5.91530442085772,3.47979999998985,-2236.81347679788));
#1397=CARTESIAN_POINT('',(-5.02762838197884,3.47979999999851,-2236.30097679788));
#1398=CARTESIAN_POINT('',(-5.91530442085772,3.47979999998985,-2236.81347679788));
#1399=VECTOR('',#1768,1.0);
#1400=CARTESIAN_POINT('',(-5.59780442085751,3.47979999998994,-2237.36340292928));
#1401=CARTESIAN_POINT('',(-5.59780442085748,3.47979999998994,-2237.36340292928));
#1402=VECTOR('',#1769,1.0);
#1403=CARTESIAN_POINT('',(-4.71012838197868,3.4797999999902,-2236.85090292928));
#1404=CARTESIAN_POINT('',(-4.71012838197855,3.4797999999902,-2236.85090292928));
#1405=VECTOR('',#1770,1.0);
#1406=CARTESIAN_POINT('',(-5.02762838197884,3.47979999999011,-2236.30097679788));
#1407=VECTOR('',#1771,1.0);
#1408=CARTESIAN_POINT('',(-3.09119557914386,3.47979999999068,-2235.1829767979));
#1409=CARTESIAN_POINT('',(-2.77369557914427,3.47979999999918,-2235.7329029293));
#1410=CARTESIAN_POINT('',(-3.09119557914386,3.47979999999068,-2235.1829767979));
#1411=VECTOR('',#1772,1.0);
#1412=CARTESIAN_POINT('',(-3.97887161802304,3.47979999999042,-2235.6954767979));
#1413=CARTESIAN_POINT('',(-3.97887161802307,3.47979999999042,-2235.6954767979));
#1414=VECTOR('',#1773,1.0);
#1415=CARTESIAN_POINT('',(-3.6613716180229,3.47979999999051,-2236.2454029293));
#1416=CARTESIAN_POINT('',(-3.66137161802291,3.47979999999051,-2236.2454029293));
#1417=VECTOR('',#1774,1.0);
#1418=CARTESIAN_POINT('',(-2.77369557914427,3.47979999999078,-2235.7329029293));
#1419=VECTOR('',#1775,1.0);
#1420=CARTESIAN_POINT('',(-0.815695579143874,3.47979999999136,-2239.12425841052));
#1421=CARTESIAN_POINT('',(-1.70337161802305,3.4797999999995,-2239.63675841052));
#1422=CARTESIAN_POINT('',(-0.815695579143874,3.47979999999136,-2239.12425841052));
#1423=VECTOR('',#1776,1.0);
#1424=CARTESIAN_POINT('',(-1.13319557914428,3.47979999999126,-2238.57433227912));
#1425=CARTESIAN_POINT('',(-1.13319557914435,3.47979999999126,-2238.57433227912));
#1426=VECTOR('',#1777,1.0);
#1427=CARTESIAN_POINT('',(-2.02087161802292,3.479799999991,-2239.08683227912));
#1428=CARTESIAN_POINT('',(-2.02087161802289,3.479799999991,-2239.08683227912));
#1429=VECTOR('',#1778,1.0);
#1430=CARTESIAN_POINT('',(-1.70337161802305,3.47979999999109,-2239.63675841052));
#1431=VECTOR('',#1779,1.0);
#1432=CARTESIAN_POINT('',(-1.79469557914428,3.47979999999107,-2237.42858066991));
#1433=CARTESIAN_POINT('',(-2.68237161802292,3.47979999999921,-2237.94108066991));
#1434=CARTESIAN_POINT('',(-1.79469557914428,3.47979999999107,-2237.42858066991));
#1435=VECTOR('',#1780,1.0);
#1436=CARTESIAN_POINT('',(-2.11219557914428,3.47979999999097,-2236.87865453851));
#1437=CARTESIAN_POINT('',(-2.11219557914443,3.47979999999097,-2236.87865453851));
#1438=VECTOR('',#1781,1.0);
#1439=CARTESIAN_POINT('',(-2.99987161802291,3.47979999999071,-2237.39115453851));
#1440=CARTESIAN_POINT('',(-2.99987161802307,3.47979999999071,-2237.39115453851));
#1441=VECTOR('',#1782,1.0);
#1442=CARTESIAN_POINT('',(-2.68237161802292,3.4797999999908,-2237.94108066991));
#1443=VECTOR('',#1783,1.0);
#1444=CARTESIAN_POINT('',(-1.02440346668361E-12,3.4798,-2239.63248459707));
#1445=CARTESIAN_POINT('',(-1.03656218210204E-12,3.4798,-2247.96368459707));
#1446=AXIS2_PLACEMENT_3D('',#1784,#1785,#1786);
#1447=AXIS2_PLACEMENT_3D('',#1787,#1788,#1789);
#1448=CARTESIAN_POINT('',(7.44219999999897,3.4798000000022,-2242.52808459707));
#1449=AXIS2_PLACEMENT_3D('',#1790,#1791,#1792);
#1450=CARTESIAN_POINT('',(-7.44220000000103,3.4797999999978,-2245.06808459707));
#1451=CARTESIAN_POINT('',(-7.44220000000103,3.4797999999978,-2242.52808459707));
#1452=AXIS2_PLACEMENT_3D('',#1793,#1794,#1795);
#1453=AXIS2_PLACEMENT_3D('',#1796,#1797,#1798);
#1454=CARTESIAN_POINT('',(-0.0548534513454233,3.4798,-2252.81491774951));
#1455=CARTESIAN_POINT('',(0.8963816843577,3.47980000000027,-2253.28081230992));
#1456=AXIS2_PLACEMENT_3D('',#1799,#1800,#1801);
#1457=CARTESIAN_POINT('',(-5.65639438977504,3.47979999999833,-2250.82029874272));
#1458=AXIS2_PLACEMENT_3D('',#1802,#1803,#1804);
#1459=CARTESIAN_POINT('',(-6.68800782977995,3.47979999999802,-2250.58013268514));
#1460=AXIS2_PLACEMENT_3D('',#1805,#1806,#1807);
#1461=CARTESIAN_POINT('',(-7.67611878856585,3.47979999999773,-2238.15868521914));
#1462=AXIS2_PLACEMENT_3D('',#1808,#1809,#1810);
#1463=CARTESIAN_POINT('',(-7.60280382120816,3.47979999999775,-2236.82724209876));
#1464=AXIS2_PLACEMENT_3D('',#1811,#1812,#1813);
#1465=CARTESIAN_POINT('',(-7.92873952124826,3.47979999999765,-2236.26270490629));
#1466=CARTESIAN_POINT('',(-7.92873952124826,3.47979999999765,-2236.26270490629));
#1467=VECTOR('',#1814,1.0);
#1468=CARTESIAN_POINT('',(-2.56146047875382,3.47979999999924,-2233.16390490629));
#1469=CARTESIAN_POINT('',(-7.92873952124826,3.47979999999765,-2236.26270490629));
#1470=VECTOR('',#1815,1.0);
#1471=CARTESIAN_POINT('',(-2.23552477871372,3.47979999999934,-2233.72844209876));
#1472=CARTESIAN_POINT('',(-2.56146047875382,3.47979999999924,-2233.16390490629));
#1473=VECTOR('',#1816,1.0);
#1474=CARTESIAN_POINT('',(-1.04580372909563,3.47979999999969,-2234.33067103474));
#1475=AXIS2_PLACEMENT_3D('',#1817,#1818,#1819);
#1476=CARTESIAN_POINT('',(-0.896381684359754,3.47979999999973,-2234.31535688423));
#1477=AXIS2_PLACEMENT_3D('',#1820,#1821,#1822);
#1478=CARTESIAN_POINT('',(0.054853451343369,3.4798,-2234.78125144464));
#1479=AXIS2_PLACEMENT_3D('',#1823,#1824,#1825);
#1480=CARTESIAN_POINT('',(5.65639438977298,3.47980000000168,-2236.77587045143));
#1481=AXIS2_PLACEMENT_3D('',#1826,#1827,#1828);
#1482=CARTESIAN_POINT('',(6.68800782977789,3.47980000000198,-2237.01603650901));
#1483=AXIS2_PLACEMENT_3D('',#1829,#1830,#1831);
#1484=CARTESIAN_POINT('',(7.67611878856374,3.47980000000227,-2249.43748397501));
#1485=AXIS2_PLACEMENT_3D('',#1832,#1833,#1834);
#1486=CARTESIAN_POINT('',(7.60280382120604,3.47980000000225,-2250.76892709538));
#1487=AXIS2_PLACEMENT_3D('',#1835,#1836,#1837);
#1488=CARTESIAN_POINT('',(8.99553952124611,3.47980000000266,-2253.18121608937));
#1489=CARTESIAN_POINT('',(7.60280382120604,3.47980000000225,-2250.76892709538));
#1490=VECTOR('',#1838,1.0);
#1491=CARTESIAN_POINT('',(3.62826047875164,3.47980000000107,-2256.28001608937));
#1492=CARTESIAN_POINT('',(3.62826047875164,3.47980000000107,-2256.28001608937));
#1493=VECTOR('',#1839,1.0);
#1494=CARTESIAN_POINT('',(2.23552477871157,3.47980000000066,-2253.86772709538));
#1495=CARTESIAN_POINT('',(2.23552477871157,3.47980000000066,-2253.86772709538));
#1496=VECTOR('',#1840,1.0);
#1497=CARTESIAN_POINT('',(1.04580372909348,3.47980000000031,-2253.2654981594));
#1498=AXIS2_PLACEMENT_3D('',#1841,#1842,#1843);
#1499=AXIS2_PLACEMENT_3D('',#1844,#1845,#1846);
#1500=CARTESIAN_POINT('',(-3.06962838197862,3.22579999999069,-2239.6923322791));
#1501=CARTESIAN_POINT('',(-3.06962838197862,3.22579999999069,-2239.6923322791));
#1502=VECTOR('',#1847,1.0);
#1503=CARTESIAN_POINT('',(-3.95730442085763,3.22579999999043,-2240.2048322791));
#1504=CARTESIAN_POINT('',(-3.95730442085763,3.22579999999043,-2240.2048322791));
#1505=VECTOR('',#1848,1.0);
#1506=CARTESIAN_POINT('',(-3.95730442085763,3.22579999999043,-2240.2048322791));
#1507=VECTOR('',#1849,1.0);
#1508=CARTESIAN_POINT('',(-2.75212838197877,3.22579999999078,-2240.2422584105));
#1509=CARTESIAN_POINT('',(-2.75212838197877,3.22579999999078,-2240.2422584105));
#1510=VECTOR('',#1850,1.0);
#1511=CARTESIAN_POINT('',(-3.06962838197874,3.22579999999069,-2239.6923322791));
#1512=VECTOR('',#1851,1.0);
#1513=CARTESIAN_POINT('',(-3.63980442085785,3.22579999999052,-2240.7547584105));
#1514=CARTESIAN_POINT('',(-3.63980442085785,3.22579999999052,-2240.7547584105));
#1515=VECTOR('',#1852,1.0);
#1516=CARTESIAN_POINT('',(-2.75212838197891,3.22579999999078,-2240.2422584105));
#1517=VECTOR('',#1853,1.0);
#1518=CARTESIAN_POINT('',(-8.51445522420669E-13,2.8956,-2239.63248459707));
#1519=CARTESIAN_POINT('',(-8.63604237839106E-13,2.8956,-2247.96368459707));
#1520=AXIS2_PLACEMENT_3D('',#1854,#1855,#1856);
#1521=AXIS2_PLACEMENT_3D('',#1857,#1858,#1859);
#1522=CARTESIAN_POINT('',(-8.63604237839106E-13,2.8956,-2247.96368459707));
#1523=VECTOR('',#1860,1.0);
#1524=CARTESIAN_POINT('',(-1.79469557914421,3.22579999999107,-2237.42858066991));
#1525=CARTESIAN_POINT('',(-2.68237161802284,3.2257999999908,-2237.94108066991));
#1526=CARTESIAN_POINT('',(-1.79469557914421,3.22579999999107,-2237.42858066991));
#1527=VECTOR('',#1861,1.0);
#1528=CARTESIAN_POINT('',(-2.99987161802283,3.22579999999071,-2237.39115453851));
#1529=CARTESIAN_POINT('',(-2.68237161802284,3.2257999999908,-2237.94108066991));
#1530=VECTOR('',#1862,1.0);
#1531=CARTESIAN_POINT('',(-2.1121955791442,3.22579999999097,-2236.87865453851));
#1532=CARTESIAN_POINT('',(-2.99987161802299,3.22579999999071,-2237.39115453851));
#1533=VECTOR('',#1863,1.0);
#1534=CARTESIAN_POINT('',(-2.11219557914436,3.22579999999097,-2236.87865453851));
#1535=VECTOR('',#1864,1.0);
#1536=CARTESIAN_POINT('',(-7.44220000000086,2.8955999999978,-2242.52808459707));
#1537=CARTESIAN_POINT('',(-7.44220000000103,3.4797999999978,-2242.52808459707));
#1538=VECTOR('',#1865,1.0);
#1539=CARTESIAN_POINT('',(-7.44220000000086,2.8955999999978,-2245.06808459707));
#1540=AXIS2_PLACEMENT_3D('',#1866,#1867,#1868);
#1541=AXIS2_PLACEMENT_3D('',#1869,#1870,#1871);
#1542=CARTESIAN_POINT('',(-4.71012838197861,3.2257999999902,-2236.85090292928));
#1543=CARTESIAN_POINT('',(-4.71012838197861,3.2257999999902,-2236.85090292928));
#1544=VECTOR('',#1872,1.0);
#1545=CARTESIAN_POINT('',(-5.02762838197876,3.22579999999011,-2236.30097679788));
#1546=CARTESIAN_POINT('',(-5.02762838197876,3.22579999999011,-2236.30097679788));
#1547=VECTOR('',#1873,1.0);
#1548=CARTESIAN_POINT('',(-5.02762838197876,3.22579999999011,-2236.30097679788));
#1549=VECTOR('',#1874,1.0);
#1550=CARTESIAN_POINT('',(-1.04580372909545,2.89559999999969,-2234.33067103474));
#1551=CARTESIAN_POINT('',(-2.23552477871355,2.89559999999934,-2233.72844209876));
#1552=AXIS2_PLACEMENT_3D('',#1875,#1876,#1877);
#1553=CARTESIAN_POINT('',(-1.04580372909563,3.47979999999969,-2234.33067103474));
#1554=VECTOR('',#1878,1.0);
#1555=CARTESIAN_POINT('',(-2.23552477871372,3.47979999999934,-2233.72844209876));
#1556=VECTOR('',#1879,1.0);
#1557=CARTESIAN_POINT('',(-4.61880442085763,3.22579999999023,-2239.05908066989));
#1558=CARTESIAN_POINT('',(-4.93630442085762,3.22579999999014,-2238.50915453849));
#1559=CARTESIAN_POINT('',(-4.61880442085763,3.22579999999023,-2239.05908066989));
#1560=VECTOR('',#1880,1.0);
#1561=CARTESIAN_POINT('',(-4.0486283819786,3.2257999999904,-2237.99665453849));
#1562=CARTESIAN_POINT('',(-4.93630442085762,3.22579999999014,-2238.50915453849));
#1563=VECTOR('',#1881,1.0);
#1564=CARTESIAN_POINT('',(-3.73112838197861,3.22579999999049,-2238.54658066989));
#1565=CARTESIAN_POINT('',(-4.04862838197857,3.2257999999904,-2237.99665453849));
#1566=VECTOR('',#1882,1.0);
#1567=CARTESIAN_POINT('',(-3.73112838197854,3.22579999999049,-2238.54658066989));
#1568=VECTOR('',#1883,1.0);
#1569=CARTESIAN_POINT('',(-3.97887161802296,3.22579999999042,-2235.6954767979));
#1570=CARTESIAN_POINT('',(-3.97887161802296,3.22579999999042,-2235.6954767979));
#1571=VECTOR('',#1884,1.0);
#1572=CARTESIAN_POINT('',(-3.66137161802283,3.22579999999051,-2236.2454029293));
#1573=CARTESIAN_POINT('',(-3.66137161802283,3.22579999999051,-2236.2454029293));
#1574=VECTOR('',#1885,1.0);
#1575=CARTESIAN_POINT('',(-3.66137161802283,3.22579999999051,-2236.2454029293));
#1576=VECTOR('',#1886,1.0);
#1577=CARTESIAN_POINT('',(-5.91530442085765,3.22579999998985,-2236.81347679788));
#1578=CARTESIAN_POINT('',(-5.91530442085765,3.22579999998985,-2236.81347679788));
#1579=VECTOR('',#1887,1.0);
#1580=CARTESIAN_POINT('',(-5.59780442085743,3.22579999998994,-2237.36340292928));
#1581=CARTESIAN_POINT('',(-4.71012838197847,3.2257999999902,-2236.85090292928));
#1582=VECTOR('',#1888,1.0);
#1583=CARTESIAN_POINT('',(-5.59780442085741,3.22579999998994,-2237.36340292928));
#1584=VECTOR('',#1889,1.0);
#1585=CARTESIAN_POINT('',(-6.68800782977978,2.89559999999802,-2250.58013268514));
#1586=CARTESIAN_POINT('',(-6.68800782977978,2.89559999999802,-2250.58013268514));
#1587=VECTOR('',#1890,1.0);
#1588=CARTESIAN_POINT('',(-7.67611878856567,2.89559999999773,-2238.15868521914));
#1589=AXIS2_PLACEMENT_3D('',#1891,#1892,#1893);
#1590=CARTESIAN_POINT('',(-7.67611878856584,3.47979999999773,-2238.15868521914));
#1591=VECTOR('',#1894,1.0);
#1592=CARTESIAN_POINT('',(-2.02087161802284,3.225799999991,-2239.08683227912));
#1593=CARTESIAN_POINT('',(-2.02087161802284,3.225799999991,-2239.08683227912));
#1594=VECTOR('',#1895,1.0);
#1595=CARTESIAN_POINT('',(-1.70337161802297,3.22579999999109,-2239.63675841052));
#1596=CARTESIAN_POINT('',(-1.70337161802297,3.22579999999109,-2239.63675841052));
#1597=VECTOR('',#1896,1.0);
#1598=CARTESIAN_POINT('',(-1.70337161802297,3.22579999999109,-2239.63675841052));
#1599=VECTOR('',#1897,1.0);
#1600=CARTESIAN_POINT('',(0.896381684357873,2.89560000000027,-2253.28081230992));
#1601=CARTESIAN_POINT('',(0.896381684357873,2.89560000000027,-2253.28081230992));
#1602=VECTOR('',#1898,1.0);
#1603=CARTESIAN_POINT('',(-0.0548534513452503,2.8956,-2252.81491774951));
#1604=AXIS2_PLACEMENT_3D('',#1899,#1900,#1901);
#1605=CARTESIAN_POINT('',(-0.0548534513452503,2.8956,-2252.81491774951));
#1606=VECTOR('',#1902,1.0);
#1607=CARTESIAN_POINT('',(-1.79469557914421,3.22579999999107,-2237.42858066991));
#1608=VECTOR('',#1903,1.0);
#1609=CARTESIAN_POINT('',(-2.1121955791442,3.22579999999097,-2236.87865453851));
#1610=VECTOR('',#1904,1.0);
#1611=CARTESIAN_POINT('',(-1.13319557914421,3.22579999999126,-2238.57433227912));
#1612=CARTESIAN_POINT('',(-1.13319557914421,3.22579999999126,-2238.57433227912));
#1613=VECTOR('',#1905,1.0);
#1614=CARTESIAN_POINT('',(-2.02087161802282,3.225799999991,-2239.08683227912));
#1615=VECTOR('',#1906,1.0);
#1616=CARTESIAN_POINT('',(-0.815695579143799,3.22579999999136,-2239.12425841052));
#1617=CARTESIAN_POINT('',(-0.815695579143799,3.22579999999136,-2239.12425841052));
#1618=VECTOR('',#1907,1.0);
#1619=CARTESIAN_POINT('',(-1.13319557914427,3.22579999999126,-2238.57433227912));
#1620=VECTOR('',#1908,1.0);
#1621=CARTESIAN_POINT('',(6.68800782977807,2.89560000000198,-2237.01603650901));
#1622=CARTESIAN_POINT('',(6.68800782977807,2.89560000000198,-2237.01603650901));
#1623=VECTOR('',#1909,1.0);
#1624=CARTESIAN_POINT('',(7.67611878856392,2.89560000000227,-2249.43748397501));
#1625=AXIS2_PLACEMENT_3D('',#1910,#1911,#1912);
#1626=CARTESIAN_POINT('',(7.67611878856374,3.47980000000227,-2249.43748397501));
#1627=VECTOR('',#1913,1.0);
#1628=CARTESIAN_POINT('',(-4.61880442085763,3.22579999999023,-2239.05908066989));
#1629=VECTOR('',#1914,1.0);
#1630=CARTESIAN_POINT('',(-3.73112838197861,3.22579999999049,-2238.54658066989));
#1631=VECTOR('',#1915,1.0);
#1632=CARTESIAN_POINT('',(7.44219999999915,2.8956000000022,-2242.52808459707));
#1633=CARTESIAN_POINT('',(7.44219999999897,3.4798000000022,-2242.52808459707));
#1634=VECTOR('',#1916,1.0);
#1635=AXIS2_PLACEMENT_3D('',#1917,#1918,#1919);
#1636=CARTESIAN_POINT('',(-5.65639438977487,2.89559999999833,-2250.82029874272));
#1637=AXIS2_PLACEMENT_3D('',#1920,#1921,#1922);
#1638=CARTESIAN_POINT('',(-5.65639438977487,2.89559999999833,-2250.82029874272));
#1639=VECTOR('',#1923,1.0);
#1640=CARTESIAN_POINT('',(4.86561587736444,2.89560000000144,-2250.67077850678));
#1641=CARTESIAN_POINT('',(4.86561587736444,2.89560000000144,-2251.28037850678));
#1642=AXIS2_PLACEMENT_3D('',#1924,#1925,#1926);
#1643=AXIS2_PLACEMENT_3D('',#1927,#1928,#1929);
#1644=CARTESIAN_POINT('',(4.86561587736444,2.89560000000144,-2251.28037850678));
#1645=VECTOR('',#1930,1.0);
#1646=CARTESIAN_POINT('',(-3.09119557914378,3.22579999999068,-2235.1829767979));
#1647=CARTESIAN_POINT('',(-3.09119557914378,3.22579999999068,-2235.1829767979));
#1648=VECTOR('',#1931,1.0);
#1649=CARTESIAN_POINT('',(-3.97887161802299,3.22579999999042,-2235.6954767979));
#1650=VECTOR('',#1932,1.0);
#1651=CARTESIAN_POINT('',(-0.896381684359582,2.89559999999974,-2234.31535688423));
#1652=AXIS2_PLACEMENT_3D('',#1933,#1934,#1935);
#1653=CARTESIAN_POINT('',(-0.896381684359582,2.89559999999974,-2234.31535688423));
#1654=VECTOR('',#1936,1.0);
#1655=CARTESIAN_POINT('',(-2.56146047875364,2.89559999999924,-2233.16390490629));
#1656=CARTESIAN_POINT('',(-2.56146047875364,2.89559999999924,-2233.16390490629));
#1657=VECTOR('',#1937,1.0);
#1658=CARTESIAN_POINT('',(-2.56146047875382,3.47979999999924,-2233.16390490629));
#1659=VECTOR('',#1938,1.0);
#1660=CARTESIAN_POINT('',(-7.92873952124809,2.89559999999765,-2236.26270490629));
#1661=CARTESIAN_POINT('',(-7.92873952124809,2.89559999999765,-2236.26270490629));
#1662=VECTOR('',#1939,1.0);
#1663=CARTESIAN_POINT('',(-7.92873952124826,3.47979999999765,-2236.26270490629));
#1664=VECTOR('',#1940,1.0);
#1665=CARTESIAN_POINT('',(-2.7736955791442,3.22579999999078,-2235.7329029293));
#1666=CARTESIAN_POINT('',(-2.7736955791442,3.22579999999078,-2235.7329029293));
#1667=VECTOR('',#1941,1.0);
#1668=CARTESIAN_POINT('',(-2.7736955791442,3.22579999999078,-2235.7329029293));
#1669=VECTOR('',#1942,1.0);
#1670=CARTESIAN_POINT('',(-3.09119557914378,3.22579999999068,-2235.1829767979));
#1671=VECTOR('',#1943,1.0);
#1672=CARTESIAN_POINT('',(1.04580372909365,2.89560000000031,-2253.2654981594));
#1673=AXIS2_PLACEMENT_3D('',#1944,#1945,#1946);
#1674=CARTESIAN_POINT('',(1.04580372909348,3.47980000000031,-2253.2654981594));
#1675=VECTOR('',#1947,1.0);
#1676=CARTESIAN_POINT('',(-0.815695579143799,3.22579999999136,-2239.12425841052));
#1677=VECTOR('',#1948,1.0);
#1678=CARTESIAN_POINT('',(-5.59780442085743,3.22579999998994,-2237.36340292928));
#1679=VECTOR('',#1949,1.0);
#1680=CARTESIAN_POINT('',(-5.91530442085765,3.22579999998985,-2236.81347679788));
#1681=VECTOR('',#1950,1.0);
#1682=CARTESIAN_POINT('',(-7.60280382120799,2.89559999999775,-2236.82724209876));
#1683=CARTESIAN_POINT('',(-7.92873952124809,2.89559999999765,-2236.26270490629));
#1684=VECTOR('',#1951,1.0);
#1685=CARTESIAN_POINT('',(-7.60280382120816,3.47979999999775,-2236.82724209876));
#1686=VECTOR('',#1952,1.0);
#1687=CARTESIAN_POINT('',(-3.63980442085785,3.22579999999052,-2240.7547584105));
#1688=VECTOR('',#1953,1.0);
#1689=CARTESIAN_POINT('',(-4.0486283819786,3.2257999999904,-2237.99665453849));
#1690=VECTOR('',#1954,1.0);
#1691=CARTESIAN_POINT('',(-4.93630442085762,3.22579999999014,-2238.50915453849));
#1692=VECTOR('',#1955,1.0);
#1693=CARTESIAN_POINT('',(-2.99987161802283,3.22579999999071,-2237.39115453851));
#1694=VECTOR('',#1956,1.0);
#1695=CARTESIAN_POINT('',(0.054853451343542,2.8956,-2234.78125144464));
#1696=AXIS2_PLACEMENT_3D('',#1957,#1958,#1959);
#1697=CARTESIAN_POINT('',(0.054853451343542,2.8956,-2234.78125144464));
#1698=VECTOR('',#1960,1.0);
#1699=CARTESIAN_POINT('',(7.60280382120621,2.89560000000225,-2250.76892709538));
#1700=CARTESIAN_POINT('',(8.99553952124629,2.89560000000266,-2253.18121608937));
#1701=CARTESIAN_POINT('',(7.60280382120621,2.89560000000225,-2250.76892709538));
#1702=VECTOR('',#1961,1.0);
#1703=CARTESIAN_POINT('',(8.99553952124611,3.47980000000266,-2253.18121608937));
#1704=VECTOR('',#1962,1.0);
#1705=CARTESIAN_POINT('',(7.60280382120604,3.47980000000225,-2250.76892709538));
#1706=VECTOR('',#1963,1.0);
#1707=CARTESIAN_POINT('',(-2.68237161802284,3.2257999999908,-2237.94108066991));
#1708=VECTOR('',#1964,1.0);
#1709=CARTESIAN_POINT('',(5.94814763209499,2.89560000000176,-2250.04577850678));
#1710=CARTESIAN_POINT('',(5.94814763209499,2.89560000000176,-2250.65537850678));
#1711=AXIS2_PLACEMENT_3D('',#1965,#1966,#1967);
#1712=AXIS2_PLACEMENT_3D('',#1968,#1969,#1970);
#1713=CARTESIAN_POINT('',(3.78308412263389,2.89560000000112,-2251.90537850678));
#1714=AXIS2_PLACEMENT_3D('',#1971,#1972,#1973);
#1715=CARTESIAN_POINT('',(2.70055236790335,2.8956000000008,-2252.53037850678));
#1716=AXIS2_PLACEMENT_3D('',#1974,#1975,#1976);
#1717=CARTESIAN_POINT('',(2.23552477871174,2.89560000000066,-2253.86772709538));
#1718=AXIS2_PLACEMENT_3D('',#1977,#1978,#1979);
#1719=CARTESIAN_POINT('',(3.62826047875182,2.89560000000107,-2256.28001608937));
#1720=CARTESIAN_POINT('',(2.23552477871174,2.89560000000066,-2253.86772709538));
#1721=VECTOR('',#1980,1.0);
#1722=CARTESIAN_POINT('',(3.62826047875182,2.89560000000107,-2256.28001608937));
#1723=VECTOR('',#1981,1.0);
#1724=AXIS2_PLACEMENT_3D('',#1982,#1983,#1984);
#1725=CARTESIAN_POINT('',(5.65639438977315,2.89560000000167,-2236.77587045143));
#1726=AXIS2_PLACEMENT_3D('',#1985,#1986,#1987);
#1727=AXIS2_PLACEMENT_3D('',#1988,#1989,#1990);
#1728=AXIS2_PLACEMENT_3D('',#1991,#1992,#1993);
#1729=AXIS2_PLACEMENT_3D('',#1994,#1995,#1996);
#1730=CARTESIAN_POINT('',(2.70055236790335,2.8956000000008,-2252.53037850678));
#1731=VECTOR('',#1997,1.0);
#1732=CARTESIAN_POINT('',(3.78308412263389,2.89560000000112,-2251.90537850678));
#1733=VECTOR('',#1998,1.0);
#1734=CARTESIAN_POINT('',(5.65639438977315,2.89560000000167,-2236.77587045143));
#1735=VECTOR('',#1999,1.0);
#1736=CARTESIAN_POINT('',(2.23552477871157,3.47980000000066,-2253.86772709538));
#1737=VECTOR('',#2000,1.0);
#1738=CARTESIAN_POINT('',(3.62826047875164,3.47980000000107,-2256.28001608937));
#1739=VECTOR('',#2001,1.0);
#1740=CARTESIAN_POINT('',(5.94814763209499,2.89560000000176,-2250.65537850678));
#1741=VECTOR('',#2002,1.0);
#1742=CARTESIAN_POINT('',(5.94814763209481,3.47979999987967,-2250.35057850678));
#1743=DIRECTION('',(-2.96059473233375E-13,1.0,8.05543197322515E-43));
#1744=DIRECTION('',(1.39818712163731E-15,4.1394654271363E-28,1.0));
#1745=CARTESIAN_POINT('',(5.94814763209481,3.47979999987967,-2250.35057850678));
#1746=DIRECTION('',(-2.96059473233375E-13,1.0,8.05543197322515E-43));
#1747=DIRECTION('',(1.39818712163731E-15,4.1394654271363E-28,1.0));
#1748=CARTESIAN_POINT('',(4.86561587736427,3.47979999987935,-2250.97557850678));
#1749=DIRECTION('',(-2.96059473233375E-13,1.0,8.05543197322515E-43));
#1750=DIRECTION('',(1.39818712163731E-15,4.1394654271363E-28,1.0));
#1751=CARTESIAN_POINT('',(4.86561587736427,3.47979999987935,-2250.97557850678));
#1752=DIRECTION('',(-2.96059473233375E-13,1.0,8.05543197322515E-43));
#1753=DIRECTION('',(1.39818712163731E-15,4.1394654271363E-28,1.0));
#1754=CARTESIAN_POINT('',(3.78308412263372,3.47979999987903,-2251.60057850678));
#1755=DIRECTION('',(-2.96059473233375E-13,1.0,8.05543197322515E-43));
#1756=DIRECTION('',(-1.39818712163731E-15,-4.1394654271363E-28,-1.0));
#1757=CARTESIAN_POINT('',(2.70055236790317,3.47979999987871,-2252.22557850678));
#1758=DIRECTION('',(-2.96059473233375E-13,1.0,8.05543197322515E-43));
#1759=DIRECTION('',(-1.39818712163731E-15,-4.1394654271363E-28,-1.0));
#1760=DIRECTION('',(-0.499999999999767,-1.486125308552E-13,0.866025403784573));
#1761=DIRECTION('',(-0.866025403784285,-2.5616365397443E-13,-0.500000000000266));
#1762=DIRECTION('',(0.500000000000129,1.47738339497421E-13,-0.866025403784364));
#1763=DIRECTION('',(0.8660254037846,2.56705226181712E-13,0.499999999999721));
#1764=DIRECTION('',(-0.499999999999618,-1.47738339497395E-13,0.866025403784659));
#1765=DIRECTION('',(-0.866025403784247,-2.56705226181598E-13,-0.500000000000331));
#1766=DIRECTION('',(0.49999999999975,1.48612530855278E-13,-0.866025403784583));
#1767=DIRECTION('',(0.866025403784404,2.56163653974467E-13,0.50000000000006));
#1768=DIRECTION('',(0.866025403784379,2.56705226181623E-13,0.500000000000103));
#1769=DIRECTION('',(-0.500000000000271,-1.48612530855303E-13,0.866025403784282));
#1770=DIRECTION('',(-0.866025403784614,-2.56163653974565E-13,-0.499999999999697));
#1771=DIRECTION('',(0.50000000000017,1.47738339497341E-13,-0.866025403784341));
#1772=DIRECTION('',(0.499999999999361,1.48612530855317E-13,-0.866025403784808));
#1773=DIRECTION('',(0.866025403784438,2.5616365397444E-13,0.500000000000001));
#1774=DIRECTION('',(-0.500000000000138,-1.48612530855316E-13,0.866025403784359));
#1775=DIRECTION('',(-0.866025403784406,-2.56163653974608E-13,-0.500000000000057));
#1776=DIRECTION('',(-0.866025403784314,-2.56705226181538E-13,-0.500000000000215));
#1777=DIRECTION('',(0.500000000000741,1.48612530855334E-13,-0.866025403784011));
#1778=DIRECTION('',(0.866025403784529,2.5616365397464E-13,0.499999999999844));
#1779=DIRECTION('',(-0.499999999999588,-1.47738339497245E-13,0.866025403784677));
#1780=DIRECTION('',(-0.866025403784529,-2.56705226181775E-13,-0.499999999999844));
#1781=DIRECTION('',(0.499999999999776,1.48612530855199E-13,-0.866025403784568));
#1782=DIRECTION('',(0.866025403784452,2.56163653974566E-13,0.499999999999977));
#1783=DIRECTION('',(-0.499999999999937,-1.47738339497364E-13,0.866025403784475));
#1784=CARTESIAN_POINT('',(-1.0302277549575E-12,3.4798,-2243.79808459707));
#1785=DIRECTION('',(-2.96059473233375E-13,1.0,8.67497526682324E-43));
#1786=DIRECTION('',(1.39818712163731E-15,4.1394654271363E-28,1.0));
#1787=CARTESIAN_POINT('',(-1.0302277549575E-12,3.4798,-2243.79808459707));
#1788=DIRECTION('',(-2.96059473233375E-13,1.0,8.67497526682324E-43));
#1789=DIRECTION('',(1.39818712163731E-15,4.1394654271363E-28,1.0));
#1790=CARTESIAN_POINT('',(7.44219999999897,3.4798000000022,-2243.79808459707));
#1791=DIRECTION('',(-2.96059473233375E-13,1.0,9.54499642267409E-43));
#1792=DIRECTION('',(1.39818712163731E-15,4.1394654271363E-28,1.0));
#1793=CARTESIAN_POINT('',(-7.44220000000103,3.4797999999978,-2243.79808459707));
#1794=DIRECTION('',(2.96059473233375E-13,-1.0,-9.54499642267409E-43));
#1795=DIRECTION('',(-1.39818712163731E-15,-4.1394654271363E-28,-1.0));
#1796=CARTESIAN_POINT('',(-7.44220000000103,3.4797999999978,-2243.79808459707));
#1797=DIRECTION('',(2.96059473233375E-13,-1.0,-9.54499642267409E-43));
#1798=DIRECTION('',(-1.39818712163731E-15,-4.1394654271363E-28,-1.0));
#1799=CARTESIAN_POINT('',(-0.062270256034245,3.4798,-2254.03409518984));
#1800=DIRECTION('',(-2.96059473233375E-13,1.0,8.05543197322515E-43));
#1801=DIRECTION('',(1.39818712163731E-15,4.1394654271363E-28,1.0));
#1802=CARTESIAN_POINT('',(-1.0302277549575E-12,3.4798,-2243.79808459707));
#1803=DIRECTION('',(2.96059473233375E-13,-1.0,-8.07881731205636E-43));
#1804=DIRECTION('',(1.39818712163731E-15,4.1394654271363E-28,1.0));
#1805=CARTESIAN_POINT('',(-6.42120264529379,3.4797999999981,-2251.76978121875));
#1806=DIRECTION('',(-2.96059473233375E-13,1.0,8.05543197322515E-43));
#1807=DIRECTION('',(-1.39818712163731E-15,-4.1394654271363E-28,-1.0));
#1808=CARTESIAN_POINT('',(-1.0302277549575E-12,3.4798,-2243.79808459707));
#1809=DIRECTION('',(-2.96059473233375E-13,1.0,7.84339459127392E-43));
#1810=DIRECTION('',(1.39818712163731E-15,4.1394654271363E-28,1.0));
#1811=CARTESIAN_POINT('',(-8.65866199350216,3.47979999999744,-2237.43684209876));
#1812=DIRECTION('',(2.96059473233375E-13,-1.0,-8.05543197322515E-43));
#1813=DIRECTION('',(-1.39818712163731E-15,-4.1394654271363E-28,-1.0));
#1814=DIRECTION('',(0.499999999999905,1.49024047753511E-13,-0.866025403784493));
#1815=DIRECTION('',(0.866025403784446,2.56435436257731E-13,0.499999999999988));
#1816=DIRECTION('',(0.499999999999933,1.48172481766271E-13,-0.866025403784478));
#1817=CARTESIAN_POINT('',(-1.17966660641974,3.47979999999965,-2233.11884209876));
#1818=DIRECTION('',(-2.96059473233375E-13,1.0,8.05543197322515E-43));
#1819=DIRECTION('',(1.39818712163731E-15,4.1394654271363E-28,1.0));
#1820=CARTESIAN_POINT('',(-1.0302277549575E-12,3.4798,-2243.79808459707));
#1821=DIRECTION('',(-2.96059473233375E-13,1.0,7.84339459127392E-43));
#1822=DIRECTION('',(1.39818712163731E-15,4.1394654271363E-28,1.0));
#1823=CARTESIAN_POINT('',(0.0622702560321871,3.4798,-2233.56207400431));
#1824=DIRECTION('',(-2.96059473233375E-13,1.0,8.05543197322515E-43));
#1825=DIRECTION('',(1.39818712163731E-15,4.1394654271363E-28,1.0));
#1826=CARTESIAN_POINT('',(-1.0302277549575E-12,3.4798,-2243.79808459707));
#1827=DIRECTION('',(2.96059473233375E-13,-1.0,-8.07881731205636E-43));
#1828=DIRECTION('',(-1.39818712163731E-15,-4.1394654271363E-28,-1.0));
#1829=CARTESIAN_POINT('',(6.42120264529172,3.4798000000019,-2235.82638797539));
#1830=DIRECTION('',(-2.96059473233375E-13,1.0,8.05543197322515E-43));
#1831=DIRECTION('',(-1.39818712163731E-15,-4.1394654271363E-28,-1.0));
#1832=CARTESIAN_POINT('',(-1.0302277549575E-12,3.4798,-2243.79808459707));
#1833=DIRECTION('',(-2.96059473233375E-13,1.0,7.84339459127392E-43));
#1834=DIRECTION('',(1.39818712163731E-15,4.1394654271363E-28,1.0));
#1835=CARTESIAN_POINT('',(8.65866199350003,3.47980000000256,-2250.15932709538));
#1836=DIRECTION('',(2.96059473233375E-13,-1.0,-8.05543197322515E-43));
#1837=DIRECTION('',(-1.39818712163731E-15,-4.1394654271363E-28,-1.0));
#1838=DIRECTION('',(0.499999999999999,1.48071114151949E-13,-0.866025403784439));
#1839=DIRECTION('',(0.866025403784427,2.56345867471046E-13,0.50000000000002));
#1840=DIRECTION('',(0.5,1.48071114151948E-13,-0.866025403784439));
#1841=CARTESIAN_POINT('',(1.17966660641757,3.47980000000035,-2254.47732709538));
#1842=DIRECTION('',(-2.96059473233375E-13,1.0,8.05543197322515E-43));
#1843=DIRECTION('',(1.39818712163731E-15,4.1394654271363E-28,1.0));
#1844=CARTESIAN_POINT('',(-1.0302277549575E-12,3.4798,-2243.79808459707));
#1845=DIRECTION('',(-2.96059473233375E-13,1.0,7.84339459127392E-43));
#1846=DIRECTION('',(1.39818712163731E-15,4.1394654271363E-28,1.0));
#1847=DIRECTION('',(-2.95039583315741E-13,1.0,0.0));
#1848=DIRECTION('',(0.866025403784404,2.56163653974467E-13,0.50000000000006));
#1849=DIRECTION('',(-2.97225061700839E-13,1.0,0.0));
#1850=DIRECTION('',(-2.95039583315741E-13,1.0,0.0));
#1851=DIRECTION('',(0.49999999999975,1.48612530855278E-13,-0.866025403784583));
#1852=DIRECTION('',(-0.499999999999618,-1.47738339497395E-13,0.866025403784659));
#1853=DIRECTION('',(-0.866025403784247,-2.56705226181598E-13,-0.500000000000331));
#1854=CARTESIAN_POINT('',(-8.57269810694561E-13,2.8956,-2243.79808459707));
#1855=DIRECTION('',(-2.96059473233375E-13,1.0,8.67497526682324E-43));
#1856=DIRECTION('',(1.39818712163731E-15,4.1394654271363E-28,1.0));
#1857=CARTESIAN_POINT('',(-8.57269810694561E-13,2.8956,-2243.79808459707));
#1858=DIRECTION('',(-2.96059473233375E-13,1.0,8.67497526682324E-43));
#1859=DIRECTION('',(1.39818712163731E-15,4.1394654271363E-28,1.0));
#1860=DIRECTION('',(-2.96059473233375E-13,1.0,0.0));
#1861=DIRECTION('',(-0.866025403784529,-2.56705226181775E-13,-0.499999999999844));
#1862=DIRECTION('',(-0.499999999999937,-1.47738339497364E-13,0.866025403784475));
#1863=DIRECTION('',(0.866025403784452,2.56163653974566E-13,0.499999999999977));
#1864=DIRECTION('',(0.499999999999776,1.48612530855199E-13,-0.866025403784568));
#1865=DIRECTION('',(2.96059473233375E-13,-1.0,0.0));
#1866=CARTESIAN_POINT('',(-7.44220000000086,2.8955999999978,-2243.79808459707));
#1867=DIRECTION('',(2.96059473233375E-13,-1.0,-9.54499642267409E-43));
#1868=DIRECTION('',(-1.39818712163731E-15,-4.1394654271363E-28,-1.0));
#1869=CARTESIAN_POINT('',(-7.44220000000086,2.8955999999978,-2243.79808459707));
#1870=DIRECTION('',(2.96059473233375E-13,-1.0,-9.54499642267409E-43));
#1871=DIRECTION('',(-1.39818712163731E-15,-4.1394654271363E-28,-1.0));
#1872=DIRECTION('',(-2.97225061710672E-13,1.0,0.0));
#1873=DIRECTION('',(0.50000000000017,1.48612530855313E-13,-0.866025403784341));
#1874=DIRECTION('',(-2.97225061700839E-13,1.0,0.0));
#1875=CARTESIAN_POINT('',(-1.17966660641956,2.89559999999965,-2233.11884209876));
#1876=DIRECTION('',(-2.96059473233375E-13,1.0,8.05543197322515E-43));
#1877=DIRECTION('',(1.39818712163731E-15,4.1394654271363E-28,1.0));
#1878=DIRECTION('',(2.96227343312986E-13,-1.0,0.0));
#1879=DIRECTION('',(2.95989791313537E-13,-1.0,0.0));
#1880=DIRECTION('',(-0.499999999999767,-1.47738339497228E-13,0.866025403784573));
#1881=DIRECTION('',(0.8660254037846,2.56163653974578E-13,0.499999999999721));
#1882=DIRECTION('',(0.500000000000129,1.48612530855394E-13,-0.866025403784364));
#1883=DIRECTION('',(-0.866025403784285,-2.56705226181564E-13,-0.500000000000266));
#1884=DIRECTION('',(-2.97225061710672E-13,1.0,0.0));
#1885=DIRECTION('',(-0.500000000000138,-1.47738339497344E-13,0.866025403784359));
#1886=DIRECTION('',(-2.9503958331574E-13,1.0,0.0));
#1887=DIRECTION('',(0.866025403784379,2.56163653974489E-13,0.500000000000103));
#1888=DIRECTION('',(-0.866025403784614,-2.56163653974565E-13,-0.499999999999697));
#1889=DIRECTION('',(-0.500000000000269,-1.48612530855303E-13,0.866025403784283));
#1890=DIRECTION('',(-2.94564479316842E-13,1.0,0.0));
#1891=CARTESIAN_POINT('',(-8.57269810694561E-13,2.8956,-2243.79808459707));
#1892=DIRECTION('',(-2.96059473233375E-13,1.0,7.84339459127392E-43));
#1893=DIRECTION('',(1.39818712163731E-15,4.1394654271363E-28,1.0));
#1894=DIRECTION('',(2.96464895312435E-13,-1.0,0.0));
#1895=DIRECTION('',(-2.95039583315741E-13,1.0,0.0));
#1896=DIRECTION('',(-0.499999999999588,-1.47738339497245E-13,0.866025403784677));
#1897=DIRECTION('',(-2.96132322503409E-13,1.0,0.0));
#1898=DIRECTION('',(-2.95989791313537E-13,1.0,0.0));
#1899=CARTESIAN_POINT('',(-0.062270256034072,2.8956,-2254.03409518984));
#1900=DIRECTION('',(-2.96059473233375E-13,1.0,8.05543197322515E-43));
#1901=DIRECTION('',(1.39818712163731E-15,4.1394654271363E-28,1.0));
#1902=DIRECTION('',(-2.96064026313365E-13,1.0,0.0));
#1903=DIRECTION('',(-2.96132322513206E-13,1.0,0.0));
#1904=DIRECTION('',(-2.95039583315741E-13,1.0,0.0));
#1905=DIRECTION('',(-2.96132322513206E-13,1.0,0.0));
#1906=DIRECTION('',(0.866025403784529,2.5616365397464E-13,0.499999999999844));
#1907=DIRECTION('',(-2.96132322513206E-13,1.0,0.0));
#1908=DIRECTION('',(0.50000000000074,1.48612530855334E-13,-0.866025403784011));
#1909=DIRECTION('',(-2.94564479316842E-13,1.0,0.0));
#1910=CARTESIAN_POINT('',(-8.57269810694561E-13,2.8956,-2243.79808459707));
#1911=DIRECTION('',(-2.96059473233375E-13,1.0,7.84339459127392E-43));
#1912=DIRECTION('',(1.39818712163731E-15,4.1394654271363E-28,1.0));
#1913=DIRECTION('',(2.96464895312435E-13,-1.0,0.0));
#1914=DIRECTION('',(-2.97225061710671E-13,1.0,0.0));
#1915=DIRECTION('',(-2.95039583315741E-13,1.0,0.0));
#1916=DIRECTION('',(2.96059473233375E-13,-1.0,0.0));
#1917=CARTESIAN_POINT('',(7.44219999999914,2.8956000000022,-2243.79808459707));
#1918=DIRECTION('',(-2.96059473233375E-13,1.0,9.54499642267409E-43));
#1919=DIRECTION('',(1.39818712163731E-15,4.1394654271363E-28,1.0));
#1920=CARTESIAN_POINT('',(-8.57269810694561E-13,2.8956,-2243.79808459707));
#1921=DIRECTION('',(2.96059473233375E-13,-1.0,-8.07881731205636E-43));
#1922=DIRECTION('',(1.39818712163731E-15,4.1394654271363E-28,1.0));
#1923=DIRECTION('',(-2.96464895312435E-13,1.0,0.0));
#1924=CARTESIAN_POINT('',(4.86561587736444,2.89560000000144,-2250.97557850678));
#1925=DIRECTION('',(-2.96059473233375E-13,1.0,8.05543197322515E-43));
#1926=DIRECTION('',(1.39818712163731E-15,4.1394654271363E-28,1.0));
#1927=CARTESIAN_POINT('',(4.86561587736444,2.89560000000144,-2250.97557850678));
#1928=DIRECTION('',(-2.96059473233375E-13,1.0,8.05543197322515E-43));
#1929=DIRECTION('',(1.39818712163731E-15,4.1394654271363E-28,1.0));
#1930=DIRECTION('',(-2.96059473233375E-13,1.0,0.0));
#1931=DIRECTION('',(-2.95039583315741E-13,1.0,0.0));
#1932=DIRECTION('',(0.866025403784438,2.5616365397444E-13,0.500000000000001));
#1933=CARTESIAN_POINT('',(-8.57269810694561E-13,2.8956,-2243.79808459707));
#1934=DIRECTION('',(-2.96059473233375E-13,1.0,7.84339459127392E-43));
#1935=DIRECTION('',(1.39818712163731E-15,4.1394654271363E-28,1.0));
#1936=DIRECTION('',(-2.95989791313537E-13,1.0,0.0));
#1937=DIRECTION('',(0.499999999999932,1.48172481766271E-13,-0.866025403784478));
#1938=DIRECTION('',(2.95514687314639E-13,-1.0,0.0));
#1939=DIRECTION('',(0.866025403784446,2.56435436257731E-13,0.499999999999988));
#1940=DIRECTION('',(2.96464895312435E-13,-1.0,0.0));
#1941=DIRECTION('',(-0.866025403784406,-2.56163653974608E-13,-0.500000000000057));
#1942=DIRECTION('',(-2.9503958330598E-13,1.0,0.0));
#1943=DIRECTION('',(0.499999999999361,1.48612530855317E-13,-0.866025403784808));
#1944=CARTESIAN_POINT('',(-8.57269810694561E-13,2.8956,-2243.79808459707));
#1945=DIRECTION('',(-2.96059473233375E-13,1.0,7.84339459127392E-43));
#1946=DIRECTION('',(1.39818712163731E-15,4.1394654271363E-28,1.0));
#1947=DIRECTION('',(2.96227343312986E-13,-1.0,0.0));
#1948=DIRECTION('',(-0.866025403784314,-2.56705226181539E-13,-0.500000000000215));
#1949=DIRECTION('',(-2.97225061710672E-13,1.0,0.0));
#1950=DIRECTION('',(-2.97225061710672E-13,1.0,0.0));
#1951=DIRECTION('',(0.499999999999905,1.48172481766348E-13,-0.866025403784493));
#1952=DIRECTION('',(2.96464895312435E-13,-1.0,0.0));
#1953=DIRECTION('',(-2.95039583315741E-13,1.0,0.0));
#1954=DIRECTION('',(-2.97225061710671E-13,1.0,0.0));
#1955=DIRECTION('',(-2.97225061700839E-13,1.0,0.0));
#1956=DIRECTION('',(-2.97225061710672E-13,1.0,0.0));
#1957=CARTESIAN_POINT('',(0.0622702560323601,2.8956,-2233.56207400431));
#1958=DIRECTION('',(-2.96059473233375E-13,1.0,8.05543197322515E-43));
#1959=DIRECTION('',(1.39818712163731E-15,4.1394654271363E-28,1.0));
#1960=DIRECTION('',(-2.96064026313365E-13,1.0,0.0));
#1961=DIRECTION('',(0.499999999999999,1.48071114151949E-13,-0.866025403784439));
#1962=DIRECTION('',(2.98365311308027E-13,-1.0,0.0));
#1963=DIRECTION('',(2.94564479316842E-13,-1.0,0.0));
#1964=DIRECTION('',(-2.9503958330598E-13,1.0,0.0));
#1965=CARTESIAN_POINT('',(5.94814763209499,2.89560000000176,-2250.35057850678));
#1966=DIRECTION('',(-2.96059473233375E-13,1.0,8.05543197322515E-43));
#1967=DIRECTION('',(1.39818712163731E-15,4.1394654271363E-28,1.0));
#1968=CARTESIAN_POINT('',(5.94814763209499,2.89560000000176,-2250.35057850678));
#1969=DIRECTION('',(-2.96059473233375E-13,1.0,8.05543197322515E-43));
#1970=DIRECTION('',(1.39818712163731E-15,4.1394654271363E-28,1.0));
#1971=CARTESIAN_POINT('',(3.78308412263389,2.89560000000112,-2251.60057850678));
#1972=DIRECTION('',(-2.96059473233375E-13,1.0,8.05543197322515E-43));
#1973=DIRECTION('',(-1.39818712163731E-15,-4.1394654271363E-28,-1.0));
#1974=CARTESIAN_POINT('',(2.70055236790335,2.8956000000008,-2252.22557850678));
#1975=DIRECTION('',(-2.96059473233375E-13,1.0,8.05543197322515E-43));
#1976=DIRECTION('',(-1.39818712163731E-15,-4.1394654271363E-28,-1.0));
#1977=CARTESIAN_POINT('',(1.17966660641775,2.89560000000035,-2254.47732709538));
#1978=DIRECTION('',(-2.96059473233375E-13,1.0,8.05543197322515E-43));
#1979=DIRECTION('',(1.39818712163731E-15,4.1394654271363E-28,1.0));
#1980=DIRECTION('',(0.5,1.48071114151948E-13,-0.866025403784439));
#1981=DIRECTION('',(0.866025403784427,2.56435436257723E-13,0.50000000000002));
#1982=CARTESIAN_POINT('',(8.65866199350021,2.89560000000256,-2250.15932709538));
#1983=DIRECTION('',(2.96059473233375E-13,-1.0,-8.05543197322515E-43));
#1984=DIRECTION('',(-1.39818712163731E-15,-4.1394654271363E-28,-1.0));
#1985=CARTESIAN_POINT('',(6.4212026452919,2.8956000000019,-2235.82638797539));
#1986=DIRECTION('',(-2.96059473233375E-13,1.0,8.05543197322515E-43));
#1987=DIRECTION('',(-1.39818712163731E-15,-4.1394654271363E-28,-1.0));
#1988=CARTESIAN_POINT('',(-8.57269810694561E-13,2.8956,-2243.79808459707));
#1989=DIRECTION('',(2.96059473233375E-13,-1.0,-8.07881731205636E-43));
#1990=DIRECTION('',(-1.39818712163731E-15,-4.1394654271363E-28,-1.0));
#1991=CARTESIAN_POINT('',(-8.65866199350198,2.89559999999744,-2237.43684209876));
#1992=DIRECTION('',(2.96059473233375E-13,-1.0,-8.05543197322515E-43));
#1993=DIRECTION('',(-1.39818712163731E-15,-4.1394654271363E-28,-1.0));
#1994=CARTESIAN_POINT('',(-6.42120264529361,2.8955999999981,-2251.76978121875));
#1995=DIRECTION('',(-2.96059473233375E-13,1.0,8.05543197322515E-43));
#1996=DIRECTION('',(-1.39818712163731E-15,-4.1394654271363E-28,-1.0));
#1997=DIRECTION('',(-2.96059473233375E-13,1.0,0.0));
#1998=DIRECTION('',(-2.96059473233375E-13,1.0,0.0));
#1999=DIRECTION('',(-2.96464895312435E-13,1.0,0.0));
#2000=DIRECTION('',(2.96464895312435E-13,-1.0,0.0));
#2001=DIRECTION('',(2.96464895312435E-13,-1.0,0.0));
#2002=DIRECTION('',(-2.96059473233375E-13,1.0,0.0));
ENDSEC;
END-ISO-10303-21;
