ISO-10303-21;
HEADER;
FILE_DESCRIPTION(('STEP AP203'),'1');
FILE_NAME('mpar.stp','2022-08-30T19:25:41',(' '),(' '),'Spatial InterOp 3D',' ',' ');
FILE_SCHEMA(('CONFIG_CONTROL_DESIGN'));
ENDSEC;
DATA;
#1=DESIGN_CONTEXT('',#33,'design');
#2=APPLICATION_PROTOCOL_DEFINITION('INTERNATIONAL STANDARD','config_control_design',1994,#33);
#3=PRODUCT_CATEGORY_RELATIONSHIP('NONE','NONE',#34,#35);
#4=DATE_AND_TIME(#36,#37);
#5=DATE_TIME_ROLE('creation_date');
#6=DATE_TIME_ROLE('classification_date');
#7=PERSON_AND_ORGANIZATION_ROLE('creator');
#8=PERSON_AND_ORGANIZATION_ROLE('design_supplier');
#9=PERSON_AND_ORGANIZATION_ROLE('classification_officer');
#10=PERSON_AND_ORGANIZATION_ROLE('design_owner');
#11=APPROVAL_PERSON_ORGANIZATION(#38,#39,#40);
#12=APPROVAL_DATE_TIME(#4,#39);
#13=CC_DESIGN_APPROVAL(#39,(#41,#42,#43));
#14=CC_DESIGN_DATE_AND_TIME_ASSIGNMENT(#4,#5,(#43));
#15=CC_DESIGN_DATE_AND_TIME_ASSIGNMENT(#4,#6,(#41));
#16=CC_DESIGN_PERSON_AND_ORGANIZATION_ASSIGNMENT(#38,#10,(#44));
#17=CC_DESIGN_PERSON_AND_ORGANIZATION_ASSIGNMENT(#38,#7,(#43));
#18=CC_DESIGN_PERSON_AND_ORGANIZATION_ASSIGNMENT(#38,#7,(#42));
#19=CC_DESIGN_PERSON_AND_ORGANIZATION_ASSIGNMENT(#38,#8,(#42));
#20=CC_DESIGN_SECURITY_CLASSIFICATION(#41,(#42));
#21=CC_DESIGN_PERSON_AND_ORGANIZATION_ASSIGNMENT(#38,#9,(#41));
#22=SHAPE_DEFINITION_REPRESENTATION(#45,#46);
#23= (GEOMETRIC_REPRESENTATION_CONTEXT(3)GLOBAL_UNCERTAINTY_ASSIGNED_CONTEXT((#49))GLOBAL_UNIT_ASSIGNED_CONTEXT((#51,#52,#53))REPRESENTATION_CONTEXT('NONE','WORKSPACE'));
#24=PROPERTY_DEFINITION_REPRESENTATION(#55,#56);
#25=GENERAL_PROPERTY_ASSOCIATION('','',#57,#55);
#26=PROPERTY_DEFINITION_REPRESENTATION(#58,#59);
#27=GENERAL_PROPERTY_ASSOCIATION('','',#60,#58);
#28=PROPERTY_DEFINITION_REPRESENTATION(#61,#62);
#29=GENERAL_PROPERTY_ASSOCIATION('','',#63,#61);
#33=APPLICATION_CONTEXT('CONFIGURATION CONTROLLED 3D DESIGNS OF MECHANICAL PARTS AND ASSEMBLIES');
#34=PRODUCT_CATEGORY('part','NONE');
#35=PRODUCT_RELATED_PRODUCT_CATEGORY('detail',' ',(#44));
#36=CALENDAR_DATE(2022,30,7);
#37=LOCAL_TIME(16,25,41.0,#64);
#38=PERSON_AND_ORGANIZATION(#65,#66);
#39=APPROVAL(#67,'SOLID MODEL');
#40=APPROVAL_ROLE('APPROVED');
#41=SECURITY_CLASSIFICATION('','',#68);
#42=PRODUCT_DEFINITION_FORMATION_WITH_SPECIFIED_SOURCE('A','NONE',#44,.NOT_KNOWN.);
#43=PRODUCT_DEFINITION('','NONE',#42,#1);
#44=PRODUCT(' Eixo \X2\00CD\X0\mpar','','S\X\F3lido1',(#69));
#45=PRODUCT_DEFINITION_SHAPE('NONE','NONE',#43);
#46=ADVANCED_BREP_SHAPE_REPRESENTATION('1',(#70,#71),#23);
#49=UNCERTAINTY_MEASURE_WITH_UNIT(LENGTH_MEASURE(0.001),#51,'','');
#51= (CONVERSION_BASED_UNIT('MILLIMETRE',#74)LENGTH_UNIT()NAMED_UNIT(#77));
#52= (NAMED_UNIT(#79)PLANE_ANGLE_UNIT()SI_UNIT($,.RADIAN.));
#53= (NAMED_UNIT(#79)SOLID_ANGLE_UNIT()SI_UNIT($,.STERADIAN.));
#55=PROPERTY_DEFINITION('PdmObjectId','',#43);
#56=REPRESENTATION('',(#85),#23);
#57=GENERAL_PROPERTY('','19_2d33aa80-3400-4df2-88c1-bd50ab977ea6&2_30_0_3','');
#58=PROPERTY_DEFINITION('CreationDate','',#43);
#59=REPRESENTATION('',(#86),#23);
#60=GENERAL_PROPERTY('','20/09/2021 22:13:03','');
#61=PROPERTY_DEFINITION('Minor Revision','',#43);
#62=REPRESENTATION('',(#87),#23);
#63=GENERAL_PROPERTY('','1','');
#64=COORDINATED_UNIVERSAL_TIME_OFFSET(3,0,.BEHIND.);
#65=PERSON('','UNSPECIFIED',$,$,$,$);
#66=ORGANIZATION('UNSPECIFIED','UNSPECIFIED','UNSPECIFIED');
#67=APPROVAL_STATUS('approved');
#68=SECURITY_CLASSIFICATION_LEVEL('unclassified');
#69=MECHANICAL_CONTEXT('',#33,'mechanical');
#70=MANIFOLD_SOLID_BREP('1',#88);
#71=AXIS2_PLACEMENT_3D('',#89,#90,#91);
#74=LENGTH_MEASURE_WITH_UNIT(LENGTH_MEASURE(1.0),#92);
#77=DIMENSIONAL_EXPONENTS(1.0,0.0,0.0,0.0,0.0,0.0,0.0);
#79=DIMENSIONAL_EXPONENTS(0.0,0.0,0.0,0.0,0.0,0.0,0.0);
#85=VALUE_REPRESENTATION_ITEM('19_2d33aa80-3400-4df2-88c1-bd50ab977ea6&2_30_0_3',);
#86=VALUE_REPRESENTATION_ITEM('20/09/2021 22:13:03',);
#87=VALUE_REPRESENTATION_ITEM('1',);
#88=CLOSED_SHELL('',(#93,#94,#95,#96,#97,#98,#99,#100,#101,#102,#103,#104,#105,#106,#107,#108,#109,#110));
#89=CARTESIAN_POINT('',(0.0,0.0,0.0));
#90=DIRECTION('',(0.0,0.0,1.0));
#91=DIRECTION('',(1.0,0.0,0.0));
#92= (NAMED_UNIT(#77)LENGTH_UNIT()SI_UNIT(.MILLI.,.METRE.));
#93=ADVANCED_FACE('',(#112,#113),#114,.T.);
#94=ADVANCED_FACE('',(#115),#116,.T.);
#95=ADVANCED_FACE('',(#117),#118,.T.);
#96=ADVANCED_FACE('',(#119,#120,#121,#122,#123),#124,.F.);
#97=ADVANCED_FACE('',(#125,#126,#127,#128,#129),#130,.T.);
#98=ADVANCED_FACE('',(#131),#132,.T.);
#99=ADVANCED_FACE('',(#133,#134),#135,.T.);
#100=ADVANCED_FACE('',(#136),#137,.F.);
#101=ADVANCED_FACE('',(#138),#139,.F.);
#102=ADVANCED_FACE('',(#140),#141,.F.);
#103=ADVANCED_FACE('',(#142),#143,.F.);
#104=ADVANCED_FACE('',(#144),#145,.F.);
#105=ADVANCED_FACE('',(#146),#147,.F.);
#106=ADVANCED_FACE('',(#148),#149,.F.);
#107=ADVANCED_FACE('',(#150),#151,.T.);
#108=ADVANCED_FACE('',(#152),#153,.F.);
#109=ADVANCED_FACE('',(#154),#155,.F.);
#110=ADVANCED_FACE('',(#156),#157,.T.);
#112=FACE_BOUND('',#158,.T.);
#113=FACE_OUTER_BOUND('',#159,.T.);
#114=PLANE('',#160);
#115=FACE_OUTER_BOUND('',#161,.T.);
#116=CYLINDRICAL_SURFACE('',#162,2.5);
#117=FACE_OUTER_BOUND('',#163,.T.);
#118=CYLINDRICAL_SURFACE('',#164,3.5);
#119=FACE_BOUND('',#165,.T.);
#120=FACE_BOUND('',#166,.T.);
#121=FACE_BOUND('',#167,.T.);
#122=FACE_BOUND('',#168,.T.);
#123=FACE_OUTER_BOUND('',#169,.T.);
#124=PLANE('',#170);
#125=FACE_BOUND('',#171,.T.);
#126=FACE_BOUND('',#172,.T.);
#127=FACE_BOUND('',#173,.T.);
#128=FACE_BOUND('',#174,.T.);
#129=FACE_OUTER_BOUND('',#175,.T.);
#130=PLANE('',#176);
#131=FACE_OUTER_BOUND('',#177,.T.);
#132=PLANE('',#178);
#133=FACE_BOUND('',#179,.T.);
#134=FACE_OUTER_BOUND('',#180,.T.);
#135=PLANE('',#181);
#136=FACE_OUTER_BOUND('',#182,.T.);
#137=CYLINDRICAL_SURFACE('',#183,1.2295);
#138=FACE_OUTER_BOUND('',#184,.T.);
#139=CONICAL_SURFACE('',#185,2.25,0.785398163397448);
#140=FACE_OUTER_BOUND('',#186,.T.);
#141=CYLINDRICAL_SURFACE('',#187,1.5);
#142=FACE_OUTER_BOUND('',#188,.T.);
#143=CONICAL_SURFACE('',#189,2.25,0.785398163397448);
#144=FACE_OUTER_BOUND('',#190,.T.);
#145=CONICAL_SURFACE('',#191,2.25,0.785398163397448);
#146=FACE_OUTER_BOUND('',#192,.T.);
#147=CYLINDRICAL_SURFACE('',#193,1.5);
#148=FACE_OUTER_BOUND('',#194,.T.);
#149=CYLINDRICAL_SURFACE('',#195,6.0);
#150=FACE_OUTER_BOUND('',#196,.T.);
#151=CYLINDRICAL_SURFACE('',#197,10.5);
#152=FACE_OUTER_BOUND('',#198,.T.);
#153=CONICAL_SURFACE('',#199,0.61475,1.02974425867665);
#154=FACE_OUTER_BOUND('',#200,.T.);
#155=CYLINDRICAL_SURFACE('',#201,1.5);
#156=FACE_OUTER_BOUND('',#202,.T.);
#157=CYLINDRICAL_SURFACE('',#203,2.5);
#158=EDGE_LOOP('',(#204,#205));
#159=EDGE_LOOP('',(#206,#207));
#160=AXIS2_PLACEMENT_3D('',#208,#209,#210);
#161=EDGE_LOOP('',(#211,#212,#213,#214,#215,#216));
#162=AXIS2_PLACEMENT_3D('',#217,#218,#219);
#163=EDGE_LOOP('',(#220,#221,#222,#223,#224,#225));
#164=AXIS2_PLACEMENT_3D('',#226,#227,#228);
#165=EDGE_LOOP('',(#229,#230));
#166=EDGE_LOOP('',(#231,#232));
#167=EDGE_LOOP('',(#233,#234));
#168=EDGE_LOOP('',(#235,#236));
#169=EDGE_LOOP('',(#237,#238));
#170=AXIS2_PLACEMENT_3D('',#239,#240,#241);
#171=EDGE_LOOP('',(#242));
#172=EDGE_LOOP('',(#243));
#173=EDGE_LOOP('',(#244));
#174=EDGE_LOOP('',(#245,#246));
#175=EDGE_LOOP('',(#247,#248));
#176=AXIS2_PLACEMENT_3D('',#249,#250,#251);
#177=EDGE_LOOP('',(#252,#253));
#178=AXIS2_PLACEMENT_3D('',#254,#255,#256);
#179=EDGE_LOOP('',(#257,#258));
#180=EDGE_LOOP('',(#259,#260));
#181=AXIS2_PLACEMENT_3D('',#261,#262,#263);
#182=EDGE_LOOP('',(#264,#265,#266,#267,#268,#269));
#183=AXIS2_PLACEMENT_3D('',#270,#271,#272);
#184=EDGE_LOOP('',(#273,#274,#275,#276,#277,#278));
#185=AXIS2_PLACEMENT_3D('',#279,#280,#281);
#186=EDGE_LOOP('',(#282,#283,#284,#285,#286));
#187=AXIS2_PLACEMENT_3D('',#287,#288,#289);
#188=EDGE_LOOP('',(#290,#291,#292,#293,#294,#295));
#189=AXIS2_PLACEMENT_3D('',#296,#297,#298);
#190=EDGE_LOOP('',(#299,#300,#301,#302,#303,#304));
#191=AXIS2_PLACEMENT_3D('',#305,#306,#307);
#192=EDGE_LOOP('',(#308,#309,#310,#311,#312));
#193=AXIS2_PLACEMENT_3D('',#313,#314,#315);
#194=EDGE_LOOP('',(#316,#317,#318,#319));
#195=AXIS2_PLACEMENT_3D('',#320,#321,#322);
#196=EDGE_LOOP('',(#323,#324,#325,#326));
#197=AXIS2_PLACEMENT_3D('',#327,#328,#329);
#198=EDGE_LOOP('',(#330,#331,#332,#333));
#199=AXIS2_PLACEMENT_3D('',#334,#335,#336);
#200=EDGE_LOOP('',(#337,#338,#339,#340,#341));
#201=AXIS2_PLACEMENT_3D('',#342,#343,#344);
#202=EDGE_LOOP('',(#345,#346,#347,#348,#349,#350));
#203=AXIS2_PLACEMENT_3D('',#351,#352,#353);
#204=ORIENTED_EDGE('',*,*,#354,.T.);
#205=ORIENTED_EDGE('',*,*,#355,.T.);
#206=ORIENTED_EDGE('',*,*,#356,.T.);
#207=ORIENTED_EDGE('',*,*,#357,.T.);
#208=CARTESIAN_POINT('',(0.0,0.0,-16.0));
#209=DIRECTION('',(0.0,0.0,-1.0));
#210=DIRECTION('',(0.0,-1.0,0.0));
#211=ORIENTED_EDGE('',*,*,#356,.F.);
#212=ORIENTED_EDGE('',*,*,#357,.F.);
#213=ORIENTED_EDGE('',*,*,#358,.T.);
#214=ORIENTED_EDGE('',*,*,#359,.F.);
#215=ORIENTED_EDGE('',*,*,#360,.F.);
#216=ORIENTED_EDGE('',*,*,#358,.F.);
#217=CARTESIAN_POINT('',(0.0,0.0,-6.0));
#218=DIRECTION('',(0.0,0.0,-1.0));
#219=DIRECTION('',(-1.0,0.0,0.0));
#220=ORIENTED_EDGE('',*,*,#361,.F.);
#221=ORIENTED_EDGE('',*,*,#362,.F.);
#222=ORIENTED_EDGE('',*,*,#363,.T.);
#223=ORIENTED_EDGE('',*,*,#364,.F.);
#224=ORIENTED_EDGE('',*,*,#365,.F.);
#225=ORIENTED_EDGE('',*,*,#363,.F.);
#226=CARTESIAN_POINT('',(0.0,0.0,0.0));
#227=DIRECTION('',(0.0,0.0,-1.0));
#228=DIRECTION('',(-1.0,0.0,0.0));
#229=ORIENTED_EDGE('',*,*,#364,.T.);
#230=ORIENTED_EDGE('',*,*,#365,.T.);
#231=ORIENTED_EDGE('',*,*,#366,.T.);
#232=ORIENTED_EDGE('',*,*,#367,.T.);
#233=ORIENTED_EDGE('',*,*,#368,.T.);
#234=ORIENTED_EDGE('',*,*,#369,.T.);
#235=ORIENTED_EDGE('',*,*,#370,.T.);
#236=ORIENTED_EDGE('',*,*,#371,.T.);
#237=ORIENTED_EDGE('',*,*,#372,.F.);
#238=ORIENTED_EDGE('',*,*,#373,.F.);
#239=CARTESIAN_POINT('',(0.0,0.0,0.0));
#240=DIRECTION('',(0.0,0.0,1.0));
#241=DIRECTION('',(1.0,0.0,0.0));
#242=ORIENTED_EDGE('',*,*,#374,.T.);
#243=ORIENTED_EDGE('',*,*,#375,.T.);
#244=ORIENTED_EDGE('',*,*,#376,.T.);
#245=ORIENTED_EDGE('',*,*,#377,.T.);
#246=ORIENTED_EDGE('',*,*,#378,.T.);
#247=ORIENTED_EDGE('',*,*,#379,.T.);
#248=ORIENTED_EDGE('',*,*,#380,.T.);
#249=CARTESIAN_POINT('',(0.0,0.0,3.0));
#250=DIRECTION('',(0.0,0.0,1.0));
#251=DIRECTION('',(1.0,0.0,0.0));
#252=ORIENTED_EDGE('',*,*,#381,.T.);
#253=ORIENTED_EDGE('',*,*,#382,.T.);
#254=CARTESIAN_POINT('',(0.0,0.0,5.0));
#255=DIRECTION('',(0.0,0.0,1.0));
#256=DIRECTION('',(1.0,0.0,0.0));
#257=ORIENTED_EDGE('',*,*,#359,.T.);
#258=ORIENTED_EDGE('',*,*,#360,.T.);
#259=ORIENTED_EDGE('',*,*,#361,.T.);
#260=ORIENTED_EDGE('',*,*,#362,.T.);
#261=CARTESIAN_POINT('',(0.0,0.0,-6.0));
#262=DIRECTION('',(0.0,0.0,-1.0));
#263=DIRECTION('',(0.0,-1.0,0.0));
#264=ORIENTED_EDGE('',*,*,#354,.F.);
#265=ORIENTED_EDGE('',*,*,#355,.F.);
#266=ORIENTED_EDGE('',*,*,#383,.T.);
#267=ORIENTED_EDGE('',*,*,#384,.F.);
#268=ORIENTED_EDGE('',*,*,#385,.F.);
#269=ORIENTED_EDGE('',*,*,#383,.F.);
#270=CARTESIAN_POINT('',(0.0,0.0,-12.0));
#271=DIRECTION('',(0.0,0.0,-1.0));
#272=DIRECTION('',(-1.0,0.0,0.0));
#273=ORIENTED_EDGE('',*,*,#366,.F.);
#274=ORIENTED_EDGE('',*,*,#367,.F.);
#275=ORIENTED_EDGE('',*,*,#386,.T.);
#276=ORIENTED_EDGE('',*,*,#387,.F.);
#277=ORIENTED_EDGE('',*,*,#388,.F.);
#278=ORIENTED_EDGE('',*,*,#386,.F.);
#279=CARTESIAN_POINT('',(3.0,-6.0,0.75));
#280=DIRECTION('',(-0.0,0.0,-1.0));
#281=DIRECTION('',(-1.0,0.0,0.0));
#282=ORIENTED_EDGE('',*,*,#389,.T.);
#283=ORIENTED_EDGE('',*,*,#390,.T.);
#284=ORIENTED_EDGE('',*,*,#376,.F.);
#285=ORIENTED_EDGE('',*,*,#390,.F.);
#286=ORIENTED_EDGE('',*,*,#391,.T.);
#287=CARTESIAN_POINT('',(-6.0,-3.0,35.2562051276084));
#288=DIRECTION('',(0.0,0.0,-1.0));
#289=DIRECTION('',(-1.0,0.0,0.0));
#290=ORIENTED_EDGE('',*,*,#370,.F.);
#291=ORIENTED_EDGE('',*,*,#371,.F.);
#292=ORIENTED_EDGE('',*,*,#392,.T.);
#293=ORIENTED_EDGE('',*,*,#389,.F.);
#294=ORIENTED_EDGE('',*,*,#391,.F.);
#295=ORIENTED_EDGE('',*,*,#392,.F.);
#296=CARTESIAN_POINT('',(-6.0,-3.0,0.75));
#297=DIRECTION('',(-0.0,0.0,-1.0));
#298=DIRECTION('',(-1.0,0.0,0.0));
#299=ORIENTED_EDGE('',*,*,#368,.F.);
#300=ORIENTED_EDGE('',*,*,#369,.F.);
#301=ORIENTED_EDGE('',*,*,#393,.T.);
#302=ORIENTED_EDGE('',*,*,#394,.F.);
#303=ORIENTED_EDGE('',*,*,#395,.F.);
#304=ORIENTED_EDGE('',*,*,#393,.F.);
#305=CARTESIAN_POINT('',(-3.0,6.0,0.75));
#306=DIRECTION('',(-0.0,0.0,-1.0));
#307=DIRECTION('',(-1.0,0.0,0.0));
#308=ORIENTED_EDGE('',*,*,#394,.T.);
#309=ORIENTED_EDGE('',*,*,#396,.T.);
#310=ORIENTED_EDGE('',*,*,#375,.F.);
#311=ORIENTED_EDGE('',*,*,#396,.F.);
#312=ORIENTED_EDGE('',*,*,#395,.T.);
#313=CARTESIAN_POINT('',(-3.0,6.0,35.2562051276084));
#314=DIRECTION('',(0.0,0.0,-1.0));
#315=DIRECTION('',(-1.0,0.0,0.0));
#316=ORIENTED_EDGE('',*,*,#372,.T.);
#317=ORIENTED_EDGE('',*,*,#397,.T.);
#318=ORIENTED_EDGE('',*,*,#379,.F.);
#319=ORIENTED_EDGE('',*,*,#398,.F.);
#320=CARTESIAN_POINT('',(8.0,6.0,0.0));
#321=DIRECTION('',(0.0,0.0,1.0));
#322=DIRECTION('',(0.757690077035229,-0.652614547158082,0.0));
#323=ORIENTED_EDGE('',*,*,#373,.T.);
#324=ORIENTED_EDGE('',*,*,#398,.T.);
#325=ORIENTED_EDGE('',*,*,#380,.F.);
#326=ORIENTED_EDGE('',*,*,#397,.F.);
#327=CARTESIAN_POINT('',(0.0,0.0,0.0));
#328=DIRECTION('',(0.0,0.0,1.0));
#329=DIRECTION('',(-0.8,-0.6,0.0));
#330=ORIENTED_EDGE('',*,*,#384,.T.);
#331=ORIENTED_EDGE('',*,*,#399,.T.);
#332=ORIENTED_EDGE('',*,*,#399,.F.);
#333=ORIENTED_EDGE('',*,*,#385,.T.);
#334=CARTESIAN_POINT('',(0.0,0.0,-7.63062093445281));
#335=DIRECTION('',(-0.0,0.0,-1.0));
#336=DIRECTION('',(-1.0,0.0,0.0));
#337=ORIENTED_EDGE('',*,*,#387,.T.);
#338=ORIENTED_EDGE('',*,*,#400,.T.);
#339=ORIENTED_EDGE('',*,*,#374,.F.);
#340=ORIENTED_EDGE('',*,*,#400,.F.);
#341=ORIENTED_EDGE('',*,*,#388,.T.);
#342=CARTESIAN_POINT('',(3.0,-6.0,35.2562051276084));
#343=DIRECTION('',(0.0,0.0,-1.0));
#344=DIRECTION('',(-1.0,0.0,0.0));
#345=ORIENTED_EDGE('',*,*,#381,.F.);
#346=ORIENTED_EDGE('',*,*,#382,.F.);
#347=ORIENTED_EDGE('',*,*,#401,.T.);
#348=ORIENTED_EDGE('',*,*,#377,.F.);
#349=ORIENTED_EDGE('',*,*,#378,.F.);
#350=ORIENTED_EDGE('',*,*,#401,.F.);
#351=CARTESIAN_POINT('',(0.0,0.0,3.0));
#352=DIRECTION('',(0.0,0.0,1.0));
#353=DIRECTION('',(1.0,0.0,0.0));
#354=EDGE_CURVE('',#402,#403,#404,.T.);
#355=EDGE_CURVE('',#403,#402,#405,.T.);
#356=EDGE_CURVE('',#406,#407,#408,.T.);
#357=EDGE_CURVE('',#407,#406,#409,.T.);
#358=EDGE_CURVE('',#407,#410,#411,.T.);
#359=EDGE_CURVE('',#412,#410,#413,.T.);
#360=EDGE_CURVE('',#410,#412,#414,.T.);
#361=EDGE_CURVE('',#415,#416,#417,.T.);
#362=EDGE_CURVE('',#416,#415,#418,.T.);
#363=EDGE_CURVE('',#416,#419,#420,.T.);
#364=EDGE_CURVE('',#421,#419,#422,.T.);
#365=EDGE_CURVE('',#419,#421,#423,.T.);
#366=EDGE_CURVE('',#424,#425,#426,.T.);
#367=EDGE_CURVE('',#425,#424,#427,.T.);
#368=EDGE_CURVE('',#428,#429,#430,.T.);
#369=EDGE_CURVE('',#429,#428,#431,.T.);
#370=EDGE_CURVE('',#432,#433,#434,.T.);
#371=EDGE_CURVE('',#433,#432,#435,.T.);
#372=EDGE_CURVE('',#436,#437,#438,.T.);
#373=EDGE_CURVE('',#437,#436,#439,.T.);
#374=EDGE_CURVE('',#440,#440,#441,.T.);
#375=EDGE_CURVE('',#442,#442,#443,.T.);
#376=EDGE_CURVE('',#444,#444,#445,.T.);
#377=EDGE_CURVE('',#446,#447,#448,.T.);
#378=EDGE_CURVE('',#447,#446,#449,.T.);
#379=EDGE_CURVE('',#450,#451,#452,.T.);
#380=EDGE_CURVE('',#451,#450,#453,.T.);
#381=EDGE_CURVE('',#454,#455,#456,.T.);
#382=EDGE_CURVE('',#455,#454,#457,.T.);
#383=EDGE_CURVE('',#403,#458,#459,.T.);
#384=EDGE_CURVE('',#460,#458,#461,.T.);
#385=EDGE_CURVE('',#458,#460,#462,.T.);
#386=EDGE_CURVE('',#425,#463,#464,.T.);
#387=EDGE_CURVE('',#465,#463,#466,.T.);
#388=EDGE_CURVE('',#463,#465,#467,.T.);
#389=EDGE_CURVE('',#468,#469,#470,.T.);
#390=EDGE_CURVE('',#469,#444,#471,.T.);
#391=EDGE_CURVE('',#469,#468,#472,.T.);
#392=EDGE_CURVE('',#433,#469,#473,.T.);
#393=EDGE_CURVE('',#429,#474,#475,.T.);
#394=EDGE_CURVE('',#476,#474,#477,.T.);
#395=EDGE_CURVE('',#474,#476,#478,.T.);
#396=EDGE_CURVE('',#474,#442,#479,.T.);
#397=EDGE_CURVE('',#437,#451,#480,.T.);
#398=EDGE_CURVE('',#436,#450,#481,.T.);
#399=EDGE_CURVE('',#458,#482,#483,.T.);
#400=EDGE_CURVE('',#463,#440,#484,.T.);
#401=EDGE_CURVE('',#455,#447,#485,.T.);
#402=VERTEX_POINT('',#486);
#403=VERTEX_POINT('',#487);
#404=CIRCLE('',#488,1.2295);
#405=CIRCLE('',#489,1.2295);
#406=VERTEX_POINT('',#490);
#407=VERTEX_POINT('',#491);
#408=CIRCLE('',#492,2.5);
#409=CIRCLE('',#493,2.5);
#410=VERTEX_POINT('',#494);
#411=LINE('',#495,#496);
#412=VERTEX_POINT('',#497);
#413=CIRCLE('',#498,2.5);
#414=CIRCLE('',#499,2.5);
#415=VERTEX_POINT('',#500);
#416=VERTEX_POINT('',#501);
#417=CIRCLE('',#502,3.5);
#418=CIRCLE('',#503,3.5);
#419=VERTEX_POINT('',#504);
#420=LINE('',#505,#506);
#421=VERTEX_POINT('',#507);
#422=CIRCLE('',#508,3.5);
#423=CIRCLE('',#509,3.5);
#424=VERTEX_POINT('',#510);
#425=VERTEX_POINT('',#511);
#426=CIRCLE('',#512,3.0);
#427=CIRCLE('',#513,3.0);
#428=VERTEX_POINT('',#514);
#429=VERTEX_POINT('',#515);
#430=CIRCLE('',#516,3.0);
#431=CIRCLE('',#517,3.0);
#432=VERTEX_POINT('',#518);
#433=VERTEX_POINT('',#519);
#434=CIRCLE('',#520,3.0);
#435=CIRCLE('',#521,3.0);
#436=VERTEX_POINT('',#522);
#437=VERTEX_POINT('',#523);
#438=CIRCLE('',#524,6.0);
#439=CIRCLE('',#525,10.5);
#440=VERTEX_POINT('',#526);
#441=CIRCLE('',#527,1.5);
#442=VERTEX_POINT('',#528);
#443=CIRCLE('',#529,1.5);
#444=VERTEX_POINT('',#530);
#445=CIRCLE('',#531,1.5);
#446=VERTEX_POINT('',#532);
#447=VERTEX_POINT('',#533);
#448=CIRCLE('',#534,2.5);
#449=CIRCLE('',#535,2.5);
#450=VERTEX_POINT('',#536);
#451=VERTEX_POINT('',#537);
#452=CIRCLE('',#538,6.0);
#453=CIRCLE('',#539,10.5);
#454=VERTEX_POINT('',#540);
#455=VERTEX_POINT('',#541);
#456=CIRCLE('',#542,2.5);
#457=CIRCLE('',#543,2.5);
#458=VERTEX_POINT('',#544);
#459=LINE('',#545,#546);
#460=VERTEX_POINT('',#547);
#461=CIRCLE('',#548,1.2295);
#462=CIRCLE('',#549,1.2295);
#463=VERTEX_POINT('',#550);
#464=LINE('',#551,#552);
#465=VERTEX_POINT('',#553);
#466=CIRCLE('',#554,1.5);
#467=CIRCLE('',#555,1.5);
#468=VERTEX_POINT('',#556);
#469=VERTEX_POINT('',#557);
#470=CIRCLE('',#558,1.5);
#471=LINE('',#559,#560);
#472=CIRCLE('',#561,1.5);
#473=LINE('',#562,#563);
#474=VERTEX_POINT('',#564);
#475=LINE('',#565,#566);
#476=VERTEX_POINT('',#567);
#477=CIRCLE('',#568,1.5);
#478=CIRCLE('',#569,1.5);
#479=LINE('',#570,#571);
#480=LINE('',#572,#573);
#481=LINE('',#574,#575);
#482=VERTEX_POINT('',#576);
#483=LINE('',#577,#578);
#484=LINE('',#579,#580);
#485=LINE('',#581,#582);
#486=CARTESIAN_POINT('',(-1.2295,0.0,-16.0));
#487=CARTESIAN_POINT('',(1.2295,-1.50570323955167E-16,-16.0));
#488=AXIS2_PLACEMENT_3D('',#583,#584,#585);
#489=AXIS2_PLACEMENT_3D('',#586,#587,#588);
#490=CARTESIAN_POINT('',(-2.5,0.0,-16.0));
#491=CARTESIAN_POINT('',(2.5,-3.06161699786838E-16,-16.0));
#492=AXIS2_PLACEMENT_3D('',#589,#590,#591);
#493=AXIS2_PLACEMENT_3D('',#592,#593,#594);
#494=CARTESIAN_POINT('',(2.5,-3.06161699786838E-16,-6.0));
#495=CARTESIAN_POINT('',(2.5,-3.06161699786838E-16,-6.0));
#496=VECTOR('',#595,1.0);
#497=CARTESIAN_POINT('',(-2.5,0.0,-6.0));
#498=AXIS2_PLACEMENT_3D('',#596,#597,#598);
#499=AXIS2_PLACEMENT_3D('',#599,#600,#601);
#500=CARTESIAN_POINT('',(-3.5,0.0,-6.0));
#501=CARTESIAN_POINT('',(3.5,-4.28626379701574E-16,-6.0));
#502=AXIS2_PLACEMENT_3D('',#602,#603,#604);
#503=AXIS2_PLACEMENT_3D('',#605,#606,#607);
#504=CARTESIAN_POINT('',(3.5,-4.28626379701574E-16,0.0));
#505=CARTESIAN_POINT('',(3.5,-4.28626379701574E-16,0.0));
#506=VECTOR('',#608,1.0);
#507=CARTESIAN_POINT('',(-3.5,0.0,0.0));
#508=AXIS2_PLACEMENT_3D('',#609,#610,#611);
#509=AXIS2_PLACEMENT_3D('',#612,#613,#614);
#510=CARTESIAN_POINT('',(0.0,-6.0,0.0));
#511=CARTESIAN_POINT('',(6.0,-6.0,-5.55111512312578E-16));
#512=AXIS2_PLACEMENT_3D('',#615,#616,#617);
#513=AXIS2_PLACEMENT_3D('',#618,#619,#620);
#514=CARTESIAN_POINT('',(-6.0,6.0,0.0));
#515=CARTESIAN_POINT('',(4.16333634234434E-16,6.0,-5.55111512312578E-16));
#516=AXIS2_PLACEMENT_3D('',#621,#622,#623);
#517=AXIS2_PLACEMENT_3D('',#624,#625,#626);
#518=CARTESIAN_POINT('',(-9.0,-3.0,0.0));
#519=CARTESIAN_POINT('',(-3.0,-3.0,-5.55111512312578E-16));
#520=AXIS2_PLACEMENT_3D('',#627,#628,#629);
#521=AXIS2_PLACEMENT_3D('',#630,#631,#632);
#522=CARTESIAN_POINT('',(10.4861404622114,0.539312717051504,0.0));
#523=CARTESIAN_POINT('',(3.45385953778863,9.91568728294849,0.0));
#524=AXIS2_PLACEMENT_3D('',#633,#634,#635);
#525=AXIS2_PLACEMENT_3D('',#636,#637,#638);
#526=CARTESIAN_POINT('',(4.5,-6.0,3.0));
#527=AXIS2_PLACEMENT_3D('',#639,#640,#641);
#528=CARTESIAN_POINT('',(-1.5,6.0,3.0));
#529=AXIS2_PLACEMENT_3D('',#642,#643,#644);
#530=CARTESIAN_POINT('',(-4.5,-3.0,3.0));
#531=AXIS2_PLACEMENT_3D('',#645,#646,#647);
#532=CARTESIAN_POINT('',(2.5,0.0,3.0));
#533=CARTESIAN_POINT('',(-2.5,-3.06161699786838E-16,3.0));
#534=AXIS2_PLACEMENT_3D('',#648,#649,#650);
#535=AXIS2_PLACEMENT_3D('',#651,#652,#653);
#536=CARTESIAN_POINT('',(10.4861404622114,0.539312717051504,3.0));
#537=CARTESIAN_POINT('',(3.45385953778863,9.91568728294849,3.0));
#538=AXIS2_PLACEMENT_3D('',#654,#655,#656);
#539=AXIS2_PLACEMENT_3D('',#657,#658,#659);
#540=CARTESIAN_POINT('',(2.5,0.0,5.0));
#541=CARTESIAN_POINT('',(-2.5,-3.06161699786838E-16,5.0));
#542=AXIS2_PLACEMENT_3D('',#660,#661,#662);
#543=AXIS2_PLACEMENT_3D('',#663,#664,#665);
#544=CARTESIAN_POINT('',(1.2295,-1.50570323955167E-16,-8.0));
#545=CARTESIAN_POINT('',(1.2295,-1.50570323955167E-16,-12.0));
#546=VECTOR('',#666,1.0);
#547=CARTESIAN_POINT('',(-1.2295,0.0,-8.0));
#548=AXIS2_PLACEMENT_3D('',#667,#668,#669);
#549=AXIS2_PLACEMENT_3D('',#670,#671,#672);
#550=CARTESIAN_POINT('',(4.5,-6.0,1.5));
#551=CARTESIAN_POINT('',(5.25,-6.0,0.75));
#552=VECTOR('',#673,1.0);
#553=CARTESIAN_POINT('',(1.5,-6.0,1.5));
#554=AXIS2_PLACEMENT_3D('',#674,#675,#676);
#555=AXIS2_PLACEMENT_3D('',#677,#678,#679);
#556=CARTESIAN_POINT('',(-7.5,-3.0,1.5));
#557=CARTESIAN_POINT('',(-4.5,-3.0,1.5));
#558=AXIS2_PLACEMENT_3D('',#680,#681,#682);
#559=CARTESIAN_POINT('',(-4.5,-3.0,35.2562051276084));
#560=VECTOR('',#683,1.0);
#561=AXIS2_PLACEMENT_3D('',#684,#685,#686);
#562=CARTESIAN_POINT('',(-3.75,-3.0,0.75));
#563=VECTOR('',#687,1.0);
#564=CARTESIAN_POINT('',(-1.5,6.0,1.5));
#565=CARTESIAN_POINT('',(-0.75,6.0,0.75));
#566=VECTOR('',#688,1.0);
#567=CARTESIAN_POINT('',(-4.5,6.0,1.5));
#568=AXIS2_PLACEMENT_3D('',#689,#690,#691);
#569=AXIS2_PLACEMENT_3D('',#692,#693,#694);
#570=CARTESIAN_POINT('',(-1.5,6.0,35.2562051276084));
#571=VECTOR('',#695,1.0);
#572=CARTESIAN_POINT('',(3.45385953778863,9.91568728294849,0.0));
#573=VECTOR('',#696,1.0);
#574=CARTESIAN_POINT('',(10.4861404622114,0.539312717051504,0.0));
#575=VECTOR('',#697,1.0);
#576=CARTESIAN_POINT('',(0.0,0.0,-7.26124186890561));
#577=CARTESIAN_POINT('',(0.61475,-7.52851619775835E-17,-7.63062093445281));
#578=VECTOR('',#698,1.0);
#579=CARTESIAN_POINT('',(4.5,-6.0,35.2562051276084));
#580=VECTOR('',#699,1.0);
#581=CARTESIAN_POINT('',(-2.5,-3.06161699786838E-16,3.0));
#582=VECTOR('',#700,1.0);
#583=CARTESIAN_POINT('',(0.0,0.0,-16.0));
#584=DIRECTION('',(0.0,0.0,1.0));
#585=DIRECTION('',(-1.0,0.0,0.0));
#586=CARTESIAN_POINT('',(0.0,0.0,-16.0));
#587=DIRECTION('',(0.0,0.0,1.0));
#588=DIRECTION('',(-1.0,0.0,0.0));
#589=CARTESIAN_POINT('',(0.0,0.0,-16.0));
#590=DIRECTION('',(0.0,0.0,-1.0));
#591=DIRECTION('',(-1.0,0.0,0.0));
#592=CARTESIAN_POINT('',(0.0,0.0,-16.0));
#593=DIRECTION('',(0.0,0.0,-1.0));
#594=DIRECTION('',(-1.0,0.0,0.0));
#595=DIRECTION('',(0.0,0.0,1.0));
#596=CARTESIAN_POINT('',(0.0,0.0,-6.0));
#597=DIRECTION('',(0.0,0.0,1.0));
#598=DIRECTION('',(-1.0,0.0,0.0));
#599=CARTESIAN_POINT('',(0.0,0.0,-6.0));
#600=DIRECTION('',(0.0,0.0,1.0));
#601=DIRECTION('',(-1.0,0.0,0.0));
#602=CARTESIAN_POINT('',(0.0,0.0,-6.0));
#603=DIRECTION('',(0.0,0.0,-1.0));
#604=DIRECTION('',(-1.0,0.0,0.0));
#605=CARTESIAN_POINT('',(0.0,0.0,-6.0));
#606=DIRECTION('',(0.0,0.0,-1.0));
#607=DIRECTION('',(-1.0,0.0,0.0));
#608=DIRECTION('',(0.0,0.0,1.0));
#609=CARTESIAN_POINT('',(0.0,0.0,0.0));
#610=DIRECTION('',(0.0,0.0,1.0));
#611=DIRECTION('',(-1.0,0.0,0.0));
#612=CARTESIAN_POINT('',(0.0,0.0,0.0));
#613=DIRECTION('',(0.0,0.0,1.0));
#614=DIRECTION('',(-1.0,0.0,0.0));
#615=CARTESIAN_POINT('',(3.0,-6.0,0.0));
#616=DIRECTION('',(0.0,0.0,1.0));
#617=DIRECTION('',(-1.0,0.0,0.0));
#618=CARTESIAN_POINT('',(3.0,-6.0,0.0));
#619=DIRECTION('',(0.0,0.0,1.0));
#620=DIRECTION('',(-1.0,0.0,0.0));
#621=CARTESIAN_POINT('',(-3.0,6.0,0.0));
#622=DIRECTION('',(0.0,0.0,1.0));
#623=DIRECTION('',(-1.0,0.0,0.0));
#624=CARTESIAN_POINT('',(-3.0,6.0,0.0));
#625=DIRECTION('',(0.0,0.0,1.0));
#626=DIRECTION('',(-1.0,0.0,0.0));
#627=CARTESIAN_POINT('',(-6.0,-3.0,0.0));
#628=DIRECTION('',(0.0,0.0,1.0));
#629=DIRECTION('',(-1.0,0.0,0.0));
#630=CARTESIAN_POINT('',(-6.0,-3.0,0.0));
#631=DIRECTION('',(0.0,0.0,1.0));
#632=DIRECTION('',(-1.0,0.0,0.0));
#633=CARTESIAN_POINT('',(8.0,6.0,0.0));
#634=DIRECTION('',(0.0,0.0,-1.0));
#635=DIRECTION('',(0.757690077035229,-0.652614547158082,0.0));
#636=CARTESIAN_POINT('',(0.0,0.0,0.0));
#637=DIRECTION('',(0.0,-0.0,1.0));
#638=DIRECTION('',(0.328939003598917,0.944351169804619,0.0));
#639=CARTESIAN_POINT('',(3.0,-6.0,3.0));
#640=DIRECTION('',(0.0,0.0,-1.0));
#641=DIRECTION('',(-1.0,0.0,0.0));
#642=CARTESIAN_POINT('',(-3.0,6.0,3.0));
#643=DIRECTION('',(0.0,0.0,-1.0));
#644=DIRECTION('',(-1.0,0.0,0.0));
#645=CARTESIAN_POINT('',(-6.0,-3.0,3.0));
#646=DIRECTION('',(0.0,0.0,-1.0));
#647=DIRECTION('',(-1.0,0.0,0.0));
#648=CARTESIAN_POINT('',(0.0,0.0,3.0));
#649=DIRECTION('',(0.0,0.0,-1.0));
#650=DIRECTION('',(1.0,0.0,0.0));
#651=CARTESIAN_POINT('',(0.0,0.0,3.0));
#652=DIRECTION('',(0.0,0.0,-1.0));
#653=DIRECTION('',(1.0,0.0,0.0));
#654=CARTESIAN_POINT('',(8.0,6.0,3.0));
#655=DIRECTION('',(0.0,0.0,-1.0));
#656=DIRECTION('',(0.757690077035229,-0.652614547158082,0.0));
#657=CARTESIAN_POINT('',(0.0,0.0,3.0));
#658=DIRECTION('',(0.0,-0.0,1.0));
#659=DIRECTION('',(0.328939003598917,0.944351169804619,0.0));
#660=CARTESIAN_POINT('',(0.0,0.0,5.0));
#661=DIRECTION('',(0.0,0.0,1.0));
#662=DIRECTION('',(1.0,0.0,0.0));
#663=CARTESIAN_POINT('',(0.0,0.0,5.0));
#664=DIRECTION('',(0.0,0.0,1.0));
#665=DIRECTION('',(1.0,0.0,0.0));
#666=DIRECTION('',(0.0,0.0,1.0));
#667=CARTESIAN_POINT('',(0.0,0.0,-8.0));
#668=DIRECTION('',(0.0,0.0,-1.0));
#669=DIRECTION('',(-1.0,0.0,0.0));
#670=CARTESIAN_POINT('',(0.0,0.0,-8.0));
#671=DIRECTION('',(0.0,0.0,-1.0));
#672=DIRECTION('',(-1.0,0.0,0.0));
#673=DIRECTION('',(-0.707106781186547,8.65956056235493E-17,0.707106781186548));
#674=CARTESIAN_POINT('',(3.0,-6.0,1.5));
#675=DIRECTION('',(0.0,0.0,-1.0));
#676=DIRECTION('',(-1.0,0.0,0.0));
#677=CARTESIAN_POINT('',(3.0,-6.0,1.5));
#678=DIRECTION('',(0.0,0.0,-1.0));
#679=DIRECTION('',(-1.0,0.0,0.0));
#680=CARTESIAN_POINT('',(-6.0,-3.0,1.5));
#681=DIRECTION('',(0.0,0.0,-1.0));
#682=DIRECTION('',(-1.0,0.0,0.0));
#683=DIRECTION('',(0.0,0.0,1.0));
#684=CARTESIAN_POINT('',(-6.0,-3.0,1.5));
#685=DIRECTION('',(0.0,0.0,-1.0));
#686=DIRECTION('',(-1.0,0.0,0.0));
#687=DIRECTION('',(-0.707106781186547,8.65956056235493E-17,0.707106781186548));
#688=DIRECTION('',(-0.707106781186547,8.65956056235493E-17,0.707106781186548));
#689=CARTESIAN_POINT('',(-3.0,6.0,1.5));
#690=DIRECTION('',(0.0,0.0,-1.0));
#691=DIRECTION('',(-1.0,0.0,0.0));
#692=CARTESIAN_POINT('',(-3.0,6.0,1.5));
#693=DIRECTION('',(0.0,0.0,-1.0));
#694=DIRECTION('',(-1.0,0.0,0.0));
#695=DIRECTION('',(0.0,0.0,1.0));
#696=DIRECTION('',(0.0,0.0,1.0));
#697=DIRECTION('',(0.0,0.0,1.0));
#698=DIRECTION('',(-0.857167300702112,1.04972719113862E-16,0.515038074910054));
#699=DIRECTION('',(0.0,0.0,1.0));
#700=DIRECTION('',(0.0,0.0,-1.0));
ENDSEC;
END-ISO-10303-21;
