ISO-10303-21;
HEADER;
FILE_DESCRIPTION(('STEP AP203'),'1');
FILE_NAME('EspelharEspelharEncoder_1.stp','2022-12-07T21:40:55',(' '),(' '),'Spatial InterOp 3D',' ',' ');
FILE_SCHEMA(('CONFIG_CONTROL_DESIGN'));
ENDSEC;
DATA;
#1=DESIGN_CONTEXT('',#33,'design');
#2=APPLICATION_PROTOCOL_DEFINITION('INTERNATIONAL STANDARD','config_control_design',1994,#33);
#3=PRODUCT_CATEGORY_RELATIONSHIP('NONE','NONE',#34,#35);
#4=DATE_AND_TIME(#36,#37);
#5=DATE_TIME_ROLE('creation_date');
#6=DATE_TIME_ROLE('classification_date');
#7=PERSON_AND_ORGANIZATION_ROLE('creator');
#8=PERSON_AND_ORGANIZATION_ROLE('design_supplier');
#9=PERSON_AND_ORGANIZATION_ROLE('classification_officer');
#10=PERSON_AND_ORGANIZATION_ROLE('design_owner');
#11=APPROVAL_PERSON_ORGANIZATION(#38,#39,#40);
#12=APPROVAL_DATE_TIME(#4,#39);
#13=CC_DESIGN_APPROVAL(#39,(#41,#42,#43));
#14=CC_DESIGN_DATE_AND_TIME_ASSIGNMENT(#4,#5,(#43));
#15=CC_DESIGN_DATE_AND_TIME_ASSIGNMENT(#4,#6,(#41));
#16=CC_DESIGN_PERSON_AND_ORGANIZATION_ASSIGNMENT(#38,#10,(#44));
#17=CC_DESIGN_PERSON_AND_ORGANIZATION_ASSIGNMENT(#38,#7,(#43));
#18=CC_DESIGN_PERSON_AND_ORGANIZATION_ASSIGNMENT(#38,#7,(#42));
#19=CC_DESIGN_PERSON_AND_ORGANIZATION_ASSIGNMENT(#38,#8,(#42));
#20=CC_DESIGN_SECURITY_CLASSIFICATION(#41,(#42));
#21=CC_DESIGN_PERSON_AND_ORGANIZATION_ASSIGNMENT(#38,#9,(#41));
#22=SHAPE_DEFINITION_REPRESENTATION(#45,#46);
#23= (GEOMETRIC_REPRESENTATION_CONTEXT(3)GLOBAL_UNCERTAINTY_ASSIGNED_CONTEXT((#49))GLOBAL_UNIT_ASSIGNED_CONTEXT((#51,#52,#53))REPRESENTATION_CONTEXT('NONE','WORKSPACE'));
#24=PROPERTY_DEFINITION_REPRESENTATION(#55,#56);
#25=GENERAL_PROPERTY_ASSOCIATION('','',#57,#55);
#26=PROPERTY_DEFINITION_REPRESENTATION(#58,#59);
#27=GENERAL_PROPERTY_ASSOCIATION('','',#60,#58);
#28=PROPERTY_DEFINITION_REPRESENTATION(#61,#62);
#29=GENERAL_PROPERTY_ASSOCIATION('','',#63,#61);
#33=APPLICATION_CONTEXT('CONFIGURATION CONTROLLED 3D DESIGNS OF MECHANICAL PARTS AND ASSEMBLIES');
#34=PRODUCT_CATEGORY('part','NONE');
#35=PRODUCT_RELATED_PRODUCT_CATEGORY('detail',' ',(#44));
#36=CALENDAR_DATE(2022,7,11);
#37=LOCAL_TIME(18,40,55.0,#64);
#38=PERSON_AND_ORGANIZATION(#65,#66);
#39=APPROVAL(#67,'SOLID MODEL');
#40=APPROVAL_ROLE('APPROVED');
#41=SECURITY_CLASSIFICATION('','',#68);
#42=PRODUCT_DEFINITION_FORMATION_WITH_SPECIFIED_SOURCE('A','NONE',#44,.NOT_KNOWN.);
#43=PRODUCT_DEFINITION('','NONE',#42,#1);
#44=PRODUCT('EspelharEspelharEncoder_1','','EspelharEspelharEncoder_1',(#69));
#45=PRODUCT_DEFINITION_SHAPE('NONE','NONE',#43);
#46=ADVANCED_BREP_SHAPE_REPRESENTATION('1',(#70,#71),#23);
#49=UNCERTAINTY_MEASURE_WITH_UNIT(LENGTH_MEASURE(0.001),#51,'','');
#51= (CONVERSION_BASED_UNIT('MILLIMETRE',#74)LENGTH_UNIT()NAMED_UNIT(#77));
#52= (NAMED_UNIT(#79)PLANE_ANGLE_UNIT()SI_UNIT($,.RADIAN.));
#53= (NAMED_UNIT(#79)SOLID_ANGLE_UNIT()SI_UNIT($,.STERADIAN.));
#55=PROPERTY_DEFINITION('PdmObjectId','',#43);
#56=REPRESENTATION('',(#85),#23);
#57=GENERAL_PROPERTY('','19_5f3e0fdf-4568-47a5-9503-c19d6208099e&2_26_0_0','');
#58=PROPERTY_DEFINITION('CreationDate','',#43);
#59=REPRESENTATION('',(#86),#23);
#60=GENERAL_PROPERTY('','12/01/2022 12:58:11','');
#61=PROPERTY_DEFINITION('Minor Revision','',#43);
#62=REPRESENTATION('',(#87),#23);
#63=GENERAL_PROPERTY('','0','');
#64=COORDINATED_UNIVERSAL_TIME_OFFSET(3,0,.BEHIND.);
#65=PERSON('','UNSPECIFIED',$,$,$,$);
#66=ORGANIZATION('UNSPECIFIED','UNSPECIFIED','UNSPECIFIED');
#67=APPROVAL_STATUS('approved');
#68=SECURITY_CLASSIFICATION_LEVEL('unclassified');
#69=MECHANICAL_CONTEXT('',#33,'mechanical');
#70=MANIFOLD_SOLID_BREP('1',#88);
#71=AXIS2_PLACEMENT_3D('',#89,#90,#91);
#74=LENGTH_MEASURE_WITH_UNIT(LENGTH_MEASURE(1.0),#92);
#77=DIMENSIONAL_EXPONENTS(1.0,0.0,0.0,0.0,0.0,0.0,0.0);
#79=DIMENSIONAL_EXPONENTS(0.0,0.0,0.0,0.0,0.0,0.0,0.0);
#85=VALUE_REPRESENTATION_ITEM('19_5f3e0fdf-4568-47a5-9503-c19d6208099e&2_26_0_0',);
#86=VALUE_REPRESENTATION_ITEM('12/01/2022 12:58:11',);
#87=VALUE_REPRESENTATION_ITEM('0',);
#88=CLOSED_SHELL('',(#93,#94,#95,#96,#97,#98,#99,#100,#101,#102,#103,#104,#105,#106,#107,#108,#109,#110,#111,#112,#113,#114,#115,#116));
#89=CARTESIAN_POINT('',(0.0,0.0,0.0));
#90=DIRECTION('',(0.0,0.0,1.0));
#91=DIRECTION('',(1.0,0.0,0.0));
#92= (NAMED_UNIT(#77)LENGTH_UNIT()SI_UNIT(.MILLI.,.METRE.));
#93=ADVANCED_FACE('',(#118),#119,.T.);
#94=ADVANCED_FACE('',(#120),#121,.F.);
#95=ADVANCED_FACE('',(#122),#123,.F.);
#96=ADVANCED_FACE('',(#124),#125,.F.);
#97=ADVANCED_FACE('',(#126,#127,#128),#129,.F.);
#98=ADVANCED_FACE('',(#130),#131,.F.);
#99=ADVANCED_FACE('',(#132),#133,.F.);
#100=ADVANCED_FACE('',(#134,#135),#136,.T.);
#101=ADVANCED_FACE('',(#137,#138),#139,.T.);
#102=ADVANCED_FACE('',(#140),#141,.T.);
#103=ADVANCED_FACE('',(#142),#143,.T.);
#104=ADVANCED_FACE('',(#144,#145),#146,.T.);
#105=ADVANCED_FACE('',(#147),#148,.T.);
#106=ADVANCED_FACE('',(#149),#150,.T.);
#107=ADVANCED_FACE('',(#151,#152),#153,.T.);
#108=ADVANCED_FACE('',(#154),#155,.T.);
#109=ADVANCED_FACE('',(#156),#157,.T.);
#110=ADVANCED_FACE('',(#158),#159,.T.);
#111=ADVANCED_FACE('',(#160),#161,.T.);
#112=ADVANCED_FACE('',(#162),#163,.F.);
#113=ADVANCED_FACE('',(#164,#165),#166,.T.);
#114=ADVANCED_FACE('',(#167),#168,.F.);
#115=ADVANCED_FACE('',(#169),#170,.T.);
#116=ADVANCED_FACE('',(#171),#172,.F.);
#118=FACE_OUTER_BOUND('',#173,.T.);
#119=CYLINDRICAL_SURFACE('',#174,3.4925);
#120=FACE_OUTER_BOUND('',#175,.T.);
#121=CYLINDRICAL_SURFACE('',#176,1.3208);
#122=FACE_OUTER_BOUND('',#177,.T.);
#123=CYLINDRICAL_SURFACE('',#178,1.3208);
#124=FACE_OUTER_BOUND('',#179,.T.);
#125=CONICAL_SURFACE('',#180,0.87884,0.785398163397444);
#126=FACE_BOUND('',#181,.T.);
#127=FACE_BOUND('',#182,.T.);
#128=FACE_OUTER_BOUND('',#183,.T.);
#129=CYLINDRICAL_SURFACE('',#184,0.996949999999999);
#130=FACE_OUTER_BOUND('',#185,.T.);
#131=CONICAL_SURFACE('',#186,0.996949999999999,1.02974425867665);
#132=FACE_OUTER_BOUND('',#187,.T.);
#133=CYLINDRICAL_SURFACE('',#188,0.75184);
#134=FACE_BOUND('',#189,.T.);
#135=FACE_OUTER_BOUND('',#190,.T.);
#136=PLANE('',#191);
#137=FACE_BOUND('',#192,.T.);
#138=FACE_OUTER_BOUND('',#193,.T.);
#139=PLANE('',#194);
#140=FACE_OUTER_BOUND('',#195,.T.);
#141=CYLINDRICAL_SURFACE('',#196,3.9243);
#142=FACE_OUTER_BOUND('',#197,.T.);
#143=CYLINDRICAL_SURFACE('',#198,3.8608);
#144=FACE_BOUND('',#199,.T.);
#145=FACE_OUTER_BOUND('',#200,.T.);
#146=PLANE('',#201);
#147=FACE_OUTER_BOUND('',#202,.T.);
#148=CONICAL_SURFACE('',#203,4.699,1.51371554438863);
#149=FACE_OUTER_BOUND('',#204,.T.);
#150=CYLINDRICAL_SURFACE('',#205,8.255);
#151=FACE_BOUND('',#206,.T.);
#152=FACE_OUTER_BOUND('',#207,.T.);
#153=PLANE('',#208);
#154=FACE_OUTER_BOUND('',#209,.T.);
#155=TOROIDAL_SURFACE('',#210,8.0518,0.2032);
#156=FACE_OUTER_BOUND('',#211,.T.);
#157=TOROIDAL_SURFACE('',#212,3.2893,0.2032);
#158=FACE_OUTER_BOUND('',#213,.T.);
#159=TOROIDAL_SURFACE('',#214,3.5433,0.381);
#160=FACE_OUTER_BOUND('',#215,.T.);
#161=TOROIDAL_SURFACE('',#216,8.1788,0.0762);
#162=FACE_OUTER_BOUND('',#217,.T.);
#163=CONICAL_SURFACE('',#218,0.75184,0.785398163397439);
#164=FACE_BOUND('',#219,.T.);
#165=FACE_OUTER_BOUND('',#220,.T.);
#166=PLANE('',#221);
#167=FACE_OUTER_BOUND('',#222,.T.);
#168=TOROIDAL_SURFACE('',#223,3.8735,0.381);
#169=FACE_OUTER_BOUND('',#224,.T.);
#170=CONICAL_SURFACE('',#225,3.4925,0.393058019181932);
#171=FACE_OUTER_BOUND('',#226,.T.);
#172=CYLINDRICAL_SURFACE('',#227,0.75184);
#173=EDGE_LOOP('',(#228,#229,#230,#231,#232,#233,#234,#235,#236,#237,#238,#239));
#174=AXIS2_PLACEMENT_3D('',#240,#241,#242);
#175=EDGE_LOOP('',(#243,#244,#245,#246,#247,#248));
#176=AXIS2_PLACEMENT_3D('',#249,#250,#251);
#177=EDGE_LOOP('',(#252,#253));
#178=AXIS2_PLACEMENT_3D('',#254,#255,#256);
#179=EDGE_LOOP('',(#257,#258,#259,#260,#261,#262));
#180=AXIS2_PLACEMENT_3D('',#263,#264,#265);
#181=EDGE_LOOP('',(#266,#267));
#182=EDGE_LOOP('',(#268,#269));
#183=EDGE_LOOP('',(#270,#271,#272,#273,#274,#275));
#184=AXIS2_PLACEMENT_3D('',#276,#277,#278);
#185=EDGE_LOOP('',(#279,#280,#281,#282));
#186=AXIS2_PLACEMENT_3D('',#283,#284,#285);
#187=EDGE_LOOP('',(#286,#287,#288,#289,#290,#291));
#188=AXIS2_PLACEMENT_3D('',#292,#293,#294);
#189=EDGE_LOOP('',(#295,#296));
#190=EDGE_LOOP('',(#297,#298,#299,#300));
#191=AXIS2_PLACEMENT_3D('',#301,#302,#303);
#192=EDGE_LOOP('',(#304,#305));
#193=EDGE_LOOP('',(#306,#307));
#194=AXIS2_PLACEMENT_3D('',#308,#309,#310);
#195=EDGE_LOOP('',(#311,#312,#313,#314,#315,#316));
#196=AXIS2_PLACEMENT_3D('',#317,#318,#319);
#197=EDGE_LOOP('',(#320,#321,#322,#323,#324,#325));
#198=AXIS2_PLACEMENT_3D('',#326,#327,#328);
#199=EDGE_LOOP('',(#329,#330));
#200=EDGE_LOOP('',(#331));
#201=AXIS2_PLACEMENT_3D('',#332,#333,#334);
#202=EDGE_LOOP('',(#335,#336,#337,#338,#339));
#203=AXIS2_PLACEMENT_3D('',#340,#341,#342);
#204=EDGE_LOOP('',(#343,#344,#345,#346,#347,#348));
#205=AXIS2_PLACEMENT_3D('',#349,#350,#351);
#206=EDGE_LOOP('',(#352,#353));
#207=EDGE_LOOP('',(#354,#355));
#208=AXIS2_PLACEMENT_3D('',#356,#357,#358);
#209=EDGE_LOOP('',(#359,#360,#361,#362,#363,#364));
#210=AXIS2_PLACEMENT_3D('',#365,#366,#367);
#211=EDGE_LOOP('',(#368,#369,#370,#371,#372,#373,#374));
#212=AXIS2_PLACEMENT_3D('',#375,#376,#377);
#213=EDGE_LOOP('',(#378,#379,#380,#381,#382,#383));
#214=AXIS2_PLACEMENT_3D('',#384,#385,#386);
#215=EDGE_LOOP('',(#387,#388,#389,#390,#391,#392));
#216=AXIS2_PLACEMENT_3D('',#393,#394,#395);
#217=EDGE_LOOP('',(#396,#397,#398,#399,#400,#401));
#218=AXIS2_PLACEMENT_3D('',#402,#403,#404);
#219=EDGE_LOOP('',(#405,#406));
#220=EDGE_LOOP('',(#407,#408));
#221=AXIS2_PLACEMENT_3D('',#409,#410,#411);
#222=EDGE_LOOP('',(#412,#413,#414,#415,#416,#417));
#223=AXIS2_PLACEMENT_3D('',#418,#419,#420);
#224=EDGE_LOOP('',(#421,#422,#423,#424,#425,#426,#427));
#225=AXIS2_PLACEMENT_3D('',#428,#429,#430);
#226=EDGE_LOOP('',(#431,#432,#433,#434,#435,#436));
#227=AXIS2_PLACEMENT_3D('',#437,#438,#439);
#228=ORIENTED_EDGE('',*,*,#440,.T.);
#229=ORIENTED_EDGE('',*,*,#441,.T.);
#230=ORIENTED_EDGE('',*,*,#442,.T.);
#231=ORIENTED_EDGE('',*,*,#443,.T.);
#232=ORIENTED_EDGE('',*,*,#444,.T.);
#233=ORIENTED_EDGE('',*,*,#445,.T.);
#234=ORIENTED_EDGE('',*,*,#446,.T.);
#235=ORIENTED_EDGE('',*,*,#447,.T.);
#236=ORIENTED_EDGE('',*,*,#448,.T.);
#237=ORIENTED_EDGE('',*,*,#449,.T.);
#238=ORIENTED_EDGE('',*,*,#442,.F.);
#239=ORIENTED_EDGE('',*,*,#450,.T.);
#240=CARTESIAN_POINT('',(-6.6382441655905E-13,2.24370587462635,-2243.79808459707));
#241=DIRECTION('',(2.96059473233375E-13,-1.0,1.57894737676429E-29));
#242=DIRECTION('',(-0.0673361583745223,-1.99355075779202E-14,-0.997730345221273));
#243=ORIENTED_EDGE('',*,*,#451,.T.);
#244=ORIENTED_EDGE('',*,*,#452,.F.);
#245=ORIENTED_EDGE('',*,*,#453,.T.);
#246=ORIENTED_EDGE('',*,*,#448,.F.);
#247=ORIENTED_EDGE('',*,*,#454,.F.);
#248=ORIENTED_EDGE('',*,*,#444,.F.);
#249=CARTESIAN_POINT('',(-3.7379967383728,4.40270587462524,-2243.54580967972));
#250=DIRECTION('',(0.997730345221273,2.95387520435164E-13,-0.0673361583745224));
#251=DIRECTION('',(0.0673361583745224,1.99355075779202E-14,0.997730345221273));
#252=ORIENTED_EDGE('',*,*,#455,.F.);
#253=ORIENTED_EDGE('',*,*,#446,.F.);
#254=CARTESIAN_POINT('',(-3.7379967383728,4.40270587462524,-2243.54580967972));
#255=DIRECTION('',(0.997730345221273,2.95387520435164E-13,-0.0673361583745224));
#256=DIRECTION('',(0.0673361583745224,1.99355075779202E-14,0.997730345221273));
#257=ORIENTED_EDGE('',*,*,#456,.F.);
#258=ORIENTED_EDGE('',*,*,#457,.F.);
#259=ORIENTED_EDGE('',*,*,#458,.T.);
#260=ORIENTED_EDGE('',*,*,#459,.F.);
#261=ORIENTED_EDGE('',*,*,#460,.F.);
#262=ORIENTED_EDGE('',*,*,#458,.F.);
#263=CARTESIAN_POINT('',(-2.36332421670792E-12,7.98410587462635,-2243.79808459707));
#264=DIRECTION('',(-2.96059473233375E-13,1.0,-1.55847870386737E-29));
#265=DIRECTION('',(0.0673361583745223,1.99355075779202E-14,0.997730345221273));
#266=ORIENTED_EDGE('',*,*,#461,.T.);
#267=ORIENTED_EDGE('',*,*,#462,.T.);
#268=ORIENTED_EDGE('',*,*,#463,.T.);
#269=ORIENTED_EDGE('',*,*,#464,.T.);
#270=ORIENTED_EDGE('',*,*,#465,.F.);
#271=ORIENTED_EDGE('',*,*,#466,.F.);
#272=ORIENTED_EDGE('',*,*,#467,.T.);
#273=ORIENTED_EDGE('',*,*,#468,.T.);
#274=ORIENTED_EDGE('',*,*,#469,.T.);
#275=ORIENTED_EDGE('',*,*,#467,.F.);
#276=CARTESIAN_POINT('',(-3.2311497230004,4.40270587462539,-2243.58001644818));
#277=DIRECTION('',(-0.997730345221273,-2.95387520435164E-13,0.0673361583745223));
#278=DIRECTION('',(-0.0673361583745223,-1.99355075779202E-14,-0.997730345221273));
#279=ORIENTED_EDGE('',*,*,#470,.T.);
#280=ORIENTED_EDGE('',*,*,#466,.T.);
#281=ORIENTED_EDGE('',*,*,#465,.T.);
#282=ORIENTED_EDGE('',*,*,#470,.F.);
#283=CARTESIAN_POINT('',(2.21745569225298,4.402705874627,-2243.94773920906));
#284=DIRECTION('',(-0.997730345221273,-2.95387520435164E-13,0.0673361583745223));
#285=DIRECTION('',(-0.0673361583745223,-1.99355075779202E-14,-0.997730345221273));
#286=ORIENTED_EDGE('',*,*,#461,.F.);
#287=ORIENTED_EDGE('',*,*,#462,.F.);
#288=ORIENTED_EDGE('',*,*,#471,.T.);
#289=ORIENTED_EDGE('',*,*,#472,.T.);
#290=ORIENTED_EDGE('',*,*,#473,.T.);
#291=ORIENTED_EDGE('',*,*,#471,.F.);
#292=CARTESIAN_POINT('',(-6.6382441655905E-13,2.24370587462635,-2243.79808459707));
#293=DIRECTION('',(2.96059473233375E-13,-1.0,1.86327819060632E-29));
#294=DIRECTION('',(-0.0673361583745223,-1.99355075779202E-14,-0.997730345221273));
#295=ORIENTED_EDGE('',*,*,#469,.F.);
#296=ORIENTED_EDGE('',*,*,#468,.F.);
#297=ORIENTED_EDGE('',*,*,#455,.T.);
#298=ORIENTED_EDGE('',*,*,#445,.F.);
#299=ORIENTED_EDGE('',*,*,#454,.T.);
#300=ORIENTED_EDGE('',*,*,#447,.F.);
#301=CARTESIAN_POINT('',(-3.2311497230004,4.40270587462539,-2243.58001644818));
#302=DIRECTION('',(-0.997730345221273,-2.95387520435164E-13,0.0673361583745225));
#303=DIRECTION('',(-2.96059473233376E-13,1.0,0.0));
#304=ORIENTED_EDGE('',*,*,#474,.T.);
#305=ORIENTED_EDGE('',*,*,#475,.T.);
#306=ORIENTED_EDGE('',*,*,#476,.F.);
#307=ORIENTED_EDGE('',*,*,#477,.F.);
#308=CARTESIAN_POINT('',(3.91539319374992,6.48550587462751,-2244.06233188338));
#309=DIRECTION('',(-2.96059473233375E-13,1.0,0.0));
#310=DIRECTION('',(1.0,2.96059473233375E-13,0.0));
#311=ORIENTED_EDGE('',*,*,#478,.T.);
#312=ORIENTED_EDGE('',*,*,#479,.T.);
#313=ORIENTED_EDGE('',*,*,#480,.T.);
#314=ORIENTED_EDGE('',*,*,#477,.T.);
#315=ORIENTED_EDGE('',*,*,#476,.T.);
#316=ORIENTED_EDGE('',*,*,#480,.F.);
#317=CARTESIAN_POINT('',(-6.6382441655905E-13,2.24370587462635,-2243.79808459707));
#318=DIRECTION('',(2.96059473233375E-13,-1.0,1.56324157905499E-29));
#319=DIRECTION('',(-0.0673361583745223,-1.99355075779202E-14,-0.997730345221273));
#320=ORIENTED_EDGE('',*,*,#474,.F.);
#321=ORIENTED_EDGE('',*,*,#475,.F.);
#322=ORIENTED_EDGE('',*,*,#481,.T.);
#323=ORIENTED_EDGE('',*,*,#482,.T.);
#324=ORIENTED_EDGE('',*,*,#483,.T.);
#325=ORIENTED_EDGE('',*,*,#481,.F.);
#326=CARTESIAN_POINT('',(-6.6382441655905E-13,2.24370587462635,-2243.79808459707));
#327=DIRECTION('',(2.96059473233375E-13,-1.0,1.61508688116505E-29));
#328=DIRECTION('',(-0.0673361583745223,-1.99355075779202E-14,-0.997730345221273));
#329=ORIENTED_EDGE('',*,*,#483,.F.);
#330=ORIENTED_EDGE('',*,*,#482,.F.);
#331=ORIENTED_EDGE('',*,*,#484,.T.);
#332=CARTESIAN_POINT('',(3.85203731682826,6.86650587462749,-2244.05805603733));
#333=DIRECTION('',(2.96059473233375E-13,-1.0,0.0));
#334=DIRECTION('',(0.0,0.0,-1.0));
#335=ORIENTED_EDGE('',*,*,#485,.T.);
#336=ORIENTED_EDGE('',*,*,#486,.T.);
#337=ORIENTED_EDGE('',*,*,#487,.T.);
#338=ORIENTED_EDGE('',*,*,#484,.F.);
#339=ORIENTED_EDGE('',*,*,#487,.F.);
#340=CARTESIAN_POINT('',(-2.0324481494223E-12,6.86650587462634,-2243.79808459707));
#341=DIRECTION('',(-2.96059473233375E-13,1.0,-1.74445427856537E-29));
#342=DIRECTION('',(0.0673361583745223,1.99355075779202E-14,0.997730345221273));
#343=ORIENTED_EDGE('',*,*,#488,.T.);
#344=ORIENTED_EDGE('',*,*,#489,.T.);
#345=ORIENTED_EDGE('',*,*,#490,.T.);
#346=ORIENTED_EDGE('',*,*,#491,.T.);
#347=ORIENTED_EDGE('',*,*,#492,.T.);
#348=ORIENTED_EDGE('',*,*,#490,.F.);
#349=CARTESIAN_POINT('',(-6.6382441655905E-13,2.24370587462635,-2243.79808459707));
#350=DIRECTION('',(2.96059473233375E-13,-1.0,1.69573342534153E-29));
#351=DIRECTION('',(-0.0673361583745223,-1.99355075779202E-14,-0.997730345221273));
#352=ORIENTED_EDGE('',*,*,#459,.T.);
#353=ORIENTED_EDGE('',*,*,#460,.T.);
#354=ORIENTED_EDGE('',*,*,#493,.T.);
#355=ORIENTED_EDGE('',*,*,#494,.T.);
#356=CARTESIAN_POINT('',(8.23626399979924,7.98410587462878,-2244.35394458445));
#357=DIRECTION('',(-2.96059473233375E-13,1.0,0.0));
#358=DIRECTION('',(1.0,2.96059473233375E-13,0.0));
#359=ORIENTED_EDGE('',*,*,#493,.F.);
#360=ORIENTED_EDGE('',*,*,#494,.F.);
#361=ORIENTED_EDGE('',*,*,#495,.T.);
#362=ORIENTED_EDGE('',*,*,#491,.F.);
#363=ORIENTED_EDGE('',*,*,#492,.F.);
#364=ORIENTED_EDGE('',*,*,#495,.F.);
#365=CARTESIAN_POINT('',(-2.30316493174689E-12,7.78090587462635,-2243.79808459707));
#366=DIRECTION('',(-2.96059473233375E-13,1.0,0.0));
#367=DIRECTION('',(0.0,0.0,1.0));
#368=ORIENTED_EDGE('',*,*,#496,.F.);
#369=ORIENTED_EDGE('',*,*,#497,.F.);
#370=ORIENTED_EDGE('',*,*,#498,.T.);
#371=ORIENTED_EDGE('',*,*,#440,.F.);
#372=ORIENTED_EDGE('',*,*,#450,.F.);
#373=ORIENTED_EDGE('',*,*,#441,.F.);
#374=ORIENTED_EDGE('',*,*,#498,.F.);
#375=CARTESIAN_POINT('',(-7.23983701520072E-13,2.44690587462635,-2243.79808459707));
#376=DIRECTION('',(2.96059473233375E-13,-1.0,0.0));
#377=DIRECTION('',(0.0,0.0,-1.0));
#378=ORIENTED_EDGE('',*,*,#478,.F.);
#379=ORIENTED_EDGE('',*,*,#479,.F.);
#380=ORIENTED_EDGE('',*,*,#499,.T.);
#381=ORIENTED_EDGE('',*,*,#500,.F.);
#382=ORIENTED_EDGE('',*,*,#501,.F.);
#383=ORIENTED_EDGE('',*,*,#499,.F.);
#384=CARTESIAN_POINT('',(-1.8669084778332E-12,6.30736257216359,-2243.79808459707));
#385=DIRECTION('',(-2.96059473233375E-13,1.0,0.0));
#386=DIRECTION('',(0.0,0.0,1.0));
#387=ORIENTED_EDGE('',*,*,#488,.F.);
#388=ORIENTED_EDGE('',*,*,#489,.F.);
#389=ORIENTED_EDGE('',*,*,#502,.T.);
#390=ORIENTED_EDGE('',*,*,#485,.F.);
#391=ORIENTED_EDGE('',*,*,#486,.F.);
#392=ORIENTED_EDGE('',*,*,#502,.F.);
#393=CARTESIAN_POINT('',(-2.11391484090598E-12,7.14167589568311,-2243.79808459707));
#394=DIRECTION('',(-2.96059473233375E-13,1.0,0.0));
#395=DIRECTION('',(0.0,0.0,1.0));
#396=ORIENTED_EDGE('',*,*,#473,.F.);
#397=ORIENTED_EDGE('',*,*,#472,.F.);
#398=ORIENTED_EDGE('',*,*,#503,.T.);
#399=ORIENTED_EDGE('',*,*,#504,.F.);
#400=ORIENTED_EDGE('',*,*,#505,.F.);
#401=ORIENTED_EDGE('',*,*,#503,.F.);
#402=CARTESIAN_POINT('',(-7.01423969659689E-13,2.37070587462635,-2243.79808459707));
#403=DIRECTION('',(2.96059473233375E-13,-1.0,1.86327819060632E-29));
#404=DIRECTION('',(-0.0673361583745223,-1.99355075779202E-14,-0.997730345221273));
#405=ORIENTED_EDGE('',*,*,#504,.T.);
#406=ORIENTED_EDGE('',*,*,#505,.T.);
#407=ORIENTED_EDGE('',*,*,#496,.T.);
#408=ORIENTED_EDGE('',*,*,#497,.T.);
#409=CARTESIAN_POINT('',(0.750133582750498,2.24370587462657,-2243.84871061439));
#410=DIRECTION('',(2.96059473233375E-13,-1.0,0.0));
#411=DIRECTION('',(0.0,0.0,-1.0));
#412=ORIENTED_EDGE('',*,*,#451,.F.);
#413=ORIENTED_EDGE('',*,*,#443,.F.);
#414=ORIENTED_EDGE('',*,*,#449,.F.);
#415=ORIENTED_EDGE('',*,*,#453,.F.);
#416=ORIENTED_EDGE('',*,*,#506,.F.);
#417=ORIENTED_EDGE('',*,*,#507,.F.);
#418=CARTESIAN_POINT('',(-1.51367595457977E-12,5.1142491770891,-2243.79808459707));
#419=DIRECTION('',(2.96070321322262E-13,-1.0,-7.32130314420282E-19));
#420=DIRECTION('',(0.997730345221271,2.95398393201476E-13,-0.0673361583745622));
#421=ORIENTED_EDGE('',*,*,#500,.T.);
#422=ORIENTED_EDGE('',*,*,#501,.T.);
#423=ORIENTED_EDGE('',*,*,#508,.T.);
#424=ORIENTED_EDGE('',*,*,#506,.T.);
#425=ORIENTED_EDGE('',*,*,#452,.T.);
#426=ORIENTED_EDGE('',*,*,#507,.T.);
#427=ORIENTED_EDGE('',*,*,#508,.F.);
#428=CARTESIAN_POINT('',(-1.53613404849387E-12,5.19010587462635,-2243.79808459707));
#429=DIRECTION('',(-2.96059473233375E-13,1.0,-1.57894737676429E-29));
#430=DIRECTION('',(0.0673361583745223,1.99355075779202E-14,0.997730345221273));
#431=ORIENTED_EDGE('',*,*,#456,.T.);
#432=ORIENTED_EDGE('',*,*,#457,.T.);
#433=ORIENTED_EDGE('',*,*,#509,.T.);
#434=ORIENTED_EDGE('',*,*,#463,.F.);
#435=ORIENTED_EDGE('',*,*,#464,.F.);
#436=ORIENTED_EDGE('',*,*,#509,.F.);
#437=CARTESIAN_POINT('',(-6.6382441655905E-13,2.24370587462635,-2243.79808459707));
#438=DIRECTION('',(2.96059473233375E-13,-1.0,1.86327819060632E-29));
#439=DIRECTION('',(-0.0673361583745223,-1.99355075779202E-14,-0.997730345221273));
#440=EDGE_CURVE('',#510,#511,#512,.T.);
#441=EDGE_CURVE('',#511,#513,#514,.T.);
#442=EDGE_CURVE('',#513,#515,#516,.T.);
#443=EDGE_CURVE('',#515,#517,#518,.T.);
#444=EDGE_CURVE('',#517,#519,#520,.T.);
#445=EDGE_CURVE('',#519,#521,#522,.T.);
#446=EDGE_CURVE('',#521,#523,#524,.T.);
#447=EDGE_CURVE('',#523,#525,#526,.T.);
#448=EDGE_CURVE('',#525,#527,#528,.T.);
#449=EDGE_CURVE('',#527,#515,#529,.T.);
#450=EDGE_CURVE('',#513,#510,#530,.T.);
#451=EDGE_CURVE('',#517,#531,#532,.T.);
#452=EDGE_CURVE('',#533,#531,#534,.T.);
#453=EDGE_CURVE('',#533,#527,#535,.T.);
#454=EDGE_CURVE('',#519,#525,#536,.T.);
#455=EDGE_CURVE('',#523,#521,#537,.T.);
#456=EDGE_CURVE('',#538,#539,#540,.T.);
#457=EDGE_CURVE('',#539,#538,#541,.T.);
#458=EDGE_CURVE('',#539,#542,#543,.T.);
#459=EDGE_CURVE('',#544,#542,#545,.T.);
#460=EDGE_CURVE('',#542,#544,#546,.T.);
#461=EDGE_CURVE('',#547,#548,#549,.T.);
#462=EDGE_CURVE('',#548,#547,#550,.T.);
#463=EDGE_CURVE('',#551,#552,#553,.T.);
#464=EDGE_CURVE('',#552,#551,#554,.T.);
#465=EDGE_CURVE('',#555,#556,#557,.T.);
#466=EDGE_CURVE('',#556,#555,#558,.T.);
#467=EDGE_CURVE('',#556,#559,#560,.T.);
#468=EDGE_CURVE('',#559,#561,#562,.T.);
#469=EDGE_CURVE('',#561,#559,#563,.T.);
#470=EDGE_CURVE('',#564,#556,#565,.T.);
#471=EDGE_CURVE('',#548,#566,#567,.T.);
#472=EDGE_CURVE('',#566,#568,#569,.T.);
#473=EDGE_CURVE('',#568,#566,#570,.T.);
#474=EDGE_CURVE('',#571,#572,#573,.T.);
#475=EDGE_CURVE('',#572,#571,#574,.T.);
#476=EDGE_CURVE('',#575,#576,#577,.T.);
#477=EDGE_CURVE('',#576,#575,#578,.T.);
#478=EDGE_CURVE('',#579,#580,#581,.T.);
#479=EDGE_CURVE('',#580,#579,#582,.T.);
#480=EDGE_CURVE('',#579,#576,#583,.T.);
#481=EDGE_CURVE('',#572,#584,#585,.T.);
#482=EDGE_CURVE('',#584,#586,#587,.T.);
#483=EDGE_CURVE('',#586,#584,#588,.T.);
#484=EDGE_CURVE('',#589,#589,#590,.T.);
#485=EDGE_CURVE('',#591,#592,#593,.T.);
#486=EDGE_CURVE('',#592,#591,#594,.T.);
#487=EDGE_CURVE('',#591,#589,#595,.T.);
#488=EDGE_CURVE('',#596,#597,#598,.T.);
#489=EDGE_CURVE('',#597,#596,#599,.T.);
#490=EDGE_CURVE('',#596,#600,#601,.T.);
#491=EDGE_CURVE('',#600,#602,#603,.T.);
#492=EDGE_CURVE('',#602,#600,#604,.T.);
#493=EDGE_CURVE('',#605,#606,#607,.T.);
#494=EDGE_CURVE('',#606,#605,#608,.T.);
#495=EDGE_CURVE('',#606,#602,#609,.T.);
#496=EDGE_CURVE('',#610,#611,#612,.T.);
#497=EDGE_CURVE('',#611,#610,#613,.T.);
#498=EDGE_CURVE('',#611,#511,#614,.T.);
#499=EDGE_CURVE('',#580,#615,#616,.T.);
#500=EDGE_CURVE('',#617,#615,#618,.T.);
#501=EDGE_CURVE('',#615,#617,#619,.T.);
#502=EDGE_CURVE('',#597,#592,#620,.T.);
#503=EDGE_CURVE('',#566,#621,#622,.T.);
#504=EDGE_CURVE('',#623,#621,#624,.T.);
#505=EDGE_CURVE('',#621,#623,#625,.T.);
#506=EDGE_CURVE('',#626,#533,#627,.T.);
#507=EDGE_CURVE('',#531,#626,#628,.T.);
#508=EDGE_CURVE('',#617,#626,#629,.T.);
#509=EDGE_CURVE('',#538,#552,#630,.T.);
#510=VERTEX_POINT('',#631);
#511=VERTEX_POINT('',#632);
#512=CIRCLE('',#633,3.4925);
#513=VERTEX_POINT('',#634);
#514=CIRCLE('',#635,3.4925);
#515=VERTEX_POINT('',#636);
#516=LINE('',#637,#638);
#517=VERTEX_POINT('',#639);
#518=CIRCLE('',#640,3.4925);
#519=VERTEX_POINT('',#641);
#520=B_SPLINE_CURVE_WITH_KNOTS('',3,(#642,#643,#644,#645,#646,#647,#648,#649),.UNSPECIFIED.,.F.,.F.,(4,1,1,1,1,4),(0.0,0.204275267782589,0.404852928821379,0.603271413385526,0.801119580247772,1.0),.UNSPECIFIED.);
#521=VERTEX_POINT('',#650);
#522=LINE('',#651,#652);
#523=VERTEX_POINT('',#653);
#524=B_SPLINE_CURVE_WITH_KNOTS('',3,(#654,#655,#656,#657,#658,#659,#660,#661,#662,#663,#664,#665,#666,#667,#668,#669,#670,#671,#672,#673),.UNSPECIFIED.,.F.,.F.,(4,1,1,1,1,1,1,1,1,1,1,1,1,1,1,1,1,4),(0.0,0.0252184913519456,0.0503345194694361,0.0754956083383793,0.100848493113891,0.126536619690619,0.188486193312469,0.250205283805386,0.31369226735001,0.376158733961992,0.500079298454176,0.623999862946631,0.686452233225189,0.749953321039732,0.811658558250853,0.873621969388634,0.937173614187671,1.0),.UNSPECIFIED.);
#525=VERTEX_POINT('',#674);
#526=LINE('',#675,#676);
#527=VERTEX_POINT('',#677);
#528=B_SPLINE_CURVE_WITH_KNOTS('',3,(#678,#679,#680,#681,#682,#683,#684,#685),.UNSPECIFIED.,.F.,.F.,(4,1,1,1,1,4),(0.0,0.198880419710742,0.396728586551979,0.59514707111606,0.795724732175881,1.0),.UNSPECIFIED.);
#529=CIRCLE('',#686,3.4925);
#530=CIRCLE('',#687,3.4925);
#531=VERTEX_POINT('',#688);
#532=B_SPLINE_CURVE_WITH_KNOTS('',3,(#689,#690,#691,#692,#693,#694),.UNSPECIFIED.,.F.,.F.,(4,1,1,4),(0.0,0.316321669381042,0.648527899420719,1.0),.UNSPECIFIED.);
#533=VERTEX_POINT('',#695);
#534=B_SPLINE_CURVE_WITH_KNOTS('',3,(#696,#697,#698,#699,#700,#701,#702,#703,#704,#705,#706,#707,#708,#709,#710),.UNSPECIFIED.,.F.,.F.,(4,1,1,1,1,1,1,1,1,1,1,1,4),(0.0,0.0525549705941833,0.103797544729687,0.153964684531822,0.203305001847017,0.252075533707152,0.378212567476119,0.500066363321868,0.621899181538654,0.748057220370463,0.829583104647193,0.913181074089361,1.0),.UNSPECIFIED.);
#535=B_SPLINE_CURVE_WITH_KNOTS('',3,(#711,#712,#713,#714,#715,#716),.UNSPECIFIED.,.F.,.F.,(4,2,4),(-0.149600425182857,-0.143007932431821,-0.130421222515616),.UNSPECIFIED.);
#536=CIRCLE('',#717,1.3208);
#537=CIRCLE('',#718,1.3208);
#538=VERTEX_POINT('',#719);
#539=VERTEX_POINT('',#720);
#540=CIRCLE('',#721,0.75184);
#541=CIRCLE('',#722,0.75184);
#542=VERTEX_POINT('',#723);
#543=LINE('',#724,#725);
#544=VERTEX_POINT('',#726);
#545=CIRCLE('',#727,0.87884);
#546=CIRCLE('',#728,0.87884);
#547=VERTEX_POINT('',#729);
#548=VERTEX_POINT('',#730);
#549=B_SPLINE_CURVE_WITH_KNOTS('',3,(#731,#732,#733,#734,#735,#736,#737,#738,#739,#740,#741,#742,#743,#744,#745,#746,#747,#748,#749,#750),.UNSPECIFIED.,.F.,.F.,(4,1,1,1,1,1,1,1,1,1,1,1,1,1,1,1,1,4),(0.0,0.0294556019253871,0.0595427320563801,0.0908398638658812,0.123861816783121,0.185202122524398,0.249968470640731,0.31391914855036,0.376034351098242,0.500034785728098,0.62403522035694,0.686130144298373,0.750101143230716,0.814847014520589,0.876207760291464,0.919803113222524,0.960634194287185,1.0),.UNSPECIFIED.);
#550=B_SPLINE_CURVE_WITH_KNOTS('',3,(#751,#752,#753,#754,#755,#756,#757,#758,#759,#760,#761,#762,#763,#764,#765,#766,#767,#768,#769,#770),.UNSPECIFIED.,.F.,.F.,(4,1,1,1,1,1,1,1,1,1,1,1,1,1,1,1,1,4),(0.0,0.0294556021508104,0.0595427323552047,0.090839864093521,0.123861816808872,0.18520212332927,0.249968470664633,0.313919148949237,0.376034351111863,0.500034785738454,0.624035220365411,0.686130144306506,0.750101143237827,0.814847014650269,0.876207760301581,0.919803113300688,0.96063419436452,1.0),.UNSPECIFIED.);
#551=VERTEX_POINT('',#771);
#552=VERTEX_POINT('',#772);
#553=B_SPLINE_CURVE_WITH_KNOTS('',3,(#773,#774,#775,#776,#777,#778,#779,#780,#781,#782,#783,#784,#785,#786,#787,#788,#789,#790,#791,#792),.UNSPECIFIED.,.F.,.F.,(4,1,1,1,1,1,1,1,1,1,1,1,1,1,1,1,1,4),(0.0,0.029455602124171,0.0595427323199728,0.0908398640658921,0.123861816802645,0.185202123479641,0.249968470666955,0.313919149480993,0.376034351116786,0.500034785744303,0.624035220370065,0.686130144311381,0.750101143235249,0.814847014557815,0.876207760302647,0.919803113320956,0.960634194384975,1.0),.UNSPECIFIED.);
#554=B_SPLINE_CURVE_WITH_KNOTS('',3,(#793,#794,#795,#796,#797,#798,#799,#800,#801,#802,#803,#804,#805,#806,#807,#808,#809,#810,#811,#812),.UNSPECIFIED.,.F.,.F.,(4,1,1,1,1,1,1,1,1,1,1,1,1,1,1,1,1,4),(0.0,0.0294556022595774,0.0595427324993979,0.0908398642025101,0.123861816817983,0.185202123422281,0.249968470663017,0.313919149004066,0.376034351114662,0.500034785739977,0.624035220366123,0.686130144303448,0.750101143227991,0.814847014272552,0.876207760286621,0.919803113149356,0.960634194212657,1.0),.UNSPECIFIED.);
#555=VERTEX_POINT('',#813);
#556=VERTEX_POINT('',#814);
#557=CIRCLE('',#815,0.996949999999999);
#558=CIRCLE('',#816,0.996949999999999);
#559=VERTEX_POINT('',#817);
#560=LINE('',#818,#819);
#561=VERTEX_POINT('',#820);
#562=CIRCLE('',#821,0.996949999999999);
#563=CIRCLE('',#822,0.996949999999999);
#564=VERTEX_POINT('',#823);
#565=LINE('',#824,#825);
#566=VERTEX_POINT('',#826);
#567=LINE('',#827,#828);
#568=VERTEX_POINT('',#829);
#569=CIRCLE('',#830,0.75184);
#570=CIRCLE('',#831,0.75184);
#571=VERTEX_POINT('',#832);
#572=VERTEX_POINT('',#833);
#573=CIRCLE('',#834,3.8608);
#574=CIRCLE('',#835,3.8608);
#575=VERTEX_POINT('',#836);
#576=VERTEX_POINT('',#837);
#577=CIRCLE('',#838,3.9243);
#578=CIRCLE('',#839,3.9243);
#579=VERTEX_POINT('',#840);
#580=VERTEX_POINT('',#841);
#581=CIRCLE('',#842,3.9243);
#582=CIRCLE('',#843,3.9243);
#583=LINE('',#844,#845);
#584=VERTEX_POINT('',#846);
#585=LINE('',#847,#848);
#586=VERTEX_POINT('',#849);
#587=CIRCLE('',#850,3.8608);
#588=CIRCLE('',#851,3.8608);
#589=VERTEX_POINT('',#852);
#590=CIRCLE('',#853,4.699);
#591=VERTEX_POINT('',#854);
#592=VERTEX_POINT('',#855);
#593=CIRCLE('',#856,8.18314719403903);
#594=CIRCLE('',#857,8.18314719403903);
#595=LINE('',#858,#859);
#596=VERTEX_POINT('',#860);
#597=VERTEX_POINT('',#861);
#598=CIRCLE('',#862,8.255);
#599=CIRCLE('',#863,8.255);
#600=VERTEX_POINT('',#864);
#601=LINE('',#865,#866);
#602=VERTEX_POINT('',#867);
#603=CIRCLE('',#868,8.255);
#604=CIRCLE('',#869,8.255);
#605=VERTEX_POINT('',#870);
#606=VERTEX_POINT('',#871);
#607=CIRCLE('',#872,8.0518);
#608=CIRCLE('',#873,8.0518);
#609=CIRCLE('',#874,0.2032);
#610=VERTEX_POINT('',#875);
#611=VERTEX_POINT('',#876);
#612=CIRCLE('',#877,3.2893);
#613=CIRCLE('',#878,3.2893);
#614=CIRCLE('',#879,0.2032);
#615=VERTEX_POINT('',#880);
#616=CIRCLE('',#881,0.381);
#617=VERTEX_POINT('',#882);
#618=CIRCLE('',#883,3.89524574527079);
#619=CIRCLE('',#884,3.89524574527079);
#620=CIRCLE('',#885,0.0762);
#621=VERTEX_POINT('',#886);
#622=LINE('',#887,#888);
#623=VERTEX_POINT('',#889);
#624=CIRCLE('',#890,0.87884);
#625=CIRCLE('',#891,0.87884);
#626=VERTEX_POINT('',#892);
#627=CIRCLE('',#893,3.52155425472921);
#628=CIRCLE('',#894,3.52155425472921);
#629=LINE('',#895,#896);
#630=LINE('',#897,#898);
#631=CARTESIAN_POINT('',(-0.235171533123743,2.44690587462628,-2247.28265782776));
#632=CARTESIAN_POINT('',(-7.24411409414674E-13,2.44690587462635,-2240.30558459707));
#633=AXIS2_PLACEMENT_3D('',#899,#900,#901);
#634=CARTESIAN_POINT('',(0.235171533122295,2.44690587462642,-2240.31351136639));
#635=AXIS2_PLACEMENT_3D('',#902,#903,#904);
#636=CARTESIAN_POINT('',(0.235171533121505,5.11424917708949,-2240.31351136639));
#637=CARTESIAN_POINT('',(0.235171533122355,2.24370587462642,-2240.31351136639));
#638=VECTOR('',#905,1.0);
#639=CARTESIAN_POINT('',(-3.22804684417915,5.11424917708814,-2242.46494176084));
#640=AXIS2_PLACEMENT_3D('',#906,#907,#908);
#641=CARTESIAN_POINT('',(-3.1431046639196,4.58935699302549,-2242.27543909609));
#642=CARTESIAN_POINT('',(-3.22804684417958,5.11424917708846,-2242.46494176084));
#643=CARTESIAN_POINT('',(-3.21995604092661,5.08160877232939,-2242.44565556001));
#644=CARTESIAN_POINT('',(-3.20392088684732,5.01691878999297,-2242.40743225976));
#645=CARTESIAN_POINT('',(-3.18311788076856,4.91428870067317,-2242.36075649348));
#646=CARTESIAN_POINT('',(-3.16571360687905,4.80895615738952,-2242.32285614424));
#647=CARTESIAN_POINT('',(-3.15181773597074,4.70060547468828,-2242.29347916021));
#648=CARTESIAN_POINT('',(-3.14601405482594,4.62650408867618,-2242.28146287257));
#649=CARTESIAN_POINT('',(-3.14310466391959,4.58935699302555,-2242.27543909609));
#650=CARTESIAN_POINT('',(-3.14310466391949,4.21605475622534,-2242.27543909609));
#651=CARTESIAN_POINT('',(-3.1431046639196,4.58935699302549,-2242.27543909609));
#652=VECTOR('',#909,1.0);
#653=CARTESIAN_POINT('',(-3.31919478208119,4.21605475622528,-2244.88459380026));
#654=CARTESIAN_POINT('',(-3.14310466391948,4.21605475622535,-2242.27543909609));
#655=CARTESIAN_POINT('',(-3.14552176095237,4.18453633701602,-2242.28044120339));
#656=CARTESIAN_POINT('',(-3.15034613430459,4.12162755856463,-2242.29042509433));
#657=CARTESIAN_POINT('',(-3.16136896813326,4.02922826943819,-2242.31363888043));
#658=CARTESIAN_POINT('',(-3.17496949102723,3.93881008399918,-2242.34290475611));
#659=CARTESIAN_POINT('',(-3.19124034129748,3.85046120800718,-2242.37887437321));
#660=CARTESIAN_POINT('',(-3.21854394646365,3.72426454320897,-2242.44128079562));
#661=CARTESIAN_POINT('',(-3.26025480848705,3.56845656837389,-2242.54269008946));
#662=CARTESIAN_POINT('',(-3.31769319982081,3.40036800870429,-2242.70187742305));
#663=CARTESIAN_POINT('',(-3.37418189319003,3.2619592206414,-2242.88884022975));
#664=CARTESIAN_POINT('',(-3.440945313625,3.12580227580391,-2243.16877661659));
#665=CARTESIAN_POINT('',(-3.49584246922996,3.05272131339398,-2243.5621542834));
#666=CARTESIAN_POINT('',(-3.49430143810964,3.12579826052337,-2243.95931400925));
#667=CARTESIAN_POINT('',(-3.46575498331058,3.26195132961609,-2244.24569983165));
#668=CARTESIAN_POINT('',(-3.43491767460062,3.40033874580793,-2244.43850114473));
#669=CARTESIAN_POINT('',(-3.39933326047512,3.56846639139466,-2244.6041439033));
#670=CARTESIAN_POINT('',(-3.36480626291155,3.76365925344742,-2244.73651357765));
#671=CARTESIAN_POINT('',(-3.33455429254685,3.98043510045763,-2244.83746990757));
#672=CARTESIAN_POINT('',(-3.32429499352759,4.13781593031396,-2244.86894604785));
#673=CARTESIAN_POINT('',(-3.31919478208078,4.21605475622528,-2244.88459380026));
#674=CARTESIAN_POINT('',(-3.31919478208131,4.58935699302544,-2244.88459380026));
#675=CARTESIAN_POINT('',(-3.31919478208131,4.58935699302544,-2244.88459380026));
#676=VECTOR('',#910,1.0);
#677=CARTESIAN_POINT('',(-3.37790384019997,5.1142491770881,-2244.68539620884));
#678=CARTESIAN_POINT('',(-3.31919478208089,4.58935699302535,-2244.88459380026));
#679=CARTESIAN_POINT('',(-3.32126839499991,4.6265040886685,-2244.87823372416));
#680=CARTESIAN_POINT('',(-3.32540485812491,4.70060547466944,-2244.86554658279));
#681=CARTESIAN_POINT('',(-3.33522742973754,4.80895615735934,-2244.83456885683));
#682=CARTESIAN_POINT('',(-3.34738133293508,4.91428870064282,-2244.79467364586));
#683=CARTESIAN_POINT('',(-3.36172402409107,5.01691878997316,-2244.74562591981));
#684=CARTESIAN_POINT('',(-3.37247782924309,5.08160877232127,-2244.70559465049));
#685=CARTESIAN_POINT('',(-3.37790384019875,5.11424917708783,-2244.68539620884));
#686=AXIS2_PLACEMENT_3D('',#911,#912,#913);
#687=AXIS2_PLACEMENT_3D('',#914,#915,#916);
#688=CARTESIAN_POINT('',(-3.29990943576922,5.26017790073699,-2242.56847405518));
#689=CARTESIAN_POINT('',(-3.22804684417903,5.11424917708876,-2242.46494176084));
#690=CARTESIAN_POINT('',(-3.23312309267296,5.13091800722045,-2242.47560866671));
#691=CARTESIAN_POINT('',(-3.24353050098977,5.16509271745216,-2242.49747813291));
#692=CARTESIAN_POINT('',(-3.26794819102678,5.21402488632144,-2242.53222272525));
#693=CARTESIAN_POINT('',(-3.28905740355415,5.2445072344889,-2242.55616537936));
#694=CARTESIAN_POINT('',(-3.29990943576915,5.2601779007382,-2242.56847405518));
#695=CARTESIAN_POINT('',(-3.43520347077831,5.26017790073695,-2244.57314684191));
#696=CARTESIAN_POINT('',(-3.43520347077682,5.26017790073716,-2244.57314684191));
#697=CARTESIAN_POINT('',(-3.45275794837761,5.28806180112853,-2244.54695202052));
#698=CARTESIAN_POINT('',(-3.48742853525787,5.34313328847574,-2244.49521651171));
#699=CARTESIAN_POINT('',(-3.53489124250477,5.41782966440955,-2244.40914329073));
#700=CARTESIAN_POINT('',(-3.57764320544976,5.48514898285702,-2244.31841567701));
#701=CARTESIAN_POINT('',(-3.6151352687292,5.54463891217313,-2244.22255960392));
#702=CARTESIAN_POINT('',(-3.6640503140608,5.62385530461008,-2244.06892701598));
#703=CARTESIAN_POINT('',(-3.70804340916507,5.70133928735833,-2243.84546938158));
#704=CARTESIAN_POINT('',(-3.71368682376939,5.73440168071123,-2243.54746768379));
#705=CARTESIAN_POINT('',(-3.66804074454948,5.70131943145367,-2243.25290777131));
#706=CARTESIAN_POINT('',(-3.58636337654178,5.61539641980787,-2243.01360062953));
#707=CARTESIAN_POINT('',(-3.49313831784611,5.50718776824177,-2242.82855998467));
#708=CARTESIAN_POINT('',(-3.40185027207267,5.39517283485621,-2242.68643005016));
#709=CARTESIAN_POINT('',(-3.33431519570947,5.30573965464054,-2242.6082850455));
#710=CARTESIAN_POINT('',(-3.29990943576995,5.26017790073684,-2242.56847405518));
#711=CARTESIAN_POINT('',(-3.43520347077827,5.26017790073674,-2244.57314684191));
#712=CARTESIAN_POINT('',(-3.42571100393695,5.24505356331743,-2244.58672594909));
#713=CARTESIAN_POINT('',(-3.41709540494514,5.22938095526127,-2244.60012071668));
#714=CARTESIAN_POINT('',(-3.3950143452107,5.18244974052192,-2244.63817075323));
#715=CARTESIAN_POINT('',(-3.38389441159078,5.14920194632959,-2244.66259072107));
#716=CARTESIAN_POINT('',(-3.37790384020006,5.11424917708782,-2244.68539620884));
#717=AXIS2_PLACEMENT_3D('',#917,#918,#919);
#718=AXIS2_PLACEMENT_3D('',#920,#921,#922);
#719=CARTESIAN_POINT('',(0.0506260173099751,7.85710587462636,-2243.04795101432));
#720=CARTESIAN_POINT('',(-0.0506260173146261,7.85710587462632,-2244.54821817982));
#721=AXIS2_PLACEMENT_3D('',#923,#924,#925);
#722=AXIS2_PLACEMENT_3D('',#926,#927,#928);
#723=CARTESIAN_POINT('',(-0.0591777094282311,7.98410587462636,-2244.67492993367));
#724=CARTESIAN_POINT('',(-0.0591777094282287,7.98410587462633,-2244.67492993367));
#725=VECTOR('',#929,1.0);
#726=CARTESIAN_POINT('',(0.059177709423502,7.98410587462636,-2242.92123926048));
#727=AXIS2_PLACEMENT_3D('',#930,#931,#932);
#728=AXIS2_PLACEMENT_3D('',#933,#934,#935);
#729=CARTESIAN_POINT('',(-0.0506260173134099,3.74799531498949,-2244.54821817982));
#730=CARTESIAN_POINT('',(0.0506260173111915,3.74799531498999,-2243.04795101432));
#731=CARTESIAN_POINT('',(-0.0506260173136421,3.74799531498622,-2244.54821817982));
#732=CARTESIAN_POINT('',(-0.0263488514590636,3.74719708497285,-2244.54916362048));
#733=CARTESIAN_POINT('',(0.0227259827687035,3.74558351089189,-2244.55107477204));
#734=CARTESIAN_POINT('',(0.0966085135097694,3.73293928635177,-2244.54484870513));
#735=CARTESIAN_POINT('',(0.170855032065414,3.71327926267277,-2244.53162684067));
#736=CARTESIAN_POINT('',(0.26509064972183,3.67940817740604,-2244.50448700995));
#737=CARTESIAN_POINT('',(0.375832940874856,3.62778657693497,-2244.45483709897));
#738=CARTESIAN_POINT('',(0.492280795178492,3.56157181777731,-2244.37231649234));
#739=CARTESIAN_POINT('',(0.593347107600933,3.49939153329642,-2244.2677350372));
#740=CARTESIAN_POINT('',(0.699296725739923,3.43136330981791,-2244.10345997973));
#741=CARTESIAN_POINT('',(0.772447417007524,3.38869445383167,-2243.85021690655));
#742=CARTESIAN_POINT('',(0.733990068789042,3.43136155362902,-2243.58945663131));
#743=CARTESIAN_POINT('',(0.651079968214204,3.49938320516614,-2243.41243431806));
#744=CARTESIAN_POINT('',(0.564997813733744,3.56156591736251,-2243.29522240023));
#745=CARTESIAN_POINT('',(0.460670157045104,3.62775008628323,-2243.19782165391));
#746=CARTESIAN_POINT('',(0.350807435752625,3.68292106261683,-2243.12938048941));
#747=CARTESIAN_POINT('',(0.245484528014598,3.7210137242775,-2243.08518730384));
#748=CARTESIAN_POINT('',(0.148782171487053,3.74364391325093,-2243.05833808033));
#749=CARTESIAN_POINT('',(0.0829437580237097,3.74656262364035,-2243.05137093749));
#750=CARTESIAN_POINT('',(0.0506260173110383,3.74799531499208,-2243.04795101432));
#751=CARTESIAN_POINT('',(0.0506260173110383,3.74799531499208,-2243.04795101432));
#752=CARTESIAN_POINT('',(0.0263488512703675,3.74719708498321,-2243.04700557365));
#753=CARTESIAN_POINT('',(-0.0227259832042948,3.74558351091563,-2243.04509442206));
#754=CARTESIAN_POINT('',(-0.0966085141414633,3.73293928639282,-2243.05132048894));
#755=CARTESIAN_POINT('',(-0.17085503254925,3.71327926273588,-2243.06454235339));
#756=CARTESIAN_POINT('',(-0.26509065038311,3.6794081770326,-2243.09168218453));
#757=CARTESIAN_POINT('',(-0.375832941408875,3.62778657668647,-2243.14133209545));
#758=CARTESIAN_POINT('',(-0.492280795870843,3.56157181740437,-2243.22385270236));
#759=CARTESIAN_POINT('',(-0.593347107578255,3.49939153311744,-2243.32843415732));
#760=CARTESIAN_POINT('',(-0.699296725954763,3.43136330979643,-2243.49270921466));
#761=CARTESIAN_POINT('',(-0.77244741696784,3.38869445382111,-2243.74595228762));
#762=CARTESIAN_POINT('',(-0.733990068794181,3.43136155362729,-2244.00671256283));
#763=CARTESIAN_POINT('',(-0.651079968218898,3.4993832051649,-2244.18373487609));
#764=CARTESIAN_POINT('',(-0.564997813666429,3.56156591739116,-2244.30094679399));
#765=CARTESIAN_POINT('',(-0.460670157024095,3.627750086356,-2244.39834754033));
#766=CARTESIAN_POINT('',(-0.350807435635633,3.68292106268948,-2244.46678870483));
#767=CARTESIAN_POINT('',(-0.245484527868218,3.72101372424432,-2244.51098189029));
#768=CARTESIAN_POINT('',(-0.148782171362157,3.74364391323487,-2244.53783111381));
#769=CARTESIAN_POINT('',(-0.0829437579628768,3.74656262363209,-2244.54479825665));
#770=CARTESIAN_POINT('',(-0.0506260173136421,3.74799531498622,-2244.54821817982));
#771=CARTESIAN_POINT('',(-0.0506260173137976,5.05741643426317,-2244.54821817982));
#772=CARTESIAN_POINT('',(0.0506260173108038,5.05741643426273,-2243.04795101432));
#773=CARTESIAN_POINT('',(-0.0506260173140298,5.05741643426644,-2244.54821817982));
#774=CARTESIAN_POINT('',(-0.0748100660106994,5.05821466427891,-2244.5458930053));
#775=CARTESIAN_POINT('',(-0.123696669376969,5.05982823835429,-2244.5411928045));
#776=CARTESIAN_POINT('',(-0.196072634324126,5.07247246288065,-2244.52509584886));
#777=CARTESIAN_POINT('',(-0.26786928410205,5.09213248653249,-2244.50201762799));
#778=CARTESIAN_POINT('',(-0.357603655299586,5.12600357225288,-2244.46246178445));
#779=CARTESIAN_POINT('',(-0.460670407776337,5.17762517252385,-2244.39838204328));
#780=CARTESIAN_POINT('',(-0.564974258220221,5.24383993210899,-2244.30096304997));
#781=CARTESIAN_POINT('',(-0.651071808096013,5.30602021628997,-2244.18375003036));
#782=CARTESIAN_POINT('',(-0.73398755127982,5.37404843953687,-2244.00672857505));
#783=CARTESIAN_POINT('',(-0.77244746348226,5.41671729543459,-2243.74595297708));
#784=CARTESIAN_POINT('',(-0.699301372323418,5.37405019560601,-2243.49272474381));
#785=CARTESIAN_POINT('',(-0.593357230107652,5.30602854411861,-2243.32844807809));
#786=CARTESIAN_POINT('',(-0.492306322387439,5.2438458318887,-2243.22386564625));
#787=CARTESIAN_POINT('',(-0.375837329322855,5.17766166288072,-2243.1413663191));
#788=CARTESIAN_POINT('',(-0.257774667312739,5.12249068658445,-2243.0883076874));
#789=CARTESIAN_POINT('',(-0.147468770317952,5.08439802501101,-2243.05866714674));
#790=CARTESIAN_POINT('',(-0.0480357009744832,5.06176783601533,-2243.04505497284));
#791=CARTESIAN_POINT('',(0.0181418205337468,5.05884912561563,-2243.04699749777));
#792=CARTESIAN_POINT('',(0.0506260173106507,5.05741643426065,-2243.04795101432));
#793=CARTESIAN_POINT('',(0.0506260173106507,5.05741643426065,-2243.04795101432));
#794=CARTESIAN_POINT('',(0.0748100661194842,5.05821466427057,-2243.05027618886));
#795=CARTESIAN_POINT('',(0.12369666963507,5.05982823833824,-2243.05497638966));
#796=CARTESIAN_POINT('',(0.196072634703582,5.07247246285341,-2243.07107334529));
#797=CARTESIAN_POINT('',(0.267869284387093,5.09213248649911,-2243.09415156615));
#798=CARTESIAN_POINT('',(0.35760365530898,5.12600357230639,-2243.13370740976));
#799=CARTESIAN_POINT('',(0.460670407476355,5.17762517267519,-2243.19778715105));
#800=CARTESIAN_POINT('',(0.564974257981903,5.24383993188685,-2243.29520614387));
#801=CARTESIAN_POINT('',(0.651071807983093,5.30602021612002,-2243.41241916343));
#802=CARTESIAN_POINT('',(0.733987551170224,5.37404843947837,-2243.58944061871));
#803=CARTESIAN_POINT('',(0.772447463493239,5.41671729543346,-2243.85021621706));
#804=CARTESIAN_POINT('',(0.6993013723253,5.37405019560522,-2244.10344445034));
#805=CARTESIAN_POINT('',(0.593357230097998,5.30602854412603,-2244.26772111605));
#806=CARTESIAN_POINT('',(0.49230632256012,5.24384583196418,-2244.37230354777));
#807=CARTESIAN_POINT('',(0.37583732940051,5.17766166305451,-2244.45480287485));
#808=CARTESIAN_POINT('',(0.257774667602842,5.12249068675334,-2244.50786150661));
#809=CARTESIAN_POINT('',(0.147468770643162,5.08439802493781,-2244.5375020475));
#810=CARTESIAN_POINT('',(0.0480357012555464,5.06176783598503,-2244.55111422135));
#811=CARTESIAN_POINT('',(-0.0181418203947188,5.05884912561169,-2244.54917169639));
#812=CARTESIAN_POINT('',(-0.0506260173140298,5.05741643426644,-2244.54821817982));
#813=CARTESIAN_POINT('',(2.1503249091615,4.40270587462698,-2244.94242647673));
#814=CARTESIAN_POINT('',(2.28458647534442,4.40270587462702,-2242.95305194139));
#815=AXIS2_PLACEMENT_3D('',#936,#937,#938);
#816=AXIS2_PLACEMENT_3D('',#939,#940,#941);
#817=CARTESIAN_POINT('',(-3.16401893990893,4.40270587462541,-2242.58532918051));
#818=CARTESIAN_POINT('',(-3.16401893990892,4.40270587462541,-2242.58532918051));
#819=VECTOR('',#942,1.0);
#820=CARTESIAN_POINT('',(-3.29828050609188,4.40270587462537,-2244.57470371585));
#821=AXIS2_PLACEMENT_3D('',#943,#944,#945);
#822=AXIS2_PLACEMENT_3D('',#946,#947,#948);
#823=CARTESIAN_POINT('',(2.81512409964301,4.40270587462718,-2243.98807545294));
#824=CARTESIAN_POINT('',(2.28458647534446,4.40270587462702,-2242.95305194139));
#825=VECTOR('',#949,1.0);
#826=CARTESIAN_POINT('',(0.0506260173115993,2.37070587462636,-2243.04795101432));
#827=CARTESIAN_POINT('',(0.0506260173116369,2.24370587462636,-2243.04795101432));
#828=VECTOR('',#950,1.0);
#829=CARTESIAN_POINT('',(-0.0506260173130022,2.37070587462633,-2244.54821817982));
#830=AXIS2_PLACEMENT_3D('',#951,#952,#953);
#831=AXIS2_PLACEMENT_3D('',#954,#955,#956);
#832=CARTESIAN_POINT('',(-0.259971440254275,6.48550587462627,-2247.6501219139));
#833=CARTESIAN_POINT('',(0.259971440250435,6.48550587462642,-2239.94604728024));
#834=AXIS2_PLACEMENT_3D('',#957,#958,#959);
#835=AXIS2_PLACEMENT_3D('',#960,#961,#962);
#836=CARTESIAN_POINT('',(-0.264247286311057,6.48550587462627,-2247.71347779083));
#837=CARTESIAN_POINT('',(0.264247286307217,6.48550587462642,-2239.88269140332));
#838=AXIS2_PLACEMENT_3D('',#963,#964,#965);
#839=AXIS2_PLACEMENT_3D('',#966,#967,#968);
#840=CARTESIAN_POINT('',(0.264247286307271,6.30736257216367,-2239.88269140332));
#841=CARTESIAN_POINT('',(-1.86738906597659E-12,6.30736257216359,-2247.72238459707));
#842=AXIS2_PLACEMENT_3D('',#969,#970,#971);
#843=AXIS2_PLACEMENT_3D('',#972,#973,#974);
#844=CARTESIAN_POINT('',(0.264247286308473,2.24370587462642,-2239.88269140332));
#845=VECTOR('',#975,1.0);
#846=CARTESIAN_POINT('',(0.259971440250323,6.86650587462642,-2239.94604728024));
#847=CARTESIAN_POINT('',(0.259971440251691,2.24370587462642,-2239.94604728024));
#848=VECTOR('',#976,1.0);
#849=CARTESIAN_POINT('',(-0.259971440254388,6.86650587462627,-2247.6501219139));
#850=AXIS2_PLACEMENT_3D('',#977,#978,#979);
#851=AXIS2_PLACEMENT_3D('',#980,#981,#982);
#852=CARTESIAN_POINT('',(-0.316412608203913,6.86650587462625,-2248.48641948927));
#853=AXIS2_PLACEMENT_3D('',#983,#984,#985);
#854=CARTESIAN_POINT('',(-0.551021695461931,7.06559999999984,-2251.96265887198));
#855=CARTESIAN_POINT('',(-2.09239399780609E-12,7.0656,-2251.98123179111));
#856=AXIS2_PLACEMENT_3D('',#986,#987,#988);
#857=AXIS2_PLACEMENT_3D('',#989,#990,#991);
#858=CARTESIAN_POINT('',(-0.316412608203913,6.86650587462625,-2248.48641948927));
#859=VECTOR('',#992,1.0);
#860=CARTESIAN_POINT('',(0.555859987379567,7.14167589568328,-2235.56182059727));
#861=CARTESIAN_POINT('',(-2.11492578683867E-12,7.14167589568311,-2252.05308459707));
#862=AXIS2_PLACEMENT_3D('',#993,#994,#995);
#863=AXIS2_PLACEMENT_3D('',#996,#997,#998);
#864=CARTESIAN_POINT('',(0.555859987379378,7.78090587462651,-2235.56182059727));
#865=CARTESIAN_POINT('',(0.555859987381016,2.24370587462651,-2235.56182059727));
#866=VECTOR('',#999,1.0);
#867=CARTESIAN_POINT('',(-2.30417587767959E-12,7.78090587462635,-2252.05308459707));
#868=AXIS2_PLACEMENT_3D('',#1000,#1001,#1002);
#869=AXIS2_PLACEMENT_3D('',#1003,#1004,#1005);
#870=CARTESIAN_POINT('',(0.542177279997615,7.98410587462651,-2235.76455940342));
#871=CARTESIAN_POINT('',(-2.36431027781765E-12,7.98410587462635,-2251.84988459707));
#872=AXIS2_PLACEMENT_3D('',#1006,#1007,#1008);
#873=AXIS2_PLACEMENT_3D('',#1009,#1010,#1011);
#874=AXIS2_PLACEMENT_3D('',#1012,#1013,#1014);
#875=CARTESIAN_POINT('',(-0.22148882574198,2.24370587462628,-2247.07991902161));
#876=CARTESIAN_POINT('',(-6.64227239630693E-13,2.24370587462635,-2240.50878459707));
#877=AXIS2_PLACEMENT_3D('',#1015,#1016,#1017);
#878=AXIS2_PLACEMENT_3D('',#1018,#1019,#1020);
#879=AXIS2_PLACEMENT_3D('',#1021,#1022,#1023);
#880=CARTESIAN_POINT('',(-1.82418192680349E-12,6.16143384851473,-2247.69333034234));
#881=AXIS2_PLACEMENT_3D('',#1024,#1025,#1026);
#882=CARTESIAN_POINT('',(-0.262290884413062,6.16143384851465,-2247.68448947922));
#883=AXIS2_PLACEMENT_3D('',#1027,#1028,#1029);
#884=AXIS2_PLACEMENT_3D('',#1030,#1031,#1032);
#885=AXIS2_PLACEMENT_3D('',#1033,#1034,#1035);
#886=CARTESIAN_POINT('',(0.0591777094252034,2.24370587462633,-2242.92123926048));
#887=CARTESIAN_POINT('',(0.0506260173115993,2.37070587462636,-2243.04795101432));
#888=VECTOR('',#1036,1.0);
#889=CARTESIAN_POINT('',(-0.0591777094265289,2.24370587462633,-2244.67492993367));
#890=AXIS2_PLACEMENT_3D('',#1037,#1038,#1039);
#891=AXIS2_PLACEMENT_3D('',#1040,#1041,#1042);
#892=CARTESIAN_POINT('',(-0.237127935022466,5.26017790073753,-2247.31164613936));
#893=AXIS2_PLACEMENT_3D('',#1043,#1044,#1045);
#894=AXIS2_PLACEMENT_3D('',#1046,#1047,#1048);
#895=CARTESIAN_POINT('',(-0.235171533124556,5.19010587462628,-2247.28265782776));
#896=VECTOR('',#1049,1.0);
#897=CARTESIAN_POINT('',(0.0506260173116369,2.24370587462636,-2243.04795101432));
#898=VECTOR('',#1050,1.0);
#899=CARTESIAN_POINT('',(-7.23983701520072E-13,2.44690587462635,-2243.79808459707));
#900=DIRECTION('',(-2.96059473233375E-13,1.0,-1.57894737676429E-29));
#901=DIRECTION('',(-0.0673361583745223,-1.99355075779202E-14,-0.997730345221273));
#902=CARTESIAN_POINT('',(-7.23983701520072E-13,2.44690587462635,-2243.79808459707));
#903=DIRECTION('',(-2.96059473233375E-13,1.0,-1.57894737676429E-29));
#904=DIRECTION('',(-0.0673361583745223,-1.99355075779202E-14,-0.997730345221273));
#905=DIRECTION('',(-2.96059473233375E-13,1.0,0.0));
#906=CARTESIAN_POINT('',(-1.51367595457977E-12,5.1142491770891,-2243.79808459707));
#907=DIRECTION('',(2.96059473233375E-13,-1.0,1.57894737676429E-29));
#908=DIRECTION('',(-0.0673361583745223,-1.99355075779202E-14,-0.997730345221273));
#909=DIRECTION('',(2.9591890982787E-13,-1.0,0.0));
#910=DIRECTION('',(-2.95918909827855E-13,1.0,0.0));
#911=CARTESIAN_POINT('',(-1.51367595457977E-12,5.1142491770891,-2243.79808459707));
#912=DIRECTION('',(2.96059473233375E-13,-1.0,1.57894737676429E-29));
#913=DIRECTION('',(-0.0673361583745223,-1.99355075779202E-14,-0.997730345221273));
#914=CARTESIAN_POINT('',(-7.23983701520072E-13,2.44690587462635,-2243.79808459707));
#915=DIRECTION('',(-2.96059473233375E-13,1.0,-1.57894737676429E-29));
#916=DIRECTION('',(-0.0673361583745223,-1.99355075779202E-14,-0.997730345221273));
#917=CARTESIAN_POINT('',(-3.2311497230004,4.40270587462539,-2243.58001644818));
#918=DIRECTION('',(-0.997730345221273,-2.95387520435164E-13,0.0673361583745224));
#919=DIRECTION('',(-0.0673361583745224,-1.99355075779202E-14,-0.997730345221273));
#920=CARTESIAN_POINT('',(-3.2311497230004,4.40270587462539,-2243.58001644818));
#921=DIRECTION('',(-0.997730345221273,-2.95387520435164E-13,0.0673361583745224));
#922=DIRECTION('',(-0.0673361583745224,-1.99355075779202E-14,-0.997730345221273));
#923=CARTESIAN_POINT('',(-2.32572466360728E-12,7.85710587462634,-2243.79808459707));
#924=DIRECTION('',(-2.96059473233375E-13,1.0,-1.86327819060632E-29));
#925=DIRECTION('',(0.0673361583745223,1.99355075779202E-14,0.997730345221273));
#926=CARTESIAN_POINT('',(-2.32572466360728E-12,7.85710587462634,-2243.79808459707));
#927=DIRECTION('',(-2.96059473233375E-13,1.0,-1.86327819060632E-29));
#928=DIRECTION('',(0.0673361583745223,1.99355075779202E-14,0.997730345221273));
#929=DIRECTION('',(-0.0476138542058853,0.707106781186536,-0.705501892901555));
#930=CARTESIAN_POINT('',(-2.36332421670792E-12,7.98410587462635,-2243.79808459707));
#931=DIRECTION('',(2.96059473233375E-13,-1.0,1.55847870386737E-29));
#932=DIRECTION('',(0.0673361583745223,1.99355075779202E-14,0.997730345221273));
#933=CARTESIAN_POINT('',(-2.36332421670792E-12,7.98410587462635,-2243.79808459707));
#934=DIRECTION('',(2.96059473233375E-13,-1.0,1.55847870386737E-29));
#935=DIRECTION('',(0.0673361583745223,1.99355075779202E-14,0.997730345221273));
#936=CARTESIAN_POINT('',(2.21745569225298,4.402705874627,-2243.94773920906));
#937=DIRECTION('',(-0.997730345221273,-2.95387520435164E-13,0.0673361583745223));
#938=DIRECTION('',(-0.0673361583745223,-1.99355075779202E-14,-0.997730345221273));
#939=CARTESIAN_POINT('',(2.21745569225298,4.402705874627,-2243.94773920906));
#940=DIRECTION('',(-0.997730345221273,-2.95387520435164E-13,0.0673361583745223));
#941=DIRECTION('',(-0.0673361583745223,-1.99355075779202E-14,-0.997730345221273));
#942=DIRECTION('',(-0.997730345221273,-2.95387520435164E-13,0.0673361583745223));
#943=CARTESIAN_POINT('',(-3.2311497230004,4.40270587462539,-2243.58001644818));
#944=DIRECTION('',(-0.997730345221273,-2.95387520435164E-13,0.0673361583745223));
#945=DIRECTION('',(-0.0673361583745223,-1.99355075779202E-14,-0.997730345221273));
#946=CARTESIAN_POINT('',(-3.2311497230004,4.40270587462539,-2243.58001644818));
#947=DIRECTION('',(-0.997730345221273,-2.95387520435164E-13,0.0673361583745223));
#948=DIRECTION('',(-0.0673361583745223,-1.99355075779202E-14,-0.997730345221273));
#949=DIRECTION('',(-0.45615076316857,-1.34942781939575E-13,0.889902512222958));
#950=DIRECTION('',(2.96059473233375E-13,-1.0,0.0));
#951=CARTESIAN_POINT('',(-7.01423969659689E-13,2.37070587462635,-2243.79808459707));
#952=DIRECTION('',(2.96059473233375E-13,-1.0,1.86327819060632E-29));
#953=DIRECTION('',(-0.0673361583745223,-1.99355075779202E-14,-0.997730345221273));
#954=CARTESIAN_POINT('',(-7.01423969659689E-13,2.37070587462635,-2243.79808459707));
#955=DIRECTION('',(2.96059473233375E-13,-1.0,1.86327819060632E-29));
#956=DIRECTION('',(-0.0673361583745223,-1.99355075779202E-14,-0.997730345221273));
#957=CARTESIAN_POINT('',(-1.91964949012038E-12,6.48550587462635,-2243.79808459707));
#958=DIRECTION('',(2.96059473233375E-13,-1.0,1.61508688116505E-29));
#959=DIRECTION('',(-0.0673361583745223,-1.99355075779202E-14,-0.997730345221273));
#960=CARTESIAN_POINT('',(-1.91964949012038E-12,6.48550587462635,-2243.79808459707));
#961=DIRECTION('',(2.96059473233375E-13,-1.0,1.61508688116505E-29));
#962=DIRECTION('',(-0.0673361583745223,-1.99355075779202E-14,-0.997730345221273));
#963=CARTESIAN_POINT('',(-1.91964949012038E-12,6.48550587462635,-2243.79808459707));
#964=DIRECTION('',(2.96059473233375E-13,-1.0,1.56324157905499E-29));
#965=DIRECTION('',(-0.0673361583745223,-1.99355075779202E-14,-0.997730345221273));
#966=CARTESIAN_POINT('',(-1.91964949012038E-12,6.48550587462635,-2243.79808459707));
#967=DIRECTION('',(2.96059473233375E-13,-1.0,1.56324157905499E-29));
#968=DIRECTION('',(-0.0673361583745223,-1.99355075779202E-14,-0.997730345221273));
#969=CARTESIAN_POINT('',(-1.8669084778332E-12,6.30736257216359,-2243.79808459707));
#970=DIRECTION('',(-2.96059473233375E-13,1.0,-1.56324157905499E-29));
#971=DIRECTION('',(0.0673361583745223,1.99355075779202E-14,0.997730345221273));
#972=CARTESIAN_POINT('',(-1.8669084778332E-12,6.30736257216359,-2243.79808459707));
#973=DIRECTION('',(-2.96059473233375E-13,1.0,-1.56324157905499E-29));
#974=DIRECTION('',(0.0673361583745223,1.99355075779202E-14,0.997730345221273));
#975=DIRECTION('',(-2.96059473233375E-13,1.0,0.0));
#976=DIRECTION('',(-2.96059473233375E-13,1.0,0.0));
#977=CARTESIAN_POINT('',(-2.0324481494223E-12,6.86650587462634,-2243.79808459707));
#978=DIRECTION('',(2.96059473233375E-13,-1.0,1.61508688116505E-29));
#979=DIRECTION('',(-0.0673361583745223,-1.99355075779202E-14,-0.997730345221273));
#980=CARTESIAN_POINT('',(-2.0324481494223E-12,6.86650587462634,-2243.79808459707));
#981=DIRECTION('',(2.96059473233375E-13,-1.0,1.61508688116505E-29));
#982=DIRECTION('',(-0.0673361583745223,-1.99355075779202E-14,-0.997730345221273));
#983=CARTESIAN_POINT('',(-2.0324481494223E-12,6.86650587462634,-2243.79808459707));
#984=DIRECTION('',(2.96059473233375E-13,-1.0,1.74445427856537E-29));
#985=DIRECTION('',(-0.0673361583745223,-1.99355075779202E-14,-0.997730345221273));
#986=CARTESIAN_POINT('',(-2.09139185130428E-12,7.0656,-2243.79808459707));
#987=DIRECTION('',(2.96059473233375E-13,-1.0,1.43803601786078E-29));
#988=DIRECTION('',(-0.0673361583745223,-1.99355075779202E-14,-0.997730345221273));
#989=CARTESIAN_POINT('',(-2.09139185130428E-12,7.0656,-2243.79808459707));
#990=DIRECTION('',(2.96059473233375E-13,-1.0,1.43803601786078E-29));
#991=DIRECTION('',(-0.0673361583745223,-1.99355075779202E-14,-0.997730345221273));
#992=DIRECTION('',(0.0672264902913731,-0.057049790538493,0.996105376153858));
#993=CARTESIAN_POINT('',(-2.11391484090598E-12,7.14167589568311,-2243.79808459707));
#994=DIRECTION('',(-2.96059473233375E-13,1.0,-1.69573342534153E-29));
#995=DIRECTION('',(0.0673361583745223,1.99355075779202E-14,0.997730345221273));
#996=CARTESIAN_POINT('',(-2.11391484090598E-12,7.14167589568311,-2243.79808459707));
#997=DIRECTION('',(-2.96059473233375E-13,1.0,-1.69573342534153E-29));
#998=DIRECTION('',(0.0673361583745223,1.99355075779202E-14,0.997730345221273));
#999=DIRECTION('',(-2.96059473233375E-13,1.0,0.0));
#1000=CARTESIAN_POINT('',(-2.30316493174689E-12,7.78090587462635,-2243.79808459707));
#1001=DIRECTION('',(2.96059473233375E-13,-1.0,1.69573342534153E-29));
#1002=DIRECTION('',(0.0673361583745223,1.99355075779202E-14,0.997730345221273));
#1003=CARTESIAN_POINT('',(-2.30316493174689E-12,7.78090587462635,-2243.79808459707));
#1004=DIRECTION('',(2.96059473233375E-13,-1.0,1.69573342534153E-29));
#1005=DIRECTION('',(0.0673361583745223,1.99355075779202E-14,0.997730345221273));
#1006=CARTESIAN_POINT('',(-2.36332421670792E-12,7.98410587462635,-2243.79808459707));
#1007=DIRECTION('',(-2.96059473233375E-13,1.0,-8.91201241189081E-30));
#1008=DIRECTION('',(0.0673361583745223,1.99355075779202E-14,0.997730345221273));
#1009=CARTESIAN_POINT('',(-2.36332421670792E-12,7.98410587462635,-2243.79808459707));
#1010=DIRECTION('',(-2.96059473233375E-13,1.0,-8.91201241189081E-30));
#1011=DIRECTION('',(0.0673361583745223,1.99355075779202E-14,0.997730345221273));
#1012=CARTESIAN_POINT('',(-2.30415099285663E-12,7.78090587462635,-2251.84988459707));
#1013=DIRECTION('',(-1.0,-2.96059473233375E-13,1.22464679914759E-16));
#1014=DIRECTION('',(-1.22464679914759E-16,0.0,-1.0));
#1015=CARTESIAN_POINT('',(-6.6382441655905E-13,2.24370587462635,-2243.79808459707));
#1016=DIRECTION('',(2.96059473233375E-13,-1.0,1.78005538629119E-29));
#1017=DIRECTION('',(-0.0673361583745223,-1.99355075779202E-14,-0.997730345221273));
#1018=CARTESIAN_POINT('',(-6.6382441655905E-13,2.24370587462635,-2243.79808459707));
#1019=DIRECTION('',(2.96059473233375E-13,-1.0,1.78005538629119E-29));
#1020=DIRECTION('',(-0.0673361583745223,-1.99355075779202E-14,-0.997730345221273));
#1021=CARTESIAN_POINT('',(-7.24386524591715E-13,2.44690587462635,-2240.50878459707));
#1022=DIRECTION('',(-1.0,-2.96059473233375E-13,-1.22464679914738E-16));
#1023=DIRECTION('',(-1.22464679914738E-16,0.0,1.0));
#1024=CARTESIAN_POINT('',(-1.86734240693355E-12,6.30736257216359,-2247.34138459707));
#1025=DIRECTION('',(-1.0,-2.96059473233375E-13,1.22464679914727E-16));
#1026=DIRECTION('',(-1.22464679914727E-16,0.0,-1.0));
#1027=CARTESIAN_POINT('',(-1.8237048967801E-12,6.16143384851473,-2243.79808459707));
#1028=DIRECTION('',(2.96059473233375E-13,-1.0,1.90397841668367E-29));
#1029=DIRECTION('',(-0.0673361583745223,-1.99355075779202E-14,-0.997730345221273));
#1030=CARTESIAN_POINT('',(-1.8237048967801E-12,6.16143384851473,-2243.79808459707));
#1031=DIRECTION('',(2.96059473233375E-13,-1.0,1.90397841668367E-29));
#1032=DIRECTION('',(-0.0673361583745223,-1.99355075779202E-14,-0.997730345221273));
#1033=CARTESIAN_POINT('',(-2.11491645503007E-12,7.14167589568311,-2251.97688459707));
#1034=DIRECTION('',(-1.0,-2.96059473233375E-13,1.22464679914728E-16));
#1035=DIRECTION('',(-1.22464679914728E-16,0.0,-1.0));
#1036=DIRECTION('',(0.0476138542058848,-0.70710678118654,0.705501892901551));
#1037=CARTESIAN_POINT('',(-6.6382441655905E-13,2.24370587462635,-2243.79808459707));
#1038=DIRECTION('',(-2.96059473233375E-13,1.0,-1.55847870386737E-29));
#1039=DIRECTION('',(-0.0673361583745223,-1.99355075779202E-14,-0.997730345221273));
#1040=CARTESIAN_POINT('',(-6.6382441655905E-13,2.24370587462635,-2243.79808459707));
#1041=DIRECTION('',(-2.96059473233375E-13,1.0,-1.55847870386737E-29));
#1042=DIRECTION('',(-0.0673361583745223,-1.99355075779202E-14,-0.997730345221273));
#1043=CARTESIAN_POINT('',(-1.55687953563287E-12,5.26017790073796,-2243.79808459707));
#1044=DIRECTION('',(-2.96059473233375E-13,1.0,-1.55300093851222E-29));
#1045=DIRECTION('',(0.0673361583745223,1.99355075779202E-14,0.997730345221273));
#1046=CARTESIAN_POINT('',(-1.55687953563287E-12,5.26017790073796,-2243.79808459707));
#1047=DIRECTION('',(-2.96059473233375E-13,1.0,-1.55300093851222E-29));
#1048=DIRECTION('',(0.0673361583745223,1.99355075779202E-14,0.997730345221273));
#1049=DIRECTION('',(0.0257907602286511,-0.923742113571625,0.382145710823836));
#1050=DIRECTION('',(2.96059473233375E-13,-1.0,0.0));
ENDSEC;
END-ISO-10303-21;
