ISO-10303-21;
HEADER;
FILE_DESCRIPTION(('STEP AP203'),'1');
FILE_NAME('rio.stp','2022-08-30T22:43:19',(' '),(' '),'Spatial InterOp 3D',' ',' ');
FILE_SCHEMA(('CONFIG_CONTROL_DESIGN'));
ENDSEC;
DATA;
#1=DESIGN_CONTEXT('',#33,'design');
#2=APPLICATION_PROTOCOL_DEFINITION('INTERNATIONAL STANDARD','config_control_design',1994,#33);
#3=PRODUCT_CATEGORY_RELATIONSHIP('NONE','NONE',#34,#35);
#4=DATE_AND_TIME(#36,#37);
#5=DATE_TIME_ROLE('creation_date');
#6=DATE_TIME_ROLE('classification_date');
#7=PERSON_AND_ORGANIZATION_ROLE('creator');
#8=PERSON_AND_ORGANIZATION_ROLE('design_supplier');
#9=PERSON_AND_ORGANIZATION_ROLE('classification_officer');
#10=PERSON_AND_ORGANIZATION_ROLE('design_owner');
#11=APPROVAL_PERSON_ORGANIZATION(#38,#39,#40);
#12=APPROVAL_DATE_TIME(#4,#39);
#13=CC_DESIGN_APPROVAL(#39,(#41,#42,#43));
#14=CC_DESIGN_DATE_AND_TIME_ASSIGNMENT(#4,#5,(#43));
#15=CC_DESIGN_DATE_AND_TIME_ASSIGNMENT(#4,#6,(#41));
#16=CC_DESIGN_PERSON_AND_ORGANIZATION_ASSIGNMENT(#38,#10,(#44));
#17=CC_DESIGN_PERSON_AND_ORGANIZATION_ASSIGNMENT(#38,#7,(#43));
#18=CC_DESIGN_PERSON_AND_ORGANIZATION_ASSIGNMENT(#38,#7,(#42));
#19=CC_DESIGN_PERSON_AND_ORGANIZATION_ASSIGNMENT(#38,#8,(#42));
#20=CC_DESIGN_SECURITY_CLASSIFICATION(#41,(#42));
#21=CC_DESIGN_PERSON_AND_ORGANIZATION_ASSIGNMENT(#38,#9,(#41));
#22=SHAPE_DEFINITION_REPRESENTATION(#45,#46);
#23= (GEOMETRIC_REPRESENTATION_CONTEXT(3)GLOBAL_UNCERTAINTY_ASSIGNED_CONTEXT((#49))GLOBAL_UNIT_ASSIGNED_CONTEXT((#51,#52,#53))REPRESENTATION_CONTEXT('NONE','WORKSPACE'));
#24=PROPERTY_DEFINITION_REPRESENTATION(#55,#56);
#25=GENERAL_PROPERTY_ASSOCIATION('','',#57,#55);
#26=PROPERTY_DEFINITION_REPRESENTATION(#58,#59);
#27=GENERAL_PROPERTY_ASSOCIATION('','',#60,#58);
#28=PROPERTY_DEFINITION_REPRESENTATION(#61,#62);
#29=GENERAL_PROPERTY_ASSOCIATION('','',#63,#61);
#33=APPLICATION_CONTEXT('CONFIGURATION CONTROLLED 3D DESIGNS OF MECHANICAL PARTS AND ASSEMBLIES');
#34=PRODUCT_CATEGORY('part','NONE');
#35=PRODUCT_RELATED_PRODUCT_CATEGORY('detail',' ',(#44));
#36=CALENDAR_DATE(2022,30,7);
#37=LOCAL_TIME(19,43,19.0,#64);
#38=PERSON_AND_ORGANIZATION(#65,#66);
#39=APPROVAL(#67,'SOLID MODEL');
#40=APPROVAL_ROLE('APPROVED');
#41=SECURITY_CLASSIFICATION('','',#68);
#42=PRODUCT_DEFINITION_FORMATION_WITH_SPECIFIED_SOURCE('A','NONE',#44,.NOT_KNOWN.);
#43=PRODUCT_DEFINITION('','NONE',#42,#1);
#44=PRODUCT('Fixa\X2\00E700E3\X0\o do eixo intermediario v2','','PART--DESC',(#69));
#45=PRODUCT_DEFINITION_SHAPE('NONE','NONE',#43);
#46=ADVANCED_BREP_SHAPE_REPRESENTATION('1',(#70,#71),#23);
#49=UNCERTAINTY_MEASURE_WITH_UNIT(LENGTH_MEASURE(0.001),#51,'','');
#51= (CONVERSION_BASED_UNIT('MILLIMETRE',#74)LENGTH_UNIT()NAMED_UNIT(#77));
#52= (NAMED_UNIT(#79)PLANE_ANGLE_UNIT()SI_UNIT($,.RADIAN.));
#53= (NAMED_UNIT(#79)SOLID_ANGLE_UNIT()SI_UNIT($,.STERADIAN.));
#55=PROPERTY_DEFINITION('PdmObjectId','',#43);
#56=REPRESENTATION('',(#85),#23);
#57=GENERAL_PROPERTY('','19_cf47af61-5ed2-49a5-a520-ccd7ebee1ccf&2_183_0_42','');
#58=PROPERTY_DEFINITION('CreationDate','',#43);
#59=REPRESENTATION('',(#86),#23);
#60=GENERAL_PROPERTY('','04/08/2022 14:45:34','');
#61=PROPERTY_DEFINITION('Minor Revision','',#43);
#62=REPRESENTATION('',(#87),#23);
#63=GENERAL_PROPERTY('','5','');
#64=COORDINATED_UNIVERSAL_TIME_OFFSET(3,0,.BEHIND.);
#65=PERSON('','UNSPECIFIED',$,$,$,$);
#66=ORGANIZATION('UNSPECIFIED','UNSPECIFIED','UNSPECIFIED');
#67=APPROVAL_STATUS('approved');
#68=SECURITY_CLASSIFICATION_LEVEL('unclassified');
#69=MECHANICAL_CONTEXT('',#33,'mechanical');
#70=MANIFOLD_SOLID_BREP('1',#88);
#71=AXIS2_PLACEMENT_3D('',#89,#90,#91);
#74=LENGTH_MEASURE_WITH_UNIT(LENGTH_MEASURE(1.0),#92);
#77=DIMENSIONAL_EXPONENTS(1.0,0.0,0.0,0.0,0.0,0.0,0.0);
#79=DIMENSIONAL_EXPONENTS(0.0,0.0,0.0,0.0,0.0,0.0,0.0);
#85=VALUE_REPRESENTATION_ITEM('19_cf47af61-5ed2-49a5-a520-ccd7ebee1ccf&2_183_0_42',);
#86=VALUE_REPRESENTATION_ITEM('04/08/2022 14:45:34',);
#87=VALUE_REPRESENTATION_ITEM('5',);
#88=CLOSED_SHELL('',(#93,#94,#95,#96,#97,#98,#99,#100,#101,#102,#103));
#89=CARTESIAN_POINT('',(0.0,0.0,0.0));
#90=DIRECTION('',(0.0,0.0,1.0));
#91=DIRECTION('',(1.0,0.0,0.0));
#92= (NAMED_UNIT(#77)LENGTH_UNIT()SI_UNIT(.MILLI.,.METRE.));
#93=ADVANCED_FACE('',(#105),#106,.T.);
#94=ADVANCED_FACE('',(#107,#108),#109,.F.);
#95=ADVANCED_FACE('',(#110),#111,.F.);
#96=ADVANCED_FACE('',(#112),#113,.F.);
#97=ADVANCED_FACE('',(#114),#115,.T.);
#98=ADVANCED_FACE('',(#116,#117),#118,.F.);
#99=ADVANCED_FACE('',(#119),#120,.T.);
#100=ADVANCED_FACE('',(#121),#122,.F.);
#101=ADVANCED_FACE('',(#123,#124),#125,.F.);
#102=ADVANCED_FACE('',(#126,#127),#128,.F.);
#103=ADVANCED_FACE('',(#129,#130,#131),#132,.T.);
#105=FACE_OUTER_BOUND('',#133,.T.);
#106=PLANE('',#134);
#107=FACE_OUTER_BOUND('',#135,.T.);
#108=FACE_OUTER_BOUND('',#136,.T.);
#109=CYLINDRICAL_SURFACE('',#137,1.25);
#110=FACE_OUTER_BOUND('',#138,.T.);
#111=PLANE('',#139);
#112=FACE_OUTER_BOUND('',#140,.T.);
#113=PLANE('',#141);
#114=FACE_OUTER_BOUND('',#142,.T.);
#115=CYLINDRICAL_SURFACE('',#143,2.5);
#116=FACE_OUTER_BOUND('',#144,.T.);
#117=FACE_OUTER_BOUND('',#145,.T.);
#118=CYLINDRICAL_SURFACE('',#146,1.5);
#119=FACE_OUTER_BOUND('',#147,.T.);
#120=CYLINDRICAL_SURFACE('',#148,2.0);
#121=FACE_OUTER_BOUND('',#149,.T.);
#122=PLANE('',#150);
#123=FACE_BOUND('',#151,.T.);
#124=FACE_OUTER_BOUND('',#152,.T.);
#125=PLANE('',#153);
#126=FACE_BOUND('',#154,.T.);
#127=FACE_OUTER_BOUND('',#155,.T.);
#128=PLANE('',#156);
#129=FACE_BOUND('',#157,.T.);
#130=FACE_BOUND('',#158,.T.);
#131=FACE_OUTER_BOUND('',#159,.T.);
#132=PLANE('',#160);
#133=EDGE_LOOP('',(#161,#162,#163,#164));
#134=AXIS2_PLACEMENT_3D('',#165,#166,#167);
#135=EDGE_LOOP('',(#168));
#136=EDGE_LOOP('',(#169));
#137=AXIS2_PLACEMENT_3D('',#170,#171,#172);
#138=EDGE_LOOP('',(#173,#174,#175,#176));
#139=AXIS2_PLACEMENT_3D('',#177,#178,#179);
#140=EDGE_LOOP('',(#180,#181,#182,#183,#184,#185,#186));
#141=AXIS2_PLACEMENT_3D('',#187,#188,#189);
#142=EDGE_LOOP('',(#190,#191,#192,#193));
#143=AXIS2_PLACEMENT_3D('',#194,#195,#196);
#144=EDGE_LOOP('',(#197));
#145=EDGE_LOOP('',(#198));
#146=AXIS2_PLACEMENT_3D('',#199,#200,#201);
#147=EDGE_LOOP('',(#202,#203,#204,#205));
#148=AXIS2_PLACEMENT_3D('',#206,#207,#208);
#149=EDGE_LOOP('',(#209,#210,#211,#212,#213,#214,#215));
#150=AXIS2_PLACEMENT_3D('',#216,#217,#218);
#151=EDGE_LOOP('',(#219));
#152=EDGE_LOOP('',(#220,#221,#222,#223));
#153=AXIS2_PLACEMENT_3D('',#224,#225,#226);
#154=EDGE_LOOP('',(#227));
#155=EDGE_LOOP('',(#228,#229,#230,#231));
#156=AXIS2_PLACEMENT_3D('',#232,#233,#234);
#157=EDGE_LOOP('',(#235));
#158=EDGE_LOOP('',(#236));
#159=EDGE_LOOP('',(#237,#238,#239,#240));
#160=AXIS2_PLACEMENT_3D('',#241,#242,#243);
#161=ORIENTED_EDGE('',*,*,#244,.F.);
#162=ORIENTED_EDGE('',*,*,#245,.F.);
#163=ORIENTED_EDGE('',*,*,#246,.F.);
#164=ORIENTED_EDGE('',*,*,#247,.F.);
#165=CARTESIAN_POINT('',(-43.1,69.0652624290843,-43.1653535421774));
#166=DIRECTION('',(0.707106781186548,-0.462083315857648,0.535237339136574));
#167=DIRECTION('',(-4.51317184084437E-16,-0.756939904095432,-0.653484492232217));
#168=ORIENTED_EDGE('',*,*,#248,.T.);
#169=ORIENTED_EDGE('',*,*,#249,.T.);
#170=CARTESIAN_POINT('',(-45.0,71.6792003980132,-46.1931131585591));
#171=DIRECTION('',(1.0,-6.50465655742774E-16,2.74515354553177E-18));
#172=DIRECTION('',(6.50465655742774E-16,1.0,-1.89384291754689E-18));
#173=ORIENTED_EDGE('',*,*,#250,.F.);
#174=ORIENTED_EDGE('',*,*,#245,.T.);
#175=ORIENTED_EDGE('',*,*,#251,.T.);
#176=ORIENTED_EDGE('',*,*,#252,.T.);
#177=CARTESIAN_POINT('',(-43.1,69.7187469213165,-43.9222934462728));
#178=DIRECTION('',(4.27147133262993E-16,0.653484492232217,-0.756939904095432));
#179=DIRECTION('',(4.90569495551532E-16,0.756939904095432,0.653484492232217));
#180=ORIENTED_EDGE('',*,*,#253,.T.);
#181=ORIENTED_EDGE('',*,*,#254,.T.);
#182=ORIENTED_EDGE('',*,*,#251,.F.);
#183=ORIENTED_EDGE('',*,*,#244,.T.);
#184=ORIENTED_EDGE('',*,*,#255,.T.);
#185=ORIENTED_EDGE('',*,*,#256,.F.);
#186=ORIENTED_EDGE('',*,*,#257,.F.);
#187=CARTESIAN_POINT('',(-45.1,70.2223018018983,-47.563312589532));
#188=DIRECTION('',(4.71950546245257E-16,0.728449298057437,0.685099715486459));
#189=DIRECTION('',(-4.47633539091165E-16,-0.685099715486459,0.728449298057437));
#190=ORIENTED_EDGE('',*,*,#258,.T.);
#191=ORIENTED_EDGE('',*,*,#259,.F.);
#192=ORIENTED_EDGE('',*,*,#260,.F.);
#193=ORIENTED_EDGE('',*,*,#256,.T.);
#194=CARTESIAN_POINT('',(-45.1,64.0000000000119,-37.298191730604));
#195=DIRECTION('',(1.0,-6.50465654403735E-16,2.74515238162105E-18));
#196=DIRECTION('',(-6.50465654403735E-16,-1.0,0.0));
#197=ORIENTED_EDGE('',*,*,#261,.T.);
#198=ORIENTED_EDGE('',*,*,#262,.F.);
#199=CARTESIAN_POINT('',(-45.1,64.0000000000119,-37.2981917306041));
#200=DIRECTION('',(1.0,-6.50465654403735E-16,2.74515238162105E-18));
#201=DIRECTION('',(-6.50465654403735E-16,-1.0,0.0));
#202=ORIENTED_EDGE('',*,*,#263,.T.);
#203=ORIENTED_EDGE('',*,*,#264,.T.);
#204=ORIENTED_EDGE('',*,*,#253,.F.);
#205=ORIENTED_EDGE('',*,*,#265,.F.);
#206=CARTESIAN_POINT('',(-45.1,71.6792003980132,-46.1931131585591));
#207=DIRECTION('',(1.0,-6.50465654403735E-16,2.74515238162105E-18));
#208=DIRECTION('',(-6.50465654403735E-16,-1.0,0.0));
#209=ORIENTED_EDGE('',*,*,#266,.T.);
#210=ORIENTED_EDGE('',*,*,#246,.T.);
#211=ORIENTED_EDGE('',*,*,#250,.T.);
#212=ORIENTED_EDGE('',*,*,#267,.T.);
#213=ORIENTED_EDGE('',*,*,#263,.F.);
#214=ORIENTED_EDGE('',*,*,#268,.F.);
#215=ORIENTED_EDGE('',*,*,#259,.T.);
#216=CARTESIAN_POINT('',(-45.1,73.2473194231975,-44.9517418511515));
#217=DIRECTION('',(-5.08299907249232E-16,-0.784059512592163,-0.620685653703821));
#218=DIRECTION('',(4.05887062753791E-16,0.620685653703821,-0.784059512592163));
#219=ORIENTED_EDGE('',*,*,#262,.T.);
#220=ORIENTED_EDGE('',*,*,#255,.F.);
#221=ORIENTED_EDGE('',*,*,#247,.T.);
#222=ORIENTED_EDGE('',*,*,#266,.F.);
#223=ORIENTED_EDGE('',*,*,#258,.F.);
#224=CARTESIAN_POINT('',(-43.1,64.0000000000119,-37.298191730604));
#225=DIRECTION('',(-1.0,6.50465654403735E-16,-2.74515238162105E-18));
#226=DIRECTION('',(-6.50465654403735E-16,-1.0,0.0));
#227=ORIENTED_EDGE('',*,*,#249,.F.);
#228=ORIENTED_EDGE('',*,*,#254,.F.);
#229=ORIENTED_EDGE('',*,*,#264,.F.);
#230=ORIENTED_EDGE('',*,*,#267,.F.);
#231=ORIENTED_EDGE('',*,*,#252,.F.);
#232=CARTESIAN_POINT('',(-38.0,58.9990578443681,-40.0349999999684));
#233=DIRECTION('',(-1.0,6.52746758015661E-16,-4.85216717025555E-18));
#234=DIRECTION('',(-6.52746758015677E-16,-1.0,3.3446381819994E-12));
#235=ORIENTED_EDGE('',*,*,#248,.F.);
#236=ORIENTED_EDGE('',*,*,#261,.F.);
#237=ORIENTED_EDGE('',*,*,#257,.T.);
#238=ORIENTED_EDGE('',*,*,#260,.T.);
#239=ORIENTED_EDGE('',*,*,#268,.T.);
#240=ORIENTED_EDGE('',*,*,#265,.T.);
#241=CARTESIAN_POINT('',(-45.1,64.0000000000119,-37.298191730604));
#242=DIRECTION('',(-1.0,6.50465654403735E-16,-2.74515238162105E-18));
#243=DIRECTION('',(-6.50465654403735E-16,-1.0,0.0));
#244=EDGE_CURVE('',#269,#270,#271,.F.);
#245=EDGE_CURVE('',#272,#269,#273,.T.);
#246=EDGE_CURVE('',#274,#272,#275,.F.);
#247=EDGE_CURVE('',#270,#274,#276,.T.);
#248=EDGE_CURVE('',#277,#277,#278,.T.);
#249=EDGE_CURVE('',#279,#279,#280,.F.);
#250=EDGE_CURVE('',#272,#281,#282,.T.);
#251=EDGE_CURVE('',#269,#283,#284,.T.);
#252=EDGE_CURVE('',#283,#281,#285,.T.);
#253=EDGE_CURVE('',#286,#287,#288,.T.);
#254=EDGE_CURVE('',#287,#283,#289,.T.);
#255=EDGE_CURVE('',#270,#290,#291,.T.);
#256=EDGE_CURVE('',#292,#290,#293,.T.);
#257=EDGE_CURVE('',#286,#292,#294,.T.);
#258=EDGE_CURVE('',#290,#295,#296,.T.);
#259=EDGE_CURVE('',#297,#295,#298,.T.);
#260=EDGE_CURVE('',#292,#297,#299,.T.);
#261=EDGE_CURVE('',#300,#300,#301,.T.);
#262=EDGE_CURVE('',#302,#302,#303,.T.);
#263=EDGE_CURVE('',#304,#305,#306,.T.);
#264=EDGE_CURVE('',#305,#287,#307,.T.);
#265=EDGE_CURVE('',#304,#286,#308,.T.);
#266=EDGE_CURVE('',#295,#274,#309,.T.);
#267=EDGE_CURVE('',#281,#305,#310,.T.);
#268=EDGE_CURVE('',#297,#304,#311,.T.);
#269=VERTEX_POINT('',#312);
#270=VERTEX_POINT('',#313);
#271=LINE('',#314,#315);
#272=VERTEX_POINT('',#316);
#273=LINE('',#317,#318);
#274=VERTEX_POINT('',#319);
#275=LINE('',#320,#321);
#276=LINE('',#322,#323);
#277=VERTEX_POINT('',#324);
#278=CIRCLE('',#325,1.25);
#279=VERTEX_POINT('',#326);
#280=CIRCLE('',#327,1.25);
#281=VERTEX_POINT('',#328);
#282=LINE('',#329,#330);
#283=VERTEX_POINT('',#331);
#284=LINE('',#332,#333);
#285=LINE('',#334,#335);
#286=VERTEX_POINT('',#336);
#287=VERTEX_POINT('',#337);
#288=LINE('',#338,#339);
#289=LINE('',#340,#341);
#290=VERTEX_POINT('',#342);
#291=LINE('',#343,#344);
#292=VERTEX_POINT('',#345);
#293=LINE('',#346,#347);
#294=LINE('',#348,#349);
#295=VERTEX_POINT('',#350);
#296=CIRCLE('',#351,2.5);
#297=VERTEX_POINT('',#352);
#298=LINE('',#353,#354);
#299=CIRCLE('',#355,2.5);
#300=VERTEX_POINT('',#356);
#301=CIRCLE('',#357,1.5);
#302=VERTEX_POINT('',#358);
#303=CIRCLE('',#359,1.5);
#304=VERTEX_POINT('',#360);
#305=VERTEX_POINT('',#361);
#306=LINE('',#362,#363);
#307=CIRCLE('',#364,2.0);
#308=CIRCLE('',#365,2.0);
#309=LINE('',#366,#367);
#310=LINE('',#368,#369);
#311=LINE('',#370,#371);
#312=CARTESIAN_POINT('',(-42.1,68.1067861990214,-45.3139380516211));
#313=CARTESIAN_POINT('',(-43.1,67.4210654821769,-44.5848284584372));
#314=CARTESIAN_POINT('',(-42.0546943704413,68.1378532077995,-45.3469708207577));
#315=VECTOR('',#372,1.0);
#316=CARTESIAN_POINT('',(-42.1,71.3307076436116,-42.5306488409244));
#317=CARTESIAN_POINT('',(-42.1,68.1067861990214,-45.3139380516211));
#318=VECTOR('',#373,1.0);
#319=CARTESIAN_POINT('',(-43.1,70.7094593759917,-41.7458786259176));
#320=CARTESIAN_POINT('',(-42.0546943704413,71.3588536874884,-42.5662033495743));
#321=VECTOR('',#374,1.0);
#322=CARTESIAN_POINT('',(-43.1,70.6772231513794,-41.773708936829));
#323=VECTOR('',#375,1.0);
#324=CARTESIAN_POINT('',(-45.1,72.9292003980132,-46.1931131585591));
#325=AXIS2_PLACEMENT_3D('',#376,#377,#378);
#326=CARTESIAN_POINT('',(-38.0,70.4292003980132,-46.1931131585591));
#327=AXIS2_PLACEMENT_3D('',#379,#380,#381);
#328=CARTESIAN_POINT('',(-38.0,71.3307076436116,-42.5306488409244));
#329=CARTESIAN_POINT('',(-43.1,71.3307076436116,-42.5306488409244));
#330=VECTOR('',#382,1.0);
#331=CARTESIAN_POINT('',(-38.0,68.1067861990214,-45.3139380516211));
#332=CARTESIAN_POINT('',(-43.1,68.1067861990214,-45.3139380516211));
#333=VECTOR('',#383,1.0);
#334=CARTESIAN_POINT('',(-38.0,69.7187469213165,-43.9222934462728));
#335=VECTOR('',#384,1.0);
#336=CARTESIAN_POINT('',(-45.1,70.2223018018983,-47.563312589532));
#337=CARTESIAN_POINT('',(-38.0,70.2223018018983,-47.563312589532));
#338=CARTESIAN_POINT('',(-45.1,70.2223018018983,-47.563312589532));
#339=VECTOR('',#385,1.0);
#340=CARTESIAN_POINT('',(-38.0,69.1645440004599,-46.4386253205766));
#341=VECTOR('',#386,1.0);
#342=CARTESIAN_POINT('',(-43.1,62.1788767548683,-39.0109410193201));
#343=CARTESIAN_POINT('',(-43.1,70.2223018018983,-47.563312589532));
#344=VECTOR('',#387,1.0);
#345=CARTESIAN_POINT('',(-45.1,62.1788767548683,-39.0109410193201));
#346=CARTESIAN_POINT('',(-45.1,62.1788767548683,-39.0109410193201));
#347=VECTOR('',#388,1.0);
#348=CARTESIAN_POINT('',(-45.1,70.2223018018983,-47.563312589532));
#349=VECTOR('',#389,1.0);
#350=CARTESIAN_POINT('',(-43.1,65.9601487814923,-35.7464775963445));
#351=AXIS2_PLACEMENT_3D('',#390,#391,#392);
#352=CARTESIAN_POINT('',(-45.1,65.9601487814923,-35.7464775963445));
#353=CARTESIAN_POINT('',(-45.1,65.9601487814923,-35.7464775963445));
#354=VECTOR('',#393,1.0);
#355=AXIS2_PLACEMENT_3D('',#394,#395,#396);
#356=CARTESIAN_POINT('',(-45.1,62.5000000000119,-37.2981917306041));
#357=AXIS2_PLACEMENT_3D('',#397,#398,#399);
#358=CARTESIAN_POINT('',(-43.1,62.5000000000119,-37.2981917306041));
#359=AXIS2_PLACEMENT_3D('',#400,#401,#402);
#360=CARTESIAN_POINT('',(-45.1,73.2473194231975,-44.9517418511515));
#361=CARTESIAN_POINT('',(-38.0,73.2473194231975,-44.9517418511515));
#362=CARTESIAN_POINT('',(-45.1,73.2473194231975,-44.9517418511515));
#363=VECTOR('',#403,1.0);
#364=AXIS2_PLACEMENT_3D('',#404,#405,#406);
#365=AXIS2_PLACEMENT_3D('',#407,#408,#409);
#366=CARTESIAN_POINT('',(-43.1,73.2473194231975,-44.9517418511515));
#367=VECTOR('',#410,1.0);
#368=CARTESIAN_POINT('',(-38.0,72.2890135334046,-43.741195346038));
#369=VECTOR('',#411,1.0);
#370=CARTESIAN_POINT('',(-45.1,73.2473194231975,-44.9517418511515));
#371=VECTOR('',#412,1.0);
#372=DIRECTION('',(0.706786379127679,0.484658062551357,-0.515324729353783));
#373=DIRECTION('',(-4.90569495551531E-16,-0.756939904095432,-0.653484492232217));
#374=DIRECTION('',(-0.706786379127679,-0.439089813610442,0.554664898711945));
#375=DIRECTION('',(4.90569495551531E-16,0.756939904095432,0.653484492232217));
#376=CARTESIAN_POINT('',(-45.1,71.6792003980132,-46.1931131585591));
#377=DIRECTION('',(-1.0,6.50465655742774E-16,-2.74515354553177E-18));
#378=DIRECTION('',(6.50465655742774E-16,1.0,-1.89384291754689E-18));
#379=CARTESIAN_POINT('',(-38.0,71.6792003980132,-46.1931131585591));
#380=DIRECTION('',(-1.0,6.52746758015661E-16,-4.85216717025555E-18));
#381=DIRECTION('',(-6.52746758015661E-16,-1.0,0.0));
#382=DIRECTION('',(1.0,-6.50465654403735E-16,2.74515238162105E-18));
#383=DIRECTION('',(1.0,-6.50465654403735E-16,2.74515238162105E-18));
#384=DIRECTION('',(4.90919252411498E-16,0.756939904095432,0.653484492232217));
#385=DIRECTION('',(1.0,-6.50465654403735E-16,2.74515238162105E-18));
#386=DIRECTION('',(-4.50731175970468E-16,-0.685099715486459,0.728449298057437));
#387=DIRECTION('',(-4.47633539091165E-16,-0.685099715486459,0.728449298057437));
#388=DIRECTION('',(1.0,-6.50465654403735E-16,2.74515238162105E-18));
#389=DIRECTION('',(-4.47633539091165E-16,-0.685099715486459,0.728449298057437));
#390=CARTESIAN_POINT('',(-43.1,64.0000000000119,-37.298191730604));
#391=DIRECTION('',(-1.0,6.50465654403735E-16,-2.74515238162105E-18));
#392=DIRECTION('',(-6.50465654403735E-16,-1.0,0.0));
#393=DIRECTION('',(1.0,-6.50465654403735E-16,2.74515238162105E-18));
#394=CARTESIAN_POINT('',(-45.1,64.0000000000119,-37.298191730604));
#395=DIRECTION('',(-1.0,6.50465654403735E-16,-2.74515238162105E-18));
#396=DIRECTION('',(-6.50465654403735E-16,-1.0,0.0));
#397=CARTESIAN_POINT('',(-45.1,64.0000000000119,-37.2981917306041));
#398=DIRECTION('',(-1.0,6.50465654403735E-16,-2.74515238162105E-18));
#399=DIRECTION('',(-6.50465654403735E-16,-1.0,0.0));
#400=CARTESIAN_POINT('',(-43.1,64.0000000000119,-37.2981917306041));
#401=DIRECTION('',(-1.0,6.50465654403735E-16,-2.74515238162105E-18));
#402=DIRECTION('',(-6.50465654403735E-16,-1.0,0.0));
#403=DIRECTION('',(1.0,-6.50465654403735E-16,2.74515238162105E-18));
#404=CARTESIAN_POINT('',(-38.0,71.6792003980131,-46.1931131585591));
#405=DIRECTION('',(-1.0,6.52746758015661E-16,-4.85216717025555E-18));
#406=DIRECTION('',(-6.52746758015661E-16,-1.0,0.0));
#407=CARTESIAN_POINT('',(-45.1,71.6792003980132,-46.1931131585591));
#408=DIRECTION('',(-1.0,6.50465654403735E-16,-2.74515238162105E-18));
#409=DIRECTION('',(-6.50465654403735E-16,-1.0,0.0));
#410=DIRECTION('',(4.05887062753791E-16,0.620685653703821,-0.784059512592163));
#411=DIRECTION('',(4.08954936028527E-16,0.620685653703821,-0.784059512592163));
#412=DIRECTION('',(4.05887062753791E-16,0.620685653703821,-0.784059512592163));
ENDSEC;
END-ISO-10303-21;
