ISO-10303-21;
HEADER;
FILE_DESCRIPTION(('STEP AP203'),'1');
FILE_NAME('Eixo Roller.stp','2022-12-07T18:49:23',(' '),(' '),'Spatial InterOp 3D',' ',' ');
FILE_SCHEMA(('CONFIG_CONTROL_DESIGN'));
ENDSEC;
DATA;
#1=DESIGN_CONTEXT('',#33,'design');
#2=APPLICATION_PROTOCOL_DEFINITION('INTERNATIONAL STANDARD','config_control_design',1994,#33);
#3=PRODUCT_CATEGORY_RELATIONSHIP('NONE','NONE',#34,#35);
#4=DATE_AND_TIME(#36,#37);
#5=DATE_TIME_ROLE('creation_date');
#6=DATE_TIME_ROLE('classification_date');
#7=PERSON_AND_ORGANIZATION_ROLE('creator');
#8=PERSON_AND_ORGANIZATION_ROLE('design_supplier');
#9=PERSON_AND_ORGANIZATION_ROLE('classification_officer');
#10=PERSON_AND_ORGANIZATION_ROLE('design_owner');
#11=APPROVAL_PERSON_ORGANIZATION(#38,#39,#40);
#12=APPROVAL_DATE_TIME(#4,#39);
#13=CC_DESIGN_APPROVAL(#39,(#41,#42,#43));
#14=CC_DESIGN_DATE_AND_TIME_ASSIGNMENT(#4,#5,(#43));
#15=CC_DESIGN_DATE_AND_TIME_ASSIGNMENT(#4,#6,(#41));
#16=CC_DESIGN_PERSON_AND_ORGANIZATION_ASSIGNMENT(#38,#10,(#44));
#17=CC_DESIGN_PERSON_AND_ORGANIZATION_ASSIGNMENT(#38,#7,(#43));
#18=CC_DESIGN_PERSON_AND_ORGANIZATION_ASSIGNMENT(#38,#7,(#42));
#19=CC_DESIGN_PERSON_AND_ORGANIZATION_ASSIGNMENT(#38,#8,(#42));
#20=CC_DESIGN_SECURITY_CLASSIFICATION(#41,(#42));
#21=CC_DESIGN_PERSON_AND_ORGANIZATION_ASSIGNMENT(#38,#9,(#41));
#22=SHAPE_DEFINITION_REPRESENTATION(#45,#46);
#23= (GEOMETRIC_REPRESENTATION_CONTEXT(3)GLOBAL_UNCERTAINTY_ASSIGNED_CONTEXT((#49))GLOBAL_UNIT_ASSIGNED_CONTEXT((#51,#52,#53))REPRESENTATION_CONTEXT('NONE','WORKSPACE'));
#24=PROPERTY_DEFINITION_REPRESENTATION(#55,#56);
#25=GENERAL_PROPERTY_ASSOCIATION('','',#57,#55);
#26=PROPERTY_DEFINITION_REPRESENTATION(#58,#59);
#27=GENERAL_PROPERTY_ASSOCIATION('','',#60,#58);
#28=PROPERTY_DEFINITION_REPRESENTATION(#61,#62);
#29=GENERAL_PROPERTY_ASSOCIATION('','',#63,#61);
#33=APPLICATION_CONTEXT('CONFIGURATION CONTROLLED 3D DESIGNS OF MECHANICAL PARTS AND ASSEMBLIES');
#34=PRODUCT_CATEGORY('part','NONE');
#35=PRODUCT_RELATED_PRODUCT_CATEGORY('detail',' ',(#44));
#36=CALENDAR_DATE(2022,7,11);
#37=LOCAL_TIME(15,49,23.0,#64);
#38=PERSON_AND_ORGANIZATION(#65,#66);
#39=APPROVAL(#67,'SOLID MODEL');
#40=APPROVAL_ROLE('APPROVED');
#41=SECURITY_CLASSIFICATION('','',#68);
#42=PRODUCT_DEFINITION_FORMATION_WITH_SPECIFIED_SOURCE('A','NONE',#44,.NOT_KNOWN.);
#43=PRODUCT_DEFINITION('','NONE',#42,#1);
#44=PRODUCT('Eixo Roller','','1',(#69));
#45=PRODUCT_DEFINITION_SHAPE('NONE','NONE',#43);
#46=ADVANCED_BREP_SHAPE_REPRESENTATION('1',(#70,#71),#23);
#49=UNCERTAINTY_MEASURE_WITH_UNIT(LENGTH_MEASURE(0.001),#51,'','');
#51= (CONVERSION_BASED_UNIT('MILLIMETRE',#74)LENGTH_UNIT()NAMED_UNIT(#77));
#52= (NAMED_UNIT(#79)PLANE_ANGLE_UNIT()SI_UNIT($,.RADIAN.));
#53= (NAMED_UNIT(#79)SOLID_ANGLE_UNIT()SI_UNIT($,.STERADIAN.));
#55=PROPERTY_DEFINITION('PdmObjectId','',#43);
#56=REPRESENTATION('',(#85),#23);
#57=GENERAL_PROPERTY('','19_2d33aa80-3400-4df2-88c1-bd50ab977ea6&2_42_0_5','');
#58=PROPERTY_DEFINITION('CreationDate','',#43);
#59=REPRESENTATION('',(#86),#23);
#60=GENERAL_PROPERTY('','31/03/2022 19:51:08','');
#61=PROPERTY_DEFINITION('Minor Revision','',#43);
#62=REPRESENTATION('',(#87),#23);
#63=GENERAL_PROPERTY('','4','');
#64=COORDINATED_UNIVERSAL_TIME_OFFSET(3,0,.BEHIND.);
#65=PERSON('','UNSPECIFIED',$,$,$,$);
#66=ORGANIZATION('UNSPECIFIED','UNSPECIFIED','UNSPECIFIED');
#67=APPROVAL_STATUS('approved');
#68=SECURITY_CLASSIFICATION_LEVEL('unclassified');
#69=MECHANICAL_CONTEXT('',#33,'mechanical');
#70=MANIFOLD_SOLID_BREP('1',#88);
#71=AXIS2_PLACEMENT_3D('',#89,#90,#91);
#74=LENGTH_MEASURE_WITH_UNIT(LENGTH_MEASURE(1.0),#92);
#77=DIMENSIONAL_EXPONENTS(1.0,0.0,0.0,0.0,0.0,0.0,0.0);
#79=DIMENSIONAL_EXPONENTS(0.0,0.0,0.0,0.0,0.0,0.0,0.0);
#85=VALUE_REPRESENTATION_ITEM('19_2d33aa80-3400-4df2-88c1-bd50ab977ea6&2_42_0_5',);
#86=VALUE_REPRESENTATION_ITEM('31/03/2022 19:51:08',);
#87=VALUE_REPRESENTATION_ITEM('4',);
#88=CLOSED_SHELL('',(#93,#94,#95,#96,#97,#98,#99));
#89=CARTESIAN_POINT('',(0.0,0.0,0.0));
#90=DIRECTION('',(0.0,0.0,1.0));
#91=DIRECTION('',(1.0,0.0,0.0));
#92= (NAMED_UNIT(#77)LENGTH_UNIT()SI_UNIT(.MILLI.,.METRE.));
#93=ADVANCED_FACE('',(#101,#102),#103,.T.);
#94=ADVANCED_FACE('',(#104,#105),#106,.F.);
#95=ADVANCED_FACE('',(#107),#108,.F.);
#96=ADVANCED_FACE('',(#109,#110),#111,.T.);
#97=ADVANCED_FACE('',(#112,#113),#114,.T.);
#98=ADVANCED_FACE('',(#115),#116,.F.);
#99=ADVANCED_FACE('',(#117,#118),#119,.T.);
#101=FACE_OUTER_BOUND('',#120,.T.);
#102=FACE_OUTER_BOUND('',#121,.T.);
#103=CYLINDRICAL_SURFACE('',#122,2.25);
#104=FACE_BOUND('',#123,.T.);
#105=FACE_OUTER_BOUND('',#124,.T.);
#106=PLANE('',#125);
#107=FACE_OUTER_BOUND('',#126,.T.);
#108=PLANE('',#127);
#109=FACE_OUTER_BOUND('',#128,.T.);
#110=FACE_OUTER_BOUND('',#129,.T.);
#111=CYLINDRICAL_SURFACE('',#130,2.0);
#112=FACE_OUTER_BOUND('',#131,.T.);
#113=FACE_OUTER_BOUND('',#132,.T.);
#114=CYLINDRICAL_SURFACE('',#133,2.0);
#115=FACE_OUTER_BOUND('',#134,.T.);
#116=PLANE('',#135);
#117=FACE_BOUND('',#136,.T.);
#118=FACE_OUTER_BOUND('',#137,.T.);
#119=PLANE('',#138);
#120=EDGE_LOOP('',(#139));
#121=EDGE_LOOP('',(#140));
#122=AXIS2_PLACEMENT_3D('',#141,#142,#143);
#123=EDGE_LOOP('',(#144));
#124=EDGE_LOOP('',(#145));
#125=AXIS2_PLACEMENT_3D('',#146,#147,#148);
#126=EDGE_LOOP('',(#149));
#127=AXIS2_PLACEMENT_3D('',#150,#151,#152);
#128=EDGE_LOOP('',(#153));
#129=EDGE_LOOP('',(#154));
#130=AXIS2_PLACEMENT_3D('',#155,#156,#157);
#131=EDGE_LOOP('',(#158));
#132=EDGE_LOOP('',(#159));
#133=AXIS2_PLACEMENT_3D('',#160,#161,#162);
#134=EDGE_LOOP('',(#163));
#135=AXIS2_PLACEMENT_3D('',#164,#165,#166);
#136=EDGE_LOOP('',(#167));
#137=EDGE_LOOP('',(#168));
#138=AXIS2_PLACEMENT_3D('',#169,#170,#171);
#139=ORIENTED_EDGE('',*,*,#172,.T.);
#140=ORIENTED_EDGE('',*,*,#173,.F.);
#141=CARTESIAN_POINT('',(-2.16840434497101E-16,3.0,0.0));
#142=DIRECTION('',(-6.12303176911189E-17,1.0,0.0));
#143=DIRECTION('',(-1.0,-6.12303176911189E-17,0.0));
#144=ORIENTED_EDGE('',*,*,#174,.T.);
#145=ORIENTED_EDGE('',*,*,#172,.F.);
#146=CARTESIAN_POINT('',(-2.16840434497101E-16,3.0,0.0));
#147=DIRECTION('',(-6.12303176911189E-17,1.0,0.0));
#148=DIRECTION('',(-1.0,-6.12303176911189E-17,0.0));
#149=ORIENTED_EDGE('',*,*,#175,.F.);
#150=CARTESIAN_POINT('',(0.95,0.0,0.0));
#151=DIRECTION('',(-6.12303176911189E-17,1.0,0.0));
#152=DIRECTION('',(1.0,6.12303176911189E-17,0.0));
#153=ORIENTED_EDGE('',*,*,#175,.T.);
#154=ORIENTED_EDGE('',*,*,#174,.F.);
#155=CARTESIAN_POINT('',(-4.87890977618477E-15,79.0,0.0));
#156=DIRECTION('',(6.12303176911189E-17,-1.0,0.0));
#157=DIRECTION('',(-1.0,-6.12303176911189E-17,0.0));
#158=ORIENTED_EDGE('',*,*,#176,.T.);
#159=ORIENTED_EDGE('',*,*,#177,.F.);
#160=CARTESIAN_POINT('',(-4.87890977618477E-15,79.0,0.0));
#161=DIRECTION('',(6.12303176911189E-17,-1.0,0.0));
#162=DIRECTION('',(-1.0,-6.12303176911189E-17,0.0));
#163=ORIENTED_EDGE('',*,*,#177,.T.);
#164=CARTESIAN_POINT('',(0.95,79.0,0.0));
#165=DIRECTION('',(6.12303176911189E-17,-1.0,0.0));
#166=DIRECTION('',(0.0,0.0,-1.0));
#167=ORIENTED_EDGE('',*,*,#176,.F.);
#168=ORIENTED_EDGE('',*,*,#173,.T.);
#169=CARTESIAN_POINT('',(-4.25804140211095E-15,69.0,0.0));
#170=DIRECTION('',(-6.12303176911189E-17,1.0,0.0));
#171=DIRECTION('',(-1.0,-6.12303176911189E-17,0.0));
#172=EDGE_CURVE('',#178,#178,#179,.T.);
#173=EDGE_CURVE('',#180,#180,#181,.T.);
#174=EDGE_CURVE('',#182,#182,#183,.T.);
#175=EDGE_CURVE('',#184,#184,#185,.T.);
#176=EDGE_CURVE('',#186,#186,#187,.T.);
#177=EDGE_CURVE('',#188,#188,#189,.T.);
#178=VERTEX_POINT('',#190);
#179=CIRCLE('',#191,2.25);
#180=VERTEX_POINT('',#192);
#181=CIRCLE('',#193,2.25);
#182=VERTEX_POINT('',#194);
#183=CIRCLE('',#195,2.0);
#184=VERTEX_POINT('',#196);
#185=CIRCLE('',#197,2.0);
#186=VERTEX_POINT('',#198);
#187=CIRCLE('',#199,2.0);
#188=VERTEX_POINT('',#200);
#189=CIRCLE('',#201,2.0);
#190=CARTESIAN_POINT('',(-2.25,3.0,0.0));
#191=AXIS2_PLACEMENT_3D('',#202,#203,#204);
#192=CARTESIAN_POINT('',(-2.25,69.0,0.0));
#193=AXIS2_PLACEMENT_3D('',#205,#206,#207);
#194=CARTESIAN_POINT('',(-2.0,3.0,0.0));
#195=AXIS2_PLACEMENT_3D('',#208,#209,#210);
#196=CARTESIAN_POINT('',(-2.0,-1.22460635382238E-16,0.0));
#197=AXIS2_PLACEMENT_3D('',#211,#212,#213);
#198=CARTESIAN_POINT('',(-2.0,69.0,0.0));
#199=AXIS2_PLACEMENT_3D('',#214,#215,#216);
#200=CARTESIAN_POINT('',(-2.0,79.0,0.0));
#201=AXIS2_PLACEMENT_3D('',#217,#218,#219);
#202=CARTESIAN_POINT('',(-2.16840434497101E-16,3.0,0.0));
#203=DIRECTION('',(-6.12303176911189E-17,1.0,0.0));
#204=DIRECTION('',(-1.0,-6.12303176911189E-17,0.0));
#205=CARTESIAN_POINT('',(-4.25804140211095E-15,69.0,0.0));
#206=DIRECTION('',(-6.12303176911189E-17,1.0,0.0));
#207=DIRECTION('',(-1.0,-6.12303176911189E-17,0.0));
#208=CARTESIAN_POINT('',(-2.25405631659734E-16,3.0,0.0));
#209=DIRECTION('',(-6.12303176911189E-17,1.0,0.0));
#210=DIRECTION('',(-1.0,-6.12303176911189E-17,0.0));
#211=CARTESIAN_POINT('',(-4.17146785863772E-17,0.0,0.0));
#212=DIRECTION('',(-6.12303176911189E-17,1.0,0.0));
#213=DIRECTION('',(-1.0,-6.12303176911189E-17,0.0));
#214=CARTESIAN_POINT('',(-4.26660659927358E-15,69.0,0.0));
#215=DIRECTION('',(-6.12303176911189E-17,1.0,0.0));
#216=DIRECTION('',(-1.0,-6.12303176911189E-17,0.0));
#217=CARTESIAN_POINT('',(-4.87890977618477E-15,79.0,0.0));
#218=DIRECTION('',(-6.12303176911189E-17,1.0,0.0));
#219=DIRECTION('',(-1.0,-6.12303176911189E-17,0.0));
ENDSEC;
END-ISO-10303-21;
