ISO-10303-21;
HEADER;
/* Generated by software containing ST-Developer
 * from STEP Tools, Inc. (www.steptools.com) 
 */

FILE_DESCRIPTION(
/* description */ (''),
/* implementation_level */ '2;1');

FILE_NAME(
/* name */ 
'C:\\Users\\gabriel\\Desktop\\RoboFei 2023\\Desenhos\\STEP''s\\Conjunt
o Inferior\\RBF22.P110-1 Corpo do \X\CAmbolo.stp',
/* time_stamp */ '2022-12-07T17:33:11-03:00',
/* author */ ('gabriel'),
/* organization */ (''),
/* preprocessor_version */ 'ST-DEVELOPER v19',
/* originating_system */ 'Autodesk Inventor 2023',
/* authorisation */ '');

FILE_SCHEMA (('AUTOMOTIVE_DESIGN { 1 0 10303 214 3 1 1 }'));
ENDSEC;

DATA;
#10=MECHANICAL_DESIGN_GEOMETRIC_PRESENTATION_REPRESENTATION('',(#13),#254);
#11=SHAPE_REPRESENTATION_RELATIONSHIP('SRR','None',#261,#12);
#12=ADVANCED_BREP_SHAPE_REPRESENTATION('',(#14),#253);
#13=STYLED_ITEM('',(#270),#14);
#14=MANIFOLD_SOLID_BREP('Solid1',#131);
#15=FACE_BOUND('',#37,.T.);
#16=FACE_BOUND('',#42,.T.);
#17=PLANE('',#163);
#18=PLANE('',#168);
#19=PLANE('',#171);
#20=CYLINDRICAL_SURFACE('',#156,2.067);
#21=CYLINDRICAL_SURFACE('',#161,7.);
#22=CYLINDRICAL_SURFACE('',#169,12.5);
#23=FACE_OUTER_BOUND('',#32,.T.);
#24=FACE_OUTER_BOUND('',#33,.T.);
#25=FACE_OUTER_BOUND('',#34,.T.);
#26=FACE_OUTER_BOUND('',#35,.T.);
#27=FACE_OUTER_BOUND('',#36,.T.);
#28=FACE_OUTER_BOUND('',#38,.T.);
#29=FACE_OUTER_BOUND('',#39,.T.);
#30=FACE_OUTER_BOUND('',#40,.T.);
#31=FACE_OUTER_BOUND('',#41,.T.);
#32=EDGE_LOOP('',(#89,#90,#91));
#33=EDGE_LOOP('',(#92,#93,#94,#95));
#34=EDGE_LOOP('',(#96,#97,#98,#99));
#35=EDGE_LOOP('',(#100,#101,#102,#103));
#36=EDGE_LOOP('',(#104));
#37=EDGE_LOOP('',(#105));
#38=EDGE_LOOP('',(#106,#107,#108,#109,#110));
#39=EDGE_LOOP('',(#111));
#40=EDGE_LOOP('',(#112,#113,#114,#115,#116));
#41=EDGE_LOOP('',(#117));
#42=EDGE_LOOP('',(#118));
#43=LINE('',#221,#49);
#44=LINE('',#225,#50);
#45=LINE('',#230,#51);
#46=LINE('',#235,#52);
#47=LINE('',#241,#53);
#48=LINE('',#248,#54);
#49=VECTOR('',#178,1.0335);
#50=VECTOR('',#183,2.067);
#51=VECTOR('',#188,4.575);
#52=VECTOR('',#195,7.);
#53=VECTOR('',#202,11.5);
#54=VECTOR('',#211,12.5);
#55=CIRCLE('',#155,2.067);
#56=CIRCLE('',#157,2.067);
#57=CIRCLE('',#159,2.15);
#58=CIRCLE('',#160,7.);
#59=CIRCLE('',#162,7.);
#60=CIRCLE('',#165,10.5);
#61=CIRCLE('',#166,12.5);
#62=CIRCLE('',#167,12.5);
#63=CIRCLE('',#170,12.5);
#64=VERTEX_POINT('',#218);
#65=VERTEX_POINT('',#220);
#66=VERTEX_POINT('',#223);
#67=VERTEX_POINT('',#227);
#68=VERTEX_POINT('',#229);
#69=VERTEX_POINT('',#233);
#70=VERTEX_POINT('',#238);
#71=VERTEX_POINT('',#240);
#72=VERTEX_POINT('',#242);
#73=VERTEX_POINT('',#247);
#74=EDGE_CURVE('',#64,#64,#55,.T.);
#75=EDGE_CURVE('',#64,#65,#43,.T.);
#76=EDGE_CURVE('',#66,#66,#56,.T.);
#77=EDGE_CURVE('',#66,#64,#44,.T.);
#78=EDGE_CURVE('',#67,#67,#57,.T.);
#79=EDGE_CURVE('',#67,#68,#45,.T.);
#80=EDGE_CURVE('',#68,#68,#58,.T.);
#81=EDGE_CURVE('',#69,#69,#59,.T.);
#82=EDGE_CURVE('',#69,#68,#46,.T.);
#83=EDGE_CURVE('',#70,#70,#60,.T.);
#84=EDGE_CURVE('',#70,#71,#47,.T.);
#85=EDGE_CURVE('',#71,#72,#61,.T.);
#86=EDGE_CURVE('',#72,#71,#62,.T.);
#87=EDGE_CURVE('',#72,#73,#48,.T.);
#88=EDGE_CURVE('',#73,#73,#63,.T.);
#89=ORIENTED_EDGE('',*,*,#74,.T.);
#90=ORIENTED_EDGE('',*,*,#75,.T.);
#91=ORIENTED_EDGE('',*,*,#75,.F.);
#92=ORIENTED_EDGE('',*,*,#76,.F.);
#93=ORIENTED_EDGE('',*,*,#77,.T.);
#94=ORIENTED_EDGE('',*,*,#74,.F.);
#95=ORIENTED_EDGE('',*,*,#77,.F.);
#96=ORIENTED_EDGE('',*,*,#78,.T.);
#97=ORIENTED_EDGE('',*,*,#79,.T.);
#98=ORIENTED_EDGE('',*,*,#80,.T.);
#99=ORIENTED_EDGE('',*,*,#79,.F.);
#100=ORIENTED_EDGE('',*,*,#81,.T.);
#101=ORIENTED_EDGE('',*,*,#82,.T.);
#102=ORIENTED_EDGE('',*,*,#80,.F.);
#103=ORIENTED_EDGE('',*,*,#82,.F.);
#104=ORIENTED_EDGE('',*,*,#78,.F.);
#105=ORIENTED_EDGE('',*,*,#76,.T.);
#106=ORIENTED_EDGE('',*,*,#83,.T.);
#107=ORIENTED_EDGE('',*,*,#84,.T.);
#108=ORIENTED_EDGE('',*,*,#85,.T.);
#109=ORIENTED_EDGE('',*,*,#86,.T.);
#110=ORIENTED_EDGE('',*,*,#84,.F.);
#111=ORIENTED_EDGE('',*,*,#83,.F.);
#112=ORIENTED_EDGE('',*,*,#85,.F.);
#113=ORIENTED_EDGE('',*,*,#86,.F.);
#114=ORIENTED_EDGE('',*,*,#87,.T.);
#115=ORIENTED_EDGE('',*,*,#88,.T.);
#116=ORIENTED_EDGE('',*,*,#87,.F.);
#117=ORIENTED_EDGE('',*,*,#88,.F.);
#118=ORIENTED_EDGE('',*,*,#81,.F.);
#119=CONICAL_SURFACE('',#154,1.0335,1.02974425867665);
#120=CONICAL_SURFACE('',#158,4.575,1.0471975511966);
#121=CONICAL_SURFACE('',#164,11.5,0.785398163397449);
#122=ADVANCED_FACE('',(#23),#119,.F.);
#123=ADVANCED_FACE('',(#24),#20,.F.);
#124=ADVANCED_FACE('',(#25),#120,.T.);
#125=ADVANCED_FACE('',(#26),#21,.T.);
#126=ADVANCED_FACE('',(#27,#15),#17,.T.);
#127=ADVANCED_FACE('',(#28),#121,.T.);
#128=ADVANCED_FACE('',(#29),#18,.T.);
#129=ADVANCED_FACE('',(#30),#22,.T.);
#130=ADVANCED_FACE('',(#31,#16),#19,.F.);
#131=CLOSED_SHELL('',(#122,#123,#124,#125,#126,#127,#128,#129,#130));
#132=DERIVED_UNIT_ELEMENT(#135,1.);
#133=DERIVED_UNIT_ELEMENT(#256,-3.);
#134=DIMENSIONAL_EXPONENTS(1.,0.,0.,0.,0.,0.,0.);
#135=(
CONVERSION_BASED_UNIT('gram',#137)
MASS_UNIT()
NAMED_UNIT(#134)
);
#136=(
MASS_UNIT()
NAMED_UNIT(*)
SI_UNIT(.KILO.,.GRAM.)
);
#137=MASS_MEASURE_WITH_UNIT(MASS_MEASURE(0.001),#136);
#138=DERIVED_UNIT((#132,#133));
#139=MEASURE_REPRESENTATION_ITEM('density measure',
POSITIVE_RATIO_MEASURE(7.85),#138);
#140=PROPERTY_DEFINITION_REPRESENTATION(#145,#142);
#141=PROPERTY_DEFINITION_REPRESENTATION(#146,#143);
#142=REPRESENTATION('material name',(#144),#253);
#143=REPRESENTATION('density',(#139),#253);
#144=DESCRIPTIVE_REPRESENTATION_ITEM('A\X\E7o','A\X\E7o');
#145=PROPERTY_DEFINITION('material property','material name',#263);
#146=PROPERTY_DEFINITION('material property','density of part',#263);
#147=DATE_TIME_ROLE('creation_date');
#148=APPLIED_DATE_AND_TIME_ASSIGNMENT(#149,#147,(#263));
#149=DATE_AND_TIME(#150,#151);
#150=CALENDAR_DATE(2011,2,5);
#151=LOCAL_TIME(0,0,0.,#152);
#152=COORDINATED_UNIVERSAL_TIME_OFFSET(0,0,.BEHIND.);
#153=AXIS2_PLACEMENT_3D('placement',#216,#172,#173);
#154=AXIS2_PLACEMENT_3D('',#217,#174,#175);
#155=AXIS2_PLACEMENT_3D('',#219,#176,#177);
#156=AXIS2_PLACEMENT_3D('',#222,#179,#180);
#157=AXIS2_PLACEMENT_3D('',#224,#181,#182);
#158=AXIS2_PLACEMENT_3D('',#226,#184,#185);
#159=AXIS2_PLACEMENT_3D('',#228,#186,#187);
#160=AXIS2_PLACEMENT_3D('',#231,#189,#190);
#161=AXIS2_PLACEMENT_3D('',#232,#191,#192);
#162=AXIS2_PLACEMENT_3D('',#234,#193,#194);
#163=AXIS2_PLACEMENT_3D('',#236,#196,#197);
#164=AXIS2_PLACEMENT_3D('',#237,#198,#199);
#165=AXIS2_PLACEMENT_3D('',#239,#200,#201);
#166=AXIS2_PLACEMENT_3D('',#243,#203,#204);
#167=AXIS2_PLACEMENT_3D('',#244,#205,#206);
#168=AXIS2_PLACEMENT_3D('',#245,#207,#208);
#169=AXIS2_PLACEMENT_3D('',#246,#209,#210);
#170=AXIS2_PLACEMENT_3D('',#249,#212,#213);
#171=AXIS2_PLACEMENT_3D('',#250,#214,#215);
#172=DIRECTION('axis',(0.,0.,1.));
#173=DIRECTION('refdir',(1.,0.,0.));
#174=DIRECTION('center_axis',(1.,1.36642833800019E-16,0.));
#175=DIRECTION('ref_axis',(0.,0.,-1.));
#176=DIRECTION('center_axis',(1.,1.36642833800019E-16,0.));
#177=DIRECTION('ref_axis',(0.,0.,-1.));
#178=DIRECTION('',(-0.515038074910054,3.45964570432455E-17,-0.857167300702112));
#179=DIRECTION('center_axis',(1.,1.36642833800019E-16,0.));
#180=DIRECTION('ref_axis',(0.,0.,-1.));
#181=DIRECTION('center_axis',(-1.,-1.36642833800019E-16,0.));
#182=DIRECTION('ref_axis',(0.,0.,-1.));
#183=DIRECTION('',(-1.,-1.36642833800019E-16,0.));
#184=DIRECTION('center_axis',(-1.,0.,0.));
#185=DIRECTION('ref_axis',(0.,0.,1.));
#186=DIRECTION('center_axis',(-1.,-1.36642833800019E-16,0.));
#187=DIRECTION('ref_axis',(0.,0.,1.));
#188=DIRECTION('',(-0.5,1.06057523872491E-16,-0.866025403784439));
#189=DIRECTION('center_axis',(1.,1.36642833800019E-16,0.));
#190=DIRECTION('ref_axis',(0.,0.,1.));
#191=DIRECTION('center_axis',(-1.,-1.45603019622971E-16,0.));
#192=DIRECTION('ref_axis',(0.,0.,1.));
#193=DIRECTION('center_axis',(1.,1.36642833800019E-16,0.));
#194=DIRECTION('ref_axis',(0.,0.,1.));
#195=DIRECTION('',(1.,1.45603019622971E-16,0.));
#196=DIRECTION('center_axis',(1.,1.36642833800019E-16,0.));
#197=DIRECTION('ref_axis',(0.,0.,-1.));
#198=DIRECTION('center_axis',(1.,0.,0.));
#199=DIRECTION('ref_axis',(-6.23804241260957E-17,1.,0.));
#200=DIRECTION('center_axis',(1.,1.36642833800019E-16,0.));
#201=DIRECTION('ref_axis',(-1.36642833800019E-16,1.,0.));
#202=DIRECTION('',(0.707106781186547,-0.707106781186548,8.65956056235493E-17));
#203=DIRECTION('center_axis',(-1.,-1.36642833800019E-16,0.));
#204=DIRECTION('ref_axis',(0.,1.,0.));
#205=DIRECTION('center_axis',(-1.,-1.36642833800019E-16,0.));
#206=DIRECTION('ref_axis',(0.,1.,0.));
#207=DIRECTION('center_axis',(-1.,-1.36642833800019E-16,0.));
#208=DIRECTION('ref_axis',(0.,0.,1.));
#209=DIRECTION('center_axis',(-1.,-1.36642833800019E-16,0.));
#210=DIRECTION('ref_axis',(0.,-1.,0.));
#211=DIRECTION('',(1.,1.36642833800019E-16,0.));
#212=DIRECTION('center_axis',(-1.,-1.36642833800019E-16,0.));
#213=DIRECTION('ref_axis',(0.,-1.,0.));
#214=DIRECTION('center_axis',(-1.,-1.36642833800019E-16,0.));
#215=DIRECTION('ref_axis',(0.,0.,1.));
#216=CARTESIAN_POINT('',(0.,0.,0.));
#217=CARTESIAN_POINT('Origin',(39.379010550235,12.5,0.));
#218=CARTESIAN_POINT('',(40.,12.5,2.067));
#219=CARTESIAN_POINT('Origin',(40.,12.5,0.));
#220=CARTESIAN_POINT('',(38.75802110047,12.5,0.));
#221=CARTESIAN_POINT('',(39.379010550235,12.5,1.0335));
#222=CARTESIAN_POINT('Origin',(52.5,12.5,0.));
#223=CARTESIAN_POINT('',(65.,12.5,2.067));
#224=CARTESIAN_POINT('Origin',(65.,12.5,0.));
#225=CARTESIAN_POINT('',(52.5,12.5,2.067));
#226=CARTESIAN_POINT('Origin',(63.5999255972152,12.5,0.));
#227=CARTESIAN_POINT('',(65.,12.5,-2.15));
#228=CARTESIAN_POINT('Origin',(65.,12.5,0.));
#229=CARTESIAN_POINT('',(62.1998511944303,12.5,-7.));
#230=CARTESIAN_POINT('',(63.5999255972152,12.5,-4.575));
#231=CARTESIAN_POINT('Origin',(62.1998511944303,12.5,0.));
#232=CARTESIAN_POINT('Origin',(65.,12.5,0.));
#233=CARTESIAN_POINT('',(4.,12.5,-7.));
#234=CARTESIAN_POINT('Origin',(4.,12.5,0.));
#235=CARTESIAN_POINT('',(65.,12.5,-7.));
#236=CARTESIAN_POINT('Origin',(65.,6.25,0.));
#237=CARTESIAN_POINT('Origin',(0.999999999999997,12.5,0.));
#238=CARTESIAN_POINT('',(-1.34080780666269E-15,2.,-1.2858366715135E-15));
#239=CARTESIAN_POINT('Origin',(-2.77555756156289E-15,12.5,0.));
#240=CARTESIAN_POINT('',(2.,-4.44089209850063E-15,1.53075794227797E-15));
#241=CARTESIAN_POINT('',(0.999999999999998,0.999999999999996,1.40834381901946E-15));
#242=CARTESIAN_POINT('',(2.,25.,-1.53080849893419E-15));
#243=CARTESIAN_POINT('Origin',(2.,12.5,0.));
#244=CARTESIAN_POINT('Origin',(2.,12.5,0.));
#245=CARTESIAN_POINT('Origin',(-1.91351062366774E-15,6.25,0.));
#246=CARTESIAN_POINT('Origin',(32.5,12.5,0.));
#247=CARTESIAN_POINT('',(4.,25.,-1.53080849893419E-15));
#248=CARTESIAN_POINT('',(32.5,25.,-1.53080849893419E-15));
#249=CARTESIAN_POINT('Origin',(4.,12.5,0.));
#250=CARTESIAN_POINT('Origin',(4.,12.5,0.));
#251=UNCERTAINTY_MEASURE_WITH_UNIT(LENGTH_MEASURE(0.01),#255,
'DISTANCE_ACCURACY_VALUE',
'Maximum model space distance between geometric entities at asserted c
onnectivities');
#252=UNCERTAINTY_MEASURE_WITH_UNIT(LENGTH_MEASURE(0.01),#255,
'DISTANCE_ACCURACY_VALUE',
'Maximum model space distance between geometric entities at asserted c
onnectivities');
#253=(
GEOMETRIC_REPRESENTATION_CONTEXT(3)
GLOBAL_UNCERTAINTY_ASSIGNED_CONTEXT((#251))
GLOBAL_UNIT_ASSIGNED_CONTEXT((#255,#257,#258))
REPRESENTATION_CONTEXT('','3D')
);
#254=(
GEOMETRIC_REPRESENTATION_CONTEXT(3)
GLOBAL_UNCERTAINTY_ASSIGNED_CONTEXT((#252))
GLOBAL_UNIT_ASSIGNED_CONTEXT((#255,#257,#258))
REPRESENTATION_CONTEXT('','3D')
);
#255=(
LENGTH_UNIT()
NAMED_UNIT(*)
SI_UNIT(.MILLI.,.METRE.)
);
#256=(
LENGTH_UNIT()
NAMED_UNIT(*)
SI_UNIT(.CENTI.,.METRE.)
);
#257=(
NAMED_UNIT(*)
PLANE_ANGLE_UNIT()
SI_UNIT($,.RADIAN.)
);
#258=(
NAMED_UNIT(*)
SI_UNIT($,.STERADIAN.)
SOLID_ANGLE_UNIT()
);
#259=SHAPE_DEFINITION_REPRESENTATION(#260,#261);
#260=PRODUCT_DEFINITION_SHAPE('',$,#263);
#261=SHAPE_REPRESENTATION('',(#153),#253);
#262=PRODUCT_DEFINITION_CONTEXT('part definition',#267,'design');
#263=PRODUCT_DEFINITION('Parte 2 (\X\CAmbolo)',
'RBF14.P109-1 Corpo do \X\CAmbolo',#264,#262);
#264=PRODUCT_DEFINITION_FORMATION('',$,#269);
#265=PRODUCT_RELATED_PRODUCT_CATEGORY('RBF14.P109-1 Corpo do \X\CAmbol
o','RBF14.P109-1 Corpo do \X\CAmbolo',(#269));
#266=APPLICATION_PROTOCOL_DEFINITION('international standard',
'automotive_design',2009,#267);
#267=APPLICATION_CONTEXT(
'Core Data for Automotive Mechanical Design Process');
#268=PRODUCT_CONTEXT('part definition',#267,'mechanical');
#269=PRODUCT('Parte 2 (\X\CAmbolo)','RBF14.P109-1 Corpo do \X\CAmbolo',
$,(#268));
#270=PRESENTATION_STYLE_ASSIGNMENT((#271));
#271=SURFACE_STYLE_USAGE(.BOTH.,#272);
#272=SURFACE_SIDE_STYLE('',(#273));
#273=SURFACE_STYLE_FILL_AREA(#274);
#274=FILL_AREA_STYLE('',(#275));
#275=FILL_AREA_STYLE_COLOUR('',#276);
#276=COLOUR_RGB('',0.588235294117647,0.611764705882353,0.47843137254902);
ENDSEC;
END-ISO-10303-21;
