ISO-10303-21;
HEADER;
FILE_DESCRIPTION(('STEP AP203'),'1');
FILE_NAME('RBF22.P105-1 Suporte Solenoide Dianteiro.stp','2022-08-30T18:57:04',(' '),(' '),'Spatial InterOp 3D',' ',' ');
FILE_SCHEMA(('CONFIG_CONTROL_DESIGN'));
ENDSEC;
DATA;
#1=DESIGN_CONTEXT('',#33,'design');
#2=APPLICATION_PROTOCOL_DEFINITION('INTERNATIONAL STANDARD','config_control_design',1994,#33);
#3=PRODUCT_CATEGORY_RELATIONSHIP('NONE','NONE',#34,#35);
#4=DATE_AND_TIME(#36,#37);
#5=DATE_TIME_ROLE('creation_date');
#6=DATE_TIME_ROLE('classification_date');
#7=PERSON_AND_ORGANIZATION_ROLE('creator');
#8=PERSON_AND_ORGANIZATION_ROLE('design_supplier');
#9=PERSON_AND_ORGANIZATION_ROLE('classification_officer');
#10=PERSON_AND_ORGANIZATION_ROLE('design_owner');
#11=APPROVAL_PERSON_ORGANIZATION(#38,#39,#40);
#12=APPROVAL_DATE_TIME(#4,#39);
#13=CC_DESIGN_APPROVAL(#39,(#41,#42,#43));
#14=CC_DESIGN_DATE_AND_TIME_ASSIGNMENT(#4,#5,(#43));
#15=CC_DESIGN_DATE_AND_TIME_ASSIGNMENT(#4,#6,(#41));
#16=CC_DESIGN_PERSON_AND_ORGANIZATION_ASSIGNMENT(#38,#10,(#44));
#17=CC_DESIGN_PERSON_AND_ORGANIZATION_ASSIGNMENT(#38,#7,(#43));
#18=CC_DESIGN_PERSON_AND_ORGANIZATION_ASSIGNMENT(#38,#7,(#42));
#19=CC_DESIGN_PERSON_AND_ORGANIZATION_ASSIGNMENT(#38,#8,(#42));
#20=CC_DESIGN_SECURITY_CLASSIFICATION(#41,(#42));
#21=CC_DESIGN_PERSON_AND_ORGANIZATION_ASSIGNMENT(#38,#9,(#41));
#22=SHAPE_DEFINITION_REPRESENTATION(#45,#46);
#23= (GEOMETRIC_REPRESENTATION_CONTEXT(3)GLOBAL_UNCERTAINTY_ASSIGNED_CONTEXT((#49))GLOBAL_UNIT_ASSIGNED_CONTEXT((#51,#52,#53))REPRESENTATION_CONTEXT('NONE','WORKSPACE'));
#24=PROPERTY_DEFINITION_REPRESENTATION(#55,#56);
#25=GENERAL_PROPERTY_ASSOCIATION('','',#57,#55);
#26=PROPERTY_DEFINITION_REPRESENTATION(#58,#59);
#27=GENERAL_PROPERTY_ASSOCIATION('','',#60,#58);
#28=PROPERTY_DEFINITION_REPRESENTATION(#61,#62);
#29=GENERAL_PROPERTY_ASSOCIATION('','',#63,#61);
#33=APPLICATION_CONTEXT('CONFIGURATION CONTROLLED 3D DESIGNS OF MECHANICAL PARTS AND ASSEMBLIES');
#34=PRODUCT_CATEGORY('part','NONE');
#35=PRODUCT_RELATED_PRODUCT_CATEGORY('detail',' ',(#44));
#36=CALENDAR_DATE(2022,30,7);
#37=LOCAL_TIME(15,57,4.0,#64);
#38=PERSON_AND_ORGANIZATION(#65,#66);
#39=APPROVAL(#67,'SOLID MODEL');
#40=APPROVAL_ROLE('APPROVED');
#41=SECURITY_CLASSIFICATION('','',#68);
#42=PRODUCT_DEFINITION_FORMATION_WITH_SPECIFIED_SOURCE('A','NONE',#44,.NOT_KNOWN.);
#43=PRODUCT_DEFINITION('','NONE',#42,#1);
#44=PRODUCT('Suporte Solenoide Dianteiro','','1',(#69));
#45=PRODUCT_DEFINITION_SHAPE('NONE','NONE',#43);
#46=ADVANCED_BREP_SHAPE_REPRESENTATION('1',(#70,#71),#23);
#49=UNCERTAINTY_MEASURE_WITH_UNIT(LENGTH_MEASURE(0.001),#51,'','');
#51= (CONVERSION_BASED_UNIT('MILLIMETRE',#74)LENGTH_UNIT()NAMED_UNIT(#77));
#52= (NAMED_UNIT(#79)PLANE_ANGLE_UNIT()SI_UNIT($,.RADIAN.));
#53= (NAMED_UNIT(#79)SOLID_ANGLE_UNIT()SI_UNIT($,.STERADIAN.));
#55=PROPERTY_DEFINITION('PdmObjectId','',#43);
#56=REPRESENTATION('',(#85),#23);
#57=GENERAL_PROPERTY('','19_2d33aa80-3400-4df2-88c1-bd50ab977ea6&2_64_0_192','');
#58=PROPERTY_DEFINITION('CreationDate','',#43);
#59=REPRESENTATION('',(#86),#23);
#60=GENERAL_PROPERTY('','31/03/2022 19:55:39','');
#61=PROPERTY_DEFINITION('Minor Revision','',#43);
#62=REPRESENTATION('',(#87),#23);
#63=GENERAL_PROPERTY('','30','');
#64=COORDINATED_UNIVERSAL_TIME_OFFSET(3,0,.BEHIND.);
#65=PERSON('','UNSPECIFIED',$,$,$,$);
#66=ORGANIZATION('UNSPECIFIED','UNSPECIFIED','UNSPECIFIED');
#67=APPROVAL_STATUS('approved');
#68=SECURITY_CLASSIFICATION_LEVEL('unclassified');
#69=MECHANICAL_CONTEXT('',#33,'mechanical');
#70=MANIFOLD_SOLID_BREP('1',#88);
#71=AXIS2_PLACEMENT_3D('',#89,#90,#91);
#74=LENGTH_MEASURE_WITH_UNIT(LENGTH_MEASURE(1.0),#92);
#77=DIMENSIONAL_EXPONENTS(1.0,0.0,0.0,0.0,0.0,0.0,0.0);
#79=DIMENSIONAL_EXPONENTS(0.0,0.0,0.0,0.0,0.0,0.0,0.0);
#85=VALUE_REPRESENTATION_ITEM('19_2d33aa80-3400-4df2-88c1-bd50ab977ea6&2_64_0_192',);
#86=VALUE_REPRESENTATION_ITEM('31/03/2022 19:55:39',);
#87=VALUE_REPRESENTATION_ITEM('30',);
#88=CLOSED_SHELL('',(#93,#94,#95,#96,#97,#98,#99,#100,#101,#102,#103,#104,#105,#106,#107,#108,#109,#110,#111,#112,#113,#114,#115,#116,#117,#118,#119,#120,#121,#122,#123,#124,#125,#126,#127,#128,#129,#130,#131,#132,#133,#134,#135,#136,#137,#138,#139,#140,#141,#142,#143,#144,#145,#146,#147,#148,#149,#150,#151,#152,#153,#154));
#89=CARTESIAN_POINT('',(0.0,0.0,0.0));
#90=DIRECTION('',(0.0,0.0,1.0));
#91=DIRECTION('',(1.0,0.0,0.0));
#92= (NAMED_UNIT(#77)LENGTH_UNIT()SI_UNIT(.MILLI.,.METRE.));
#93=ADVANCED_FACE('',(#156,#157),#158,.F.);
#94=ADVANCED_FACE('',(#159,#160),#161,.F.);
#95=ADVANCED_FACE('',(#162,#163),#164,.F.);
#96=ADVANCED_FACE('',(#165,#166),#167,.F.);
#97=ADVANCED_FACE('',(#168,#169,#170,#171),#172,.F.);
#98=ADVANCED_FACE('',(#173),#174,.F.);
#99=ADVANCED_FACE('',(#175),#176,.T.);
#100=ADVANCED_FACE('',(#177),#178,.T.);
#101=ADVANCED_FACE('',(#179,#180),#181,.T.);
#102=ADVANCED_FACE('',(#182),#183,.T.);
#103=ADVANCED_FACE('',(#184),#185,.F.);
#104=ADVANCED_FACE('',(#186),#187,.T.);
#105=ADVANCED_FACE('',(#188),#189,.F.);
#106=ADVANCED_FACE('',(#190,#191),#192,.T.);
#107=ADVANCED_FACE('',(#193),#194,.T.);
#108=ADVANCED_FACE('',(#195),#196,.F.);
#109=ADVANCED_FACE('',(#197,#198),#199,.T.);
#110=ADVANCED_FACE('',(#200),#201,.T.);
#111=ADVANCED_FACE('',(#202),#203,.T.);
#112=ADVANCED_FACE('',(#204),#205,.T.);
#113=ADVANCED_FACE('',(#206),#207,.T.);
#114=ADVANCED_FACE('',(#208),#209,.T.);
#115=ADVANCED_FACE('',(#210,#211),#212,.F.);
#116=ADVANCED_FACE('',(#213,#214),#215,.F.);
#117=ADVANCED_FACE('',(#216),#217,.F.);
#118=ADVANCED_FACE('',(#218,#219,#220,#221),#222,.T.);
#119=ADVANCED_FACE('',(#223,#224),#225,.T.);
#120=ADVANCED_FACE('',(#226),#227,.T.);
#121=ADVANCED_FACE('',(#228,#229),#230,.F.);
#122=ADVANCED_FACE('',(#231),#232,.T.);
#123=ADVANCED_FACE('',(#233),#234,.T.);
#124=ADVANCED_FACE('',(#235),#236,.T.);
#125=ADVANCED_FACE('',(#237),#238,.T.);
#126=ADVANCED_FACE('',(#239),#240,.F.);
#127=ADVANCED_FACE('',(#241),#242,.F.);
#128=ADVANCED_FACE('',(#243,#244),#245,.F.);
#129=ADVANCED_FACE('',(#246),#247,.F.);
#130=ADVANCED_FACE('',(#248),#249,.F.);
#131=ADVANCED_FACE('',(#250),#251,.F.);
#132=ADVANCED_FACE('',(#252),#253,.T.);
#133=ADVANCED_FACE('',(#254),#255,.F.);
#134=ADVANCED_FACE('',(#256),#257,.F.);
#135=ADVANCED_FACE('',(#258),#259,.T.);
#136=ADVANCED_FACE('',(#260),#261,.T.);
#137=ADVANCED_FACE('',(#262),#263,.T.);
#138=ADVANCED_FACE('',(#264),#265,.T.);
#139=ADVANCED_FACE('',(#266),#267,.T.);
#140=ADVANCED_FACE('',(#268),#269,.F.);
#141=ADVANCED_FACE('',(#270),#271,.F.);
#142=ADVANCED_FACE('',(#272),#273,.T.);
#143=ADVANCED_FACE('',(#274),#275,.F.);
#144=ADVANCED_FACE('',(#276),#277,.T.);
#145=ADVANCED_FACE('',(#278),#279,.F.);
#146=ADVANCED_FACE('',(#280),#281,.F.);
#147=ADVANCED_FACE('',(#282),#283,.T.);
#148=ADVANCED_FACE('',(#284),#285,.F.);
#149=ADVANCED_FACE('',(#286),#287,.T.);
#150=ADVANCED_FACE('',(#288),#289,.T.);
#151=ADVANCED_FACE('',(#290),#291,.F.);
#152=ADVANCED_FACE('',(#292),#293,.T.);
#153=ADVANCED_FACE('',(#294),#295,.F.);
#154=ADVANCED_FACE('',(#296),#297,.F.);
#156=FACE_OUTER_BOUND('',#298,.T.);
#157=FACE_OUTER_BOUND('',#299,.T.);
#158=CYLINDRICAL_SURFACE('',#300,1.25);
#159=FACE_OUTER_BOUND('',#301,.T.);
#160=FACE_OUTER_BOUND('',#302,.T.);
#161=CYLINDRICAL_SURFACE('',#303,1.25);
#162=FACE_OUTER_BOUND('',#304,.T.);
#163=FACE_BOUND('',#305,.T.);
#164=CONICAL_SURFACE('',#306,866.025403784439,1.0471975511966);
#165=FACE_OUTER_BOUND('',#307,.T.);
#166=FACE_OUTER_BOUND('',#308,.T.);
#167=CYLINDRICAL_SURFACE('',#309,1.25);
#168=FACE_BOUND('',#310,.T.);
#169=FACE_BOUND('',#311,.T.);
#170=FACE_BOUND('',#312,.T.);
#171=FACE_OUTER_BOUND('',#313,.T.);
#172=PLANE('',#314);
#173=FACE_OUTER_BOUND('',#315,.T.);
#174=PLANE('',#316);
#175=FACE_OUTER_BOUND('',#317,.T.);
#176=PLANE('',#318);
#177=FACE_OUTER_BOUND('',#319,.T.);
#178=PLANE('',#320);
#179=FACE_BOUND('',#321,.T.);
#180=FACE_OUTER_BOUND('',#322,.T.);
#181=PLANE('',#323);
#182=FACE_OUTER_BOUND('',#324,.T.);
#183=PLANE('',#325);
#184=FACE_OUTER_BOUND('',#326,.T.);
#185=PLANE('',#327);
#186=FACE_OUTER_BOUND('',#328,.T.);
#187=PLANE('',#329);
#188=FACE_OUTER_BOUND('',#330,.T.);
#189=CYLINDRICAL_SURFACE('',#331,6.0);
#190=FACE_BOUND('',#332,.T.);
#191=FACE_OUTER_BOUND('',#333,.T.);
#192=PLANE('',#334);
#193=FACE_OUTER_BOUND('',#335,.T.);
#194=PLANE('',#336);
#195=FACE_OUTER_BOUND('',#337,.T.);
#196=CYLINDRICAL_SURFACE('',#338,6.0);
#197=FACE_BOUND('',#339,.T.);
#198=FACE_OUTER_BOUND('',#340,.T.);
#199=PLANE('',#341);
#200=FACE_OUTER_BOUND('',#342,.T.);
#201=PLANE('',#343);
#202=FACE_OUTER_BOUND('',#344,.T.);
#203=CYLINDRICAL_SURFACE('',#345,10.0);
#204=FACE_OUTER_BOUND('',#346,.T.);
#205=PLANE('',#347);
#206=FACE_OUTER_BOUND('',#348,.T.);
#207=PLANE('',#349);
#208=FACE_OUTER_BOUND('',#350,.T.);
#209=CYLINDRICAL_SURFACE('',#351,10.0);
#210=FACE_OUTER_BOUND('',#352,.T.);
#211=FACE_BOUND('',#353,.T.);
#212=CONICAL_SURFACE('',#354,866.025403784439,1.0471975511966);
#213=FACE_OUTER_BOUND('',#355,.T.);
#214=FACE_OUTER_BOUND('',#356,.T.);
#215=CYLINDRICAL_SURFACE('',#357,1.25);
#216=FACE_OUTER_BOUND('',#358,.T.);
#217=PLANE('',#359);
#218=FACE_OUTER_BOUND('',#360,.T.);
#219=FACE_BOUND('',#361,.T.);
#220=FACE_BOUND('',#362,.T.);
#221=FACE_BOUND('',#363,.T.);
#222=PLANE('',#364);
#223=FACE_BOUND('',#365,.T.);
#224=FACE_OUTER_BOUND('',#366,.T.);
#225=PLANE('',#367);
#226=FACE_OUTER_BOUND('',#368,.T.);
#227=PLANE('',#369);
#228=FACE_OUTER_BOUND('',#370,.T.);
#229=FACE_OUTER_BOUND('',#371,.T.);
#230=CYLINDRICAL_SURFACE('',#372,9.0);
#231=FACE_OUTER_BOUND('',#373,.T.);
#232=PLANE('',#374);
#233=FACE_OUTER_BOUND('',#375,.T.);
#234=PLANE('',#376);
#235=FACE_OUTER_BOUND('',#377,.T.);
#236=PLANE('',#378);
#237=FACE_OUTER_BOUND('',#379,.T.);
#238=PLANE('',#380);
#239=FACE_OUTER_BOUND('',#381,.T.);
#240=CYLINDRICAL_SURFACE('',#382,4.1);
#241=FACE_OUTER_BOUND('',#383,.T.);
#242=CYLINDRICAL_SURFACE('',#384,4.1);
#243=FACE_OUTER_BOUND('',#385,.T.);
#244=FACE_OUTER_BOUND('',#386,.T.);
#245=CYLINDRICAL_SURFACE('',#387,9.0);
#246=FACE_OUTER_BOUND('',#388,.T.);
#247=CYLINDRICAL_SURFACE('',#389,6.0);
#248=FACE_OUTER_BOUND('',#390,.T.);
#249=CYLINDRICAL_SURFACE('',#391,6.0);
#250=FACE_OUTER_BOUND('',#392,.T.);
#251=PLANE('',#393);
#252=FACE_OUTER_BOUND('',#394,.T.);
#253=CYLINDRICAL_SURFACE('',#395,0.5);
#254=FACE_OUTER_BOUND('',#396,.T.);
#255=PLANE('',#397);
#256=FACE_OUTER_BOUND('',#398,.T.);
#257=PLANE('',#399);
#258=FACE_OUTER_BOUND('',#400,.T.);
#259=CYLINDRICAL_SURFACE('',#401,0.5);
#260=FACE_OUTER_BOUND('',#402,.T.);
#261=PLANE('',#403);
#262=FACE_OUTER_BOUND('',#404,.T.);
#263=PLANE('',#405);
#264=FACE_OUTER_BOUND('',#406,.T.);
#265=PLANE('',#407);
#266=FACE_OUTER_BOUND('',#408,.T.);
#267=PLANE('',#409);
#268=FACE_OUTER_BOUND('',#410,.T.);
#269=PLANE('',#411);
#270=FACE_OUTER_BOUND('',#412,.T.);
#271=PLANE('',#413);
#272=FACE_OUTER_BOUND('',#414,.T.);
#273=CYLINDRICAL_SURFACE('',#415,0.5);
#274=FACE_OUTER_BOUND('',#416,.T.);
#275=PLANE('',#417);
#276=FACE_OUTER_BOUND('',#418,.T.);
#277=CYLINDRICAL_SURFACE('',#419,0.5);
#278=FACE_OUTER_BOUND('',#420,.T.);
#279=PLANE('',#421);
#280=FACE_OUTER_BOUND('',#422,.T.);
#281=PLANE('',#423);
#282=FACE_OUTER_BOUND('',#424,.T.);
#283=CYLINDRICAL_SURFACE('',#425,0.5);
#284=FACE_OUTER_BOUND('',#426,.T.);
#285=PLANE('',#427);
#286=FACE_OUTER_BOUND('',#428,.T.);
#287=CYLINDRICAL_SURFACE('',#429,0.5);
#288=FACE_OUTER_BOUND('',#430,.T.);
#289=CYLINDRICAL_SURFACE('',#431,0.5);
#290=FACE_OUTER_BOUND('',#432,.T.);
#291=PLANE('',#433);
#292=FACE_OUTER_BOUND('',#434,.T.);
#293=CYLINDRICAL_SURFACE('',#435,0.5);
#294=FACE_OUTER_BOUND('',#436,.T.);
#295=PLANE('',#437);
#296=FACE_OUTER_BOUND('',#438,.T.);
#297=PLANE('',#439);
#298=EDGE_LOOP('',(#440));
#299=EDGE_LOOP('',(#441));
#300=AXIS2_PLACEMENT_3D('',#442,#443,#444);
#301=EDGE_LOOP('',(#445));
#302=EDGE_LOOP('',(#446));
#303=AXIS2_PLACEMENT_3D('',#447,#448,#449);
#304=EDGE_LOOP('',(#450));
#305=VERTEX_LOOP('',#451);
#306=AXIS2_PLACEMENT_3D('',#452,#453,#454);
#307=EDGE_LOOP('',(#455));
#308=EDGE_LOOP('',(#456));
#309=AXIS2_PLACEMENT_3D('',#457,#458,#459);
#310=EDGE_LOOP('',(#460,#461,#462,#463,#464,#465,#466,#467,#468,#469,#470,#471,#472));
#311=EDGE_LOOP('',(#473,#474,#475,#476,#477,#478,#479,#480,#481,#482,#483,#484,#485));
#312=EDGE_LOOP('',(#486,#487,#488,#489));
#313=EDGE_LOOP('',(#490,#491,#492,#493,#494,#495,#496,#497,#498,#499,#500,#501,#502,#503,#504,#505,#506,#507));
#314=AXIS2_PLACEMENT_3D('',#508,#509,#510);
#315=EDGE_LOOP('',(#511,#512,#513,#514));
#316=AXIS2_PLACEMENT_3D('',#515,#516,#517);
#317=EDGE_LOOP('',(#518,#519,#520,#521));
#318=AXIS2_PLACEMENT_3D('',#522,#523,#524);
#319=EDGE_LOOP('',(#525,#526,#527,#528,#529,#530));
#320=AXIS2_PLACEMENT_3D('',#531,#532,#533);
#321=EDGE_LOOP('',(#534,#535,#536,#537,#538,#539,#540,#541,#542,#543,#544,#545,#546));
#322=EDGE_LOOP('',(#547));
#323=AXIS2_PLACEMENT_3D('',#548,#549,#550);
#324=EDGE_LOOP('',(#551,#552,#553,#554));
#325=AXIS2_PLACEMENT_3D('',#555,#556,#557);
#326=EDGE_LOOP('',(#558,#559,#560,#561,#562));
#327=AXIS2_PLACEMENT_3D('',#563,#564,#565);
#328=EDGE_LOOP('',(#566,#567,#568,#569,#570,#571));
#329=AXIS2_PLACEMENT_3D('',#572,#573,#574);
#330=EDGE_LOOP('',(#575,#576,#577,#578,#579,#580));
#331=AXIS2_PLACEMENT_3D('',#581,#582,#583);
#332=EDGE_LOOP('',(#584));
#333=EDGE_LOOP('',(#585,#586,#587,#588,#589,#590));
#334=AXIS2_PLACEMENT_3D('',#591,#592,#593);
#335=EDGE_LOOP('',(#594,#595,#596,#597));
#336=AXIS2_PLACEMENT_3D('',#598,#599,#600);
#337=EDGE_LOOP('',(#601,#602,#603,#604,#605,#606));
#338=AXIS2_PLACEMENT_3D('',#607,#608,#609);
#339=EDGE_LOOP('',(#610));
#340=EDGE_LOOP('',(#611,#612,#613,#614,#615,#616));
#341=AXIS2_PLACEMENT_3D('',#617,#618,#619);
#342=EDGE_LOOP('',(#620,#621,#622,#623));
#343=AXIS2_PLACEMENT_3D('',#624,#625,#626);
#344=EDGE_LOOP('',(#627,#628,#629,#630));
#345=AXIS2_PLACEMENT_3D('',#631,#632,#633);
#346=EDGE_LOOP('',(#634,#635,#636,#637));
#347=AXIS2_PLACEMENT_3D('',#638,#639,#640);
#348=EDGE_LOOP('',(#641,#642,#643,#644));
#349=AXIS2_PLACEMENT_3D('',#645,#646,#647);
#350=EDGE_LOOP('',(#648,#649,#650,#651));
#351=AXIS2_PLACEMENT_3D('',#652,#653,#654);
#352=EDGE_LOOP('',(#655));
#353=VERTEX_LOOP('',#656);
#354=AXIS2_PLACEMENT_3D('',#657,#658,#659);
#355=EDGE_LOOP('',(#660));
#356=EDGE_LOOP('',(#661));
#357=AXIS2_PLACEMENT_3D('',#662,#663,#664);
#358=EDGE_LOOP('',(#665,#666,#667,#668,#669));
#359=AXIS2_PLACEMENT_3D('',#670,#671,#672);
#360=EDGE_LOOP('',(#673,#674,#675,#676,#677,#678,#679,#680,#681,#682,#683,#684,#685,#686,#687,#688));
#361=EDGE_LOOP('',(#689,#690,#691,#692));
#362=EDGE_LOOP('',(#693));
#363=EDGE_LOOP('',(#694));
#364=AXIS2_PLACEMENT_3D('',#695,#696,#697);
#365=EDGE_LOOP('',(#698,#699,#700,#701,#702,#703,#704,#705,#706,#707,#708,#709,#710));
#366=EDGE_LOOP('',(#711));
#367=AXIS2_PLACEMENT_3D('',#712,#713,#714);
#368=EDGE_LOOP('',(#715,#716,#717,#718));
#369=AXIS2_PLACEMENT_3D('',#719,#720,#721);
#370=EDGE_LOOP('',(#722));
#371=EDGE_LOOP('',(#723));
#372=AXIS2_PLACEMENT_3D('',#724,#725,#726);
#373=EDGE_LOOP('',(#727,#728,#729,#730));
#374=AXIS2_PLACEMENT_3D('',#731,#732,#733);
#375=EDGE_LOOP('',(#734,#735,#736,#737));
#376=AXIS2_PLACEMENT_3D('',#738,#739,#740);
#377=EDGE_LOOP('',(#741,#742,#743,#744));
#378=AXIS2_PLACEMENT_3D('',#745,#746,#747);
#379=EDGE_LOOP('',(#748,#749,#750,#751));
#380=AXIS2_PLACEMENT_3D('',#752,#753,#754);
#381=EDGE_LOOP('',(#755,#756,#757,#758));
#382=AXIS2_PLACEMENT_3D('',#759,#760,#761);
#383=EDGE_LOOP('',(#762,#763,#764,#765));
#384=AXIS2_PLACEMENT_3D('',#766,#767,#768);
#385=EDGE_LOOP('',(#769));
#386=EDGE_LOOP('',(#770));
#387=AXIS2_PLACEMENT_3D('',#771,#772,#773);
#388=EDGE_LOOP('',(#774,#775,#776,#777));
#389=AXIS2_PLACEMENT_3D('',#778,#779,#780);
#390=EDGE_LOOP('',(#781,#782,#783,#784));
#391=AXIS2_PLACEMENT_3D('',#785,#786,#787);
#392=EDGE_LOOP('',(#788,#789,#790,#791));
#393=AXIS2_PLACEMENT_3D('',#792,#793,#794);
#394=EDGE_LOOP('',(#795,#796,#797,#798));
#395=AXIS2_PLACEMENT_3D('',#799,#800,#801);
#396=EDGE_LOOP('',(#802,#803,#804,#805));
#397=AXIS2_PLACEMENT_3D('',#806,#807,#808);
#398=EDGE_LOOP('',(#809,#810,#811,#812));
#399=AXIS2_PLACEMENT_3D('',#813,#814,#815);
#400=EDGE_LOOP('',(#816,#817,#818,#819));
#401=AXIS2_PLACEMENT_3D('',#820,#821,#822);
#402=EDGE_LOOP('',(#823,#824,#825,#826));
#403=AXIS2_PLACEMENT_3D('',#827,#828,#829);
#404=EDGE_LOOP('',(#830,#831,#832,#833));
#405=AXIS2_PLACEMENT_3D('',#834,#835,#836);
#406=EDGE_LOOP('',(#837,#838,#839,#840));
#407=AXIS2_PLACEMENT_3D('',#841,#842,#843);
#408=EDGE_LOOP('',(#844,#845,#846,#847));
#409=AXIS2_PLACEMENT_3D('',#848,#849,#850);
#410=EDGE_LOOP('',(#851,#852,#853,#854));
#411=AXIS2_PLACEMENT_3D('',#855,#856,#857);
#412=EDGE_LOOP('',(#858,#859,#860,#861));
#413=AXIS2_PLACEMENT_3D('',#862,#863,#864);
#414=EDGE_LOOP('',(#865,#866,#867,#868));
#415=AXIS2_PLACEMENT_3D('',#869,#870,#871);
#416=EDGE_LOOP('',(#872,#873,#874,#875));
#417=AXIS2_PLACEMENT_3D('',#876,#877,#878);
#418=EDGE_LOOP('',(#879,#880,#881,#882));
#419=AXIS2_PLACEMENT_3D('',#883,#884,#885);
#420=EDGE_LOOP('',(#886,#887,#888,#889));
#421=AXIS2_PLACEMENT_3D('',#890,#891,#892);
#422=EDGE_LOOP('',(#893,#894,#895,#896));
#423=AXIS2_PLACEMENT_3D('',#897,#898,#899);
#424=EDGE_LOOP('',(#900,#901,#902,#903));
#425=AXIS2_PLACEMENT_3D('',#904,#905,#906);
#426=EDGE_LOOP('',(#907,#908,#909,#910));
#427=AXIS2_PLACEMENT_3D('',#911,#912,#913);
#428=EDGE_LOOP('',(#914,#915,#916,#917));
#429=AXIS2_PLACEMENT_3D('',#918,#919,#920);
#430=EDGE_LOOP('',(#921,#922,#923,#924));
#431=AXIS2_PLACEMENT_3D('',#925,#926,#927);
#432=EDGE_LOOP('',(#928,#929,#930,#931));
#433=AXIS2_PLACEMENT_3D('',#932,#933,#934);
#434=EDGE_LOOP('',(#935,#936,#937,#938));
#435=AXIS2_PLACEMENT_3D('',#939,#940,#941);
#436=EDGE_LOOP('',(#942,#943,#944,#945));
#437=AXIS2_PLACEMENT_3D('',#946,#947,#948);
#438=EDGE_LOOP('',(#949,#950,#951,#952));
#439=AXIS2_PLACEMENT_3D('',#953,#954,#955);
#440=ORIENTED_EDGE('',*,*,#956,.F.);
#441=ORIENTED_EDGE('',*,*,#957,.F.);
#442=CARTESIAN_POINT('',(52.0450307332679,4.51000000004174,8.99999999967342));
#443=DIRECTION('',(-7.52061061606098E-12,1.0,-4.14878169283672E-11));
#444=DIRECTION('',(1.0,7.5206106171948E-12,2.73289484470764E-11));
#445=ORIENTED_EDGE('',*,*,#957,.T.);
#446=ORIENTED_EDGE('',*,*,#958,.T.);
#447=CARTESIAN_POINT('',(52.0450307332679,4.51000000004174,8.99999999967342));
#448=DIRECTION('',(-7.52061061606098E-12,1.0,-4.14878169283672E-11));
#449=DIRECTION('',(1.0,7.5206106171948E-12,2.73289484470764E-11));
#450=ORIENTED_EDGE('',*,*,#958,.F.);
#451=VERTEX_POINT('',#959);
#452=CARTESIAN_POINT('',(52.0450307369466,-484.628312163471,9.0000000199667));
#453=DIRECTION('',(7.52061061606098E-12,-1.0,4.14878169283672E-11));
#454=DIRECTION('',(1.0,7.5206106171948E-12,2.73289484470763E-11));
#455=ORIENTED_EDGE('',*,*,#960,.F.);
#456=ORIENTED_EDGE('',*,*,#961,.F.);
#457=CARTESIAN_POINT('',(106.045030733268,4.51000000044785,9.00000000114919));
#458=DIRECTION('',(-7.52061061606098E-12,1.0,-4.14878169283672E-11));
#459=DIRECTION('',(1.0,7.5206106171948E-12,2.73289484470764E-11));
#460=ORIENTED_EDGE('',*,*,#962,.T.);
#461=ORIENTED_EDGE('',*,*,#963,.T.);
#462=ORIENTED_EDGE('',*,*,#964,.T.);
#463=ORIENTED_EDGE('',*,*,#965,.T.);
#464=ORIENTED_EDGE('',*,*,#966,.T.);
#465=ORIENTED_EDGE('',*,*,#967,.T.);
#466=ORIENTED_EDGE('',*,*,#968,.T.);
#467=ORIENTED_EDGE('',*,*,#969,.T.);
#468=ORIENTED_EDGE('',*,*,#970,.T.);
#469=ORIENTED_EDGE('',*,*,#971,.T.);
#470=ORIENTED_EDGE('',*,*,#972,.T.);
#471=ORIENTED_EDGE('',*,*,#973,.T.);
#472=ORIENTED_EDGE('',*,*,#974,.T.);
#473=ORIENTED_EDGE('',*,*,#975,.T.);
#474=ORIENTED_EDGE('',*,*,#976,.T.);
#475=ORIENTED_EDGE('',*,*,#977,.T.);
#476=ORIENTED_EDGE('',*,*,#978,.T.);
#477=ORIENTED_EDGE('',*,*,#979,.T.);
#478=ORIENTED_EDGE('',*,*,#980,.T.);
#479=ORIENTED_EDGE('',*,*,#981,.T.);
#480=ORIENTED_EDGE('',*,*,#982,.T.);
#481=ORIENTED_EDGE('',*,*,#983,.T.);
#482=ORIENTED_EDGE('',*,*,#984,.T.);
#483=ORIENTED_EDGE('',*,*,#985,.T.);
#484=ORIENTED_EDGE('',*,*,#986,.T.);
#485=ORIENTED_EDGE('',*,*,#987,.T.);
#486=ORIENTED_EDGE('',*,*,#988,.T.);
#487=ORIENTED_EDGE('',*,*,#989,.T.);
#488=ORIENTED_EDGE('',*,*,#990,.T.);
#489=ORIENTED_EDGE('',*,*,#991,.T.);
#490=ORIENTED_EDGE('',*,*,#992,.F.);
#491=ORIENTED_EDGE('',*,*,#993,.F.);
#492=ORIENTED_EDGE('',*,*,#994,.F.);
#493=ORIENTED_EDGE('',*,*,#995,.F.);
#494=ORIENTED_EDGE('',*,*,#996,.F.);
#495=ORIENTED_EDGE('',*,*,#997,.F.);
#496=ORIENTED_EDGE('',*,*,#998,.F.);
#497=ORIENTED_EDGE('',*,*,#999,.F.);
#498=ORIENTED_EDGE('',*,*,#1000,.F.);
#499=ORIENTED_EDGE('',*,*,#1001,.F.);
#500=ORIENTED_EDGE('',*,*,#1002,.F.);
#501=ORIENTED_EDGE('',*,*,#1003,.F.);
#502=ORIENTED_EDGE('',*,*,#1004,.F.);
#503=ORIENTED_EDGE('',*,*,#1005,.F.);
#504=ORIENTED_EDGE('',*,*,#1006,.F.);
#505=ORIENTED_EDGE('',*,*,#1007,.F.);
#506=ORIENTED_EDGE('',*,*,#1008,.F.);
#507=ORIENTED_EDGE('',*,*,#1009,.T.);
#508=CARTESIAN_POINT('',(0.0,0.0,0.0));
#509=DIRECTION('',(0.0,0.0,1.0));
#510=DIRECTION('',(1.0,0.0,0.0));
#511=ORIENTED_EDGE('',*,*,#1010,.F.);
#512=ORIENTED_EDGE('',*,*,#1011,.T.);
#513=ORIENTED_EDGE('',*,*,#1009,.F.);
#514=ORIENTED_EDGE('',*,*,#1012,.F.);
#515=CARTESIAN_POINT('',(79.045030733358,35.0,0.0));
#516=DIRECTION('',(0.0,-1.0,0.0));
#517=DIRECTION('',(0.0,0.0,-1.0));
#518=ORIENTED_EDGE('',*,*,#1013,.F.);
#519=ORIENTED_EDGE('',*,*,#1014,.F.);
#520=ORIENTED_EDGE('',*,*,#1015,.T.);
#521=ORIENTED_EDGE('',*,*,#1016,.T.);
#522=CARTESIAN_POINT('',(104.045030733358,10.5,5.0));
#523=DIRECTION('',(-1.0,6.12303176911189E-17,0.0));
#524=DIRECTION('',(0.0,0.0,1.0));
#525=ORIENTED_EDGE('',*,*,#1017,.F.);
#526=ORIENTED_EDGE('',*,*,#1014,.T.);
#527=ORIENTED_EDGE('',*,*,#1018,.F.);
#528=ORIENTED_EDGE('',*,*,#1019,.F.);
#529=ORIENTED_EDGE('',*,*,#994,.T.);
#530=ORIENTED_EDGE('',*,*,#1020,.F.);
#531=CARTESIAN_POINT('',(103.795030733358,16.0,0.0));
#532=DIRECTION('',(-1.22460635382238E-16,1.0,0.0));
#533=DIRECTION('',(1.0,1.22460635382238E-16,0.0));
#534=ORIENTED_EDGE('',*,*,#1021,.F.);
#535=ORIENTED_EDGE('',*,*,#1022,.T.);
#536=ORIENTED_EDGE('',*,*,#1023,.T.);
#537=ORIENTED_EDGE('',*,*,#1024,.T.);
#538=ORIENTED_EDGE('',*,*,#1025,.T.);
#539=ORIENTED_EDGE('',*,*,#1026,.T.);
#540=ORIENTED_EDGE('',*,*,#1027,.F.);
#541=ORIENTED_EDGE('',*,*,#1028,.F.);
#542=ORIENTED_EDGE('',*,*,#1029,.T.);
#543=ORIENTED_EDGE('',*,*,#1030,.T.);
#544=ORIENTED_EDGE('',*,*,#1031,.T.);
#545=ORIENTED_EDGE('',*,*,#1032,.T.);
#546=ORIENTED_EDGE('',*,*,#1033,.T.);
#547=ORIENTED_EDGE('',*,*,#1034,.T.);
#548=CARTESIAN_POINT('',(89.045030733358,25.0,2.0));
#549=DIRECTION('',(0.0,0.0,1.0));
#550=DIRECTION('',(1.0,0.0,0.0));
#551=ORIENTED_EDGE('',*,*,#1035,.F.);
#552=ORIENTED_EDGE('',*,*,#1036,.T.);
#553=ORIENTED_EDGE('',*,*,#1037,.T.);
#554=ORIENTED_EDGE('',*,*,#991,.F.);
#555=CARTESIAN_POINT('',(79.045030733358,2.95,5.0));
#556=DIRECTION('',(1.22460635382238E-16,1.0,0.0));
#557=DIRECTION('',(1.0,-1.22460635382238E-16,0.0));
#558=ORIENTED_EDGE('',*,*,#1013,.T.);
#559=ORIENTED_EDGE('',*,*,#1038,.T.);
#560=ORIENTED_EDGE('',*,*,#1039,.T.);
#561=ORIENTED_EDGE('',*,*,#1040,.T.);
#562=ORIENTED_EDGE('',*,*,#1018,.T.);
#563=CARTESIAN_POINT('',(0.0,0.0,12.0));
#564=DIRECTION('',(0.0,0.0,-1.0));
#565=DIRECTION('',(0.0,-1.0,0.0));
#566=ORIENTED_EDGE('',*,*,#1041,.F.);
#567=ORIENTED_EDGE('',*,*,#1042,.T.);
#568=ORIENTED_EDGE('',*,*,#1006,.T.);
#569=ORIENTED_EDGE('',*,*,#1043,.T.);
#570=ORIENTED_EDGE('',*,*,#1044,.F.);
#571=ORIENTED_EDGE('',*,*,#1045,.F.);
#572=CARTESIAN_POINT('',(54.295030733358,16.0,0.0));
#573=DIRECTION('',(-1.22460635382238E-16,1.0,0.0));
#574=DIRECTION('',(1.0,1.22460635382238E-16,0.0));
#575=ORIENTED_EDGE('',*,*,#1046,.F.);
#576=ORIENTED_EDGE('',*,*,#962,.F.);
#577=ORIENTED_EDGE('',*,*,#974,.F.);
#578=ORIENTED_EDGE('',*,*,#1047,.F.);
#579=ORIENTED_EDGE('',*,*,#1048,.T.);
#580=ORIENTED_EDGE('',*,*,#1049,.T.);
#581=CARTESIAN_POINT('',(69.045030733358,25.0,5.0));
#582=DIRECTION('',(0.0,0.0,-1.0));
#583=DIRECTION('',(1.0,0.0,0.0));
#584=ORIENTED_EDGE('',*,*,#956,.T.);
#585=ORIENTED_EDGE('',*,*,#1050,.T.);
#586=ORIENTED_EDGE('',*,*,#1051,.T.);
#587=ORIENTED_EDGE('',*,*,#1052,.T.);
#588=ORIENTED_EDGE('',*,*,#1053,.F.);
#589=ORIENTED_EDGE('',*,*,#1054,.F.);
#590=ORIENTED_EDGE('',*,*,#1003,.T.);
#591=CARTESIAN_POINT('',(50.772515366679,5.0,0.0));
#592=DIRECTION('',(0.0,-1.0,0.0));
#593=DIRECTION('',(0.0,0.0,-1.0));
#594=ORIENTED_EDGE('',*,*,#1019,.T.);
#595=ORIENTED_EDGE('',*,*,#1040,.F.);
#596=ORIENTED_EDGE('',*,*,#1055,.F.);
#597=ORIENTED_EDGE('',*,*,#995,.T.);
#598=CARTESIAN_POINT('',(108.045030733358,15.0,0.0));
#599=DIRECTION('',(0.70710678118655,0.707106781186545,0.0));
#600=DIRECTION('',(0.0,0.0,-1.0));
#601=ORIENTED_EDGE('',*,*,#1056,.F.);
#602=ORIENTED_EDGE('',*,*,#975,.F.);
#603=ORIENTED_EDGE('',*,*,#987,.F.);
#604=ORIENTED_EDGE('',*,*,#1057,.F.);
#605=ORIENTED_EDGE('',*,*,#1028,.T.);
#606=ORIENTED_EDGE('',*,*,#1027,.T.);
#607=CARTESIAN_POINT('',(89.045030733358,25.0,5.0));
#608=DIRECTION('',(0.0,0.0,-1.0));
#609=DIRECTION('',(1.0,0.0,0.0));
#610=ORIENTED_EDGE('',*,*,#960,.T.);
#611=ORIENTED_EDGE('',*,*,#1058,.T.);
#612=ORIENTED_EDGE('',*,*,#1059,.F.);
#613=ORIENTED_EDGE('',*,*,#997,.T.);
#614=ORIENTED_EDGE('',*,*,#1060,.T.);
#615=ORIENTED_EDGE('',*,*,#1038,.F.);
#616=ORIENTED_EDGE('',*,*,#1016,.F.);
#617=CARTESIAN_POINT('',(107.772515366679,5.0,0.0));
#618=DIRECTION('',(0.0,-1.0,0.0));
#619=DIRECTION('',(0.0,0.0,-1.0));
#620=ORIENTED_EDGE('',*,*,#1060,.F.);
#621=ORIENTED_EDGE('',*,*,#996,.T.);
#622=ORIENTED_EDGE('',*,*,#1055,.T.);
#623=ORIENTED_EDGE('',*,*,#1039,.F.);
#624=CARTESIAN_POINT('',(109.045030733358,9.5,0.0));
#625=DIRECTION('',(1.0,-6.12303176911189E-17,0.0));
#626=DIRECTION('',(-6.12303176911189E-17,-1.0,0.0));
#627=ORIENTED_EDGE('',*,*,#992,.T.);
#628=ORIENTED_EDGE('',*,*,#1011,.F.);
#629=ORIENTED_EDGE('',*,*,#1061,.T.);
#630=ORIENTED_EDGE('',*,*,#1062,.T.);
#631=CARTESIAN_POINT('',(89.045030733358,25.0,5.0));
#632=DIRECTION('',(0.0,0.0,-1.0));
#633=DIRECTION('',(1.0,0.0,0.0));
#634=ORIENTED_EDGE('',*,*,#993,.T.);
#635=ORIENTED_EDGE('',*,*,#1062,.F.);
#636=ORIENTED_EDGE('',*,*,#1063,.T.);
#637=ORIENTED_EDGE('',*,*,#1020,.T.);
#638=CARTESIAN_POINT('',(99.045030733358,20.5,5.0));
#639=DIRECTION('',(1.0,6.12303176911189E-17,0.0));
#640=DIRECTION('',(6.12303176911189E-17,-1.0,0.0));
#641=ORIENTED_EDGE('',*,*,#1007,.T.);
#642=ORIENTED_EDGE('',*,*,#1042,.F.);
#643=ORIENTED_EDGE('',*,*,#1064,.T.);
#644=ORIENTED_EDGE('',*,*,#1065,.T.);
#645=CARTESIAN_POINT('',(59.045030733358,20.5,5.0));
#646=DIRECTION('',(-1.0,-6.12303176911189E-17,0.0));
#647=DIRECTION('',(-6.12303176911189E-17,1.0,0.0));
#648=ORIENTED_EDGE('',*,*,#1008,.T.);
#649=ORIENTED_EDGE('',*,*,#1065,.F.);
#650=ORIENTED_EDGE('',*,*,#1066,.T.);
#651=ORIENTED_EDGE('',*,*,#1012,.T.);
#652=CARTESIAN_POINT('',(69.045030733358,25.0,5.0));
#653=DIRECTION('',(0.0,0.0,-1.0));
#654=DIRECTION('',(1.0,0.0,0.0));
#655=ORIENTED_EDGE('',*,*,#1067,.F.);
#656=VERTEX_POINT('',#1068);
#657=CARTESIAN_POINT('',(106.045030736947,-484.628312163065,9.00000002144247));
#658=DIRECTION('',(7.52061061606098E-12,-1.0,4.14878169283672E-11));
#659=DIRECTION('',(1.0,7.5206106171948E-12,2.73289484470763E-11));
#660=ORIENTED_EDGE('',*,*,#961,.T.);
#661=ORIENTED_EDGE('',*,*,#1067,.T.);
#662=CARTESIAN_POINT('',(106.045030733268,4.51000000044785,9.00000000114919));
#663=DIRECTION('',(-7.52061061606098E-12,1.0,-4.14878169283672E-11));
#664=DIRECTION('',(1.0,7.5206106171948E-12,2.73289484470764E-11));
#665=ORIENTED_EDGE('',*,*,#1044,.T.);
#666=ORIENTED_EDGE('',*,*,#1069,.T.);
#667=ORIENTED_EDGE('',*,*,#1070,.T.);
#668=ORIENTED_EDGE('',*,*,#1053,.T.);
#669=ORIENTED_EDGE('',*,*,#1071,.T.);
#670=CARTESIAN_POINT('',(0.0,0.0,12.0));
#671=DIRECTION('',(0.0,0.0,-1.0));
#672=DIRECTION('',(0.0,-1.0,0.0));
#673=ORIENTED_EDGE('',*,*,#1061,.F.);
#674=ORIENTED_EDGE('',*,*,#1010,.T.);
#675=ORIENTED_EDGE('',*,*,#1066,.F.);
#676=ORIENTED_EDGE('',*,*,#1064,.F.);
#677=ORIENTED_EDGE('',*,*,#1041,.T.);
#678=ORIENTED_EDGE('',*,*,#1072,.F.);
#679=ORIENTED_EDGE('',*,*,#1051,.F.);
#680=ORIENTED_EDGE('',*,*,#1073,.T.);
#681=ORIENTED_EDGE('',*,*,#1074,.T.);
#682=ORIENTED_EDGE('',*,*,#1075,.T.);
#683=ORIENTED_EDGE('',*,*,#1076,.T.);
#684=ORIENTED_EDGE('',*,*,#1077,.T.);
#685=ORIENTED_EDGE('',*,*,#1058,.F.);
#686=ORIENTED_EDGE('',*,*,#1015,.F.);
#687=ORIENTED_EDGE('',*,*,#1017,.T.);
#688=ORIENTED_EDGE('',*,*,#1063,.F.);
#689=ORIENTED_EDGE('',*,*,#1078,.F.);
#690=ORIENTED_EDGE('',*,*,#1079,.F.);
#691=ORIENTED_EDGE('',*,*,#1036,.F.);
#692=ORIENTED_EDGE('',*,*,#1080,.F.);
#693=ORIENTED_EDGE('',*,*,#1081,.F.);
#694=ORIENTED_EDGE('',*,*,#1082,.F.);
#695=CARTESIAN_POINT('',(0.0,0.0,5.0));
#696=DIRECTION('',(0.0,0.0,1.0));
#697=DIRECTION('',(1.0,0.0,0.0));
#698=ORIENTED_EDGE('',*,*,#1083,.F.);
#699=ORIENTED_EDGE('',*,*,#1084,.T.);
#700=ORIENTED_EDGE('',*,*,#1085,.T.);
#701=ORIENTED_EDGE('',*,*,#1086,.T.);
#702=ORIENTED_EDGE('',*,*,#1087,.T.);
#703=ORIENTED_EDGE('',*,*,#1088,.T.);
#704=ORIENTED_EDGE('',*,*,#1049,.F.);
#705=ORIENTED_EDGE('',*,*,#1048,.F.);
#706=ORIENTED_EDGE('',*,*,#1089,.T.);
#707=ORIENTED_EDGE('',*,*,#1090,.T.);
#708=ORIENTED_EDGE('',*,*,#1091,.T.);
#709=ORIENTED_EDGE('',*,*,#1092,.T.);
#710=ORIENTED_EDGE('',*,*,#1093,.T.);
#711=ORIENTED_EDGE('',*,*,#1094,.T.);
#712=CARTESIAN_POINT('',(69.045030733358,25.0,2.0));
#713=DIRECTION('',(0.0,0.0,1.0));
#714=DIRECTION('',(1.0,0.0,0.0));
#715=ORIENTED_EDGE('',*,*,#1000,.T.);
#716=ORIENTED_EDGE('',*,*,#1095,.T.);
#717=ORIENTED_EDGE('',*,*,#1075,.F.);
#718=ORIENTED_EDGE('',*,*,#1096,.F.);
#719=CARTESIAN_POINT('',(79.5,1.7347234759768E-15,0.0));
#720=DIRECTION('',(0.0,-1.0,0.0));
#721=DIRECTION('',(0.0,0.0,-1.0));
#722=ORIENTED_EDGE('',*,*,#1082,.T.);
#723=ORIENTED_EDGE('',*,*,#1094,.F.);
#724=CARTESIAN_POINT('',(69.045030733358,25.0,5.0));
#725=DIRECTION('',(0.0,0.0,-1.0));
#726=DIRECTION('',(1.0,0.0,0.0));
#727=ORIENTED_EDGE('',*,*,#1004,.T.);
#728=ORIENTED_EDGE('',*,*,#1054,.T.);
#729=ORIENTED_EDGE('',*,*,#1070,.F.);
#730=ORIENTED_EDGE('',*,*,#1097,.F.);
#731=CARTESIAN_POINT('',(49.045030733358,9.5,0.0));
#732=DIRECTION('',(-1.0,-6.12303176911189E-17,0.0));
#733=DIRECTION('',(-6.12303176911189E-17,1.0,0.0));
#734=ORIENTED_EDGE('',*,*,#1097,.T.);
#735=ORIENTED_EDGE('',*,*,#1069,.F.);
#736=ORIENTED_EDGE('',*,*,#1043,.F.);
#737=ORIENTED_EDGE('',*,*,#1005,.T.);
#738=CARTESIAN_POINT('',(50.045030733358,15.0,0.0));
#739=DIRECTION('',(-0.707106781186548,0.707106781186548,0.0));
#740=DIRECTION('',(0.0,0.0,1.0));
#741=ORIENTED_EDGE('',*,*,#1071,.F.);
#742=ORIENTED_EDGE('',*,*,#1052,.F.);
#743=ORIENTED_EDGE('',*,*,#1072,.T.);
#744=ORIENTED_EDGE('',*,*,#1045,.T.);
#745=CARTESIAN_POINT('',(54.045030733358,10.5,5.0));
#746=DIRECTION('',(1.0,6.12303176911189E-17,0.0));
#747=DIRECTION('',(-6.12303176911189E-17,1.0,0.0));
#748=ORIENTED_EDGE('',*,*,#1098,.F.);
#749=ORIENTED_EDGE('',*,*,#1078,.T.);
#750=ORIENTED_EDGE('',*,*,#1099,.T.);
#751=ORIENTED_EDGE('',*,*,#989,.F.);
#752=CARTESIAN_POINT('',(79.045030733358,11.15,5.0));
#753=DIRECTION('',(0.0,-1.0,0.0));
#754=DIRECTION('',(0.0,0.0,-1.0));
#755=ORIENTED_EDGE('',*,*,#1099,.F.);
#756=ORIENTED_EDGE('',*,*,#1080,.T.);
#757=ORIENTED_EDGE('',*,*,#1035,.T.);
#758=ORIENTED_EDGE('',*,*,#990,.F.);
#759=CARTESIAN_POINT('',(59.045030733358,7.05,5.0));
#760=DIRECTION('',(0.0,0.0,-1.0));
#761=DIRECTION('',(1.0,0.0,0.0));
#762=ORIENTED_EDGE('',*,*,#1037,.F.);
#763=ORIENTED_EDGE('',*,*,#1079,.T.);
#764=ORIENTED_EDGE('',*,*,#1098,.T.);
#765=ORIENTED_EDGE('',*,*,#988,.F.);
#766=CARTESIAN_POINT('',(99.045030733358,7.05,5.0));
#767=DIRECTION('',(0.0,0.0,-1.0));
#768=DIRECTION('',(1.0,0.0,0.0));
#769=ORIENTED_EDGE('',*,*,#1081,.T.);
#770=ORIENTED_EDGE('',*,*,#1034,.F.);
#771=CARTESIAN_POINT('',(89.045030733358,25.0,5.0));
#772=DIRECTION('',(0.0,0.0,-1.0));
#773=DIRECTION('',(1.0,0.0,0.0));
#774=ORIENTED_EDGE('',*,*,#1100,.F.);
#775=ORIENTED_EDGE('',*,*,#1021,.T.);
#776=ORIENTED_EDGE('',*,*,#1101,.F.);
#777=ORIENTED_EDGE('',*,*,#981,.F.);
#778=CARTESIAN_POINT('',(89.045030733358,25.0,5.0));
#779=DIRECTION('',(0.0,0.0,-1.0));
#780=DIRECTION('',(1.0,0.0,0.0));
#781=ORIENTED_EDGE('',*,*,#1102,.F.);
#782=ORIENTED_EDGE('',*,*,#1083,.T.);
#783=ORIENTED_EDGE('',*,*,#1103,.F.);
#784=ORIENTED_EDGE('',*,*,#968,.F.);
#785=CARTESIAN_POINT('',(69.045030733358,25.0,5.0));
#786=DIRECTION('',(0.0,0.0,-1.0));
#787=DIRECTION('',(1.0,0.0,0.0));
#788=ORIENTED_EDGE('',*,*,#969,.F.);
#789=ORIENTED_EDGE('',*,*,#1103,.T.);
#790=ORIENTED_EDGE('',*,*,#1093,.F.);
#791=ORIENTED_EDGE('',*,*,#1104,.F.);
#792=CARTESIAN_POINT('',(68.045030733358,19.75,0.0));
#793=DIRECTION('',(1.0,6.12303176911189E-17,0.0));
#794=DIRECTION('',(-6.12303176911189E-17,1.0,0.0));
#795=ORIENTED_EDGE('',*,*,#1092,.F.);
#796=ORIENTED_EDGE('',*,*,#1105,.F.);
#797=ORIENTED_EDGE('',*,*,#970,.F.);
#798=ORIENTED_EDGE('',*,*,#1104,.T.);
#799=CARTESIAN_POINT('',(68.545030733358,21.0,0.0));
#800=DIRECTION('',(0.0,0.0,1.0));
#801=DIRECTION('',(-1.0,0.0,0.0));
#802=ORIENTED_EDGE('',*,*,#1089,.F.);
#803=ORIENTED_EDGE('',*,*,#1047,.T.);
#804=ORIENTED_EDGE('',*,*,#973,.F.);
#805=ORIENTED_EDGE('',*,*,#1106,.T.);
#806=CARTESIAN_POINT('',(70.045030733358,19.75,0.0));
#807=DIRECTION('',(-1.0,6.12303176911189E-17,0.0));
#808=DIRECTION('',(-6.12303176911189E-17,-1.0,0.0));
#809=ORIENTED_EDGE('',*,*,#1091,.F.);
#810=ORIENTED_EDGE('',*,*,#1107,.F.);
#811=ORIENTED_EDGE('',*,*,#971,.F.);
#812=ORIENTED_EDGE('',*,*,#1105,.T.);
#813=CARTESIAN_POINT('',(69.045030733358,21.5,0.0));
#814=DIRECTION('',(-1.22460635382238E-16,-1.0,0.0));
#815=DIRECTION('',(1.0,-1.22460635382238E-16,0.0));
#816=ORIENTED_EDGE('',*,*,#1090,.F.);
#817=ORIENTED_EDGE('',*,*,#1106,.F.);
#818=ORIENTED_EDGE('',*,*,#972,.F.);
#819=ORIENTED_EDGE('',*,*,#1107,.T.);
#820=CARTESIAN_POINT('',(69.545030733358,21.0,0.0));
#821=DIRECTION('',(0.0,0.0,1.0));
#822=DIRECTION('',(-1.0,0.0,0.0));
#823=ORIENTED_EDGE('',*,*,#1108,.F.);
#824=ORIENTED_EDGE('',*,*,#998,.T.);
#825=ORIENTED_EDGE('',*,*,#1059,.T.);
#826=ORIENTED_EDGE('',*,*,#1077,.F.);
#827=CARTESIAN_POINT('',(106.045030733359,3.49999999999995,0.0));
#828=DIRECTION('',(1.0,6.12303176911189E-17,0.0));
#829=DIRECTION('',(-6.12303176911189E-17,1.0,0.0));
#830=ORIENTED_EDGE('',*,*,#1095,.F.);
#831=ORIENTED_EDGE('',*,*,#999,.T.);
#832=ORIENTED_EDGE('',*,*,#1108,.T.);
#833=ORIENTED_EDGE('',*,*,#1076,.F.);
#834=CARTESIAN_POINT('',(105.045030733359,0.999999999999965,0.0));
#835=DIRECTION('',(0.707106781186547,-0.707106781186548,0.0));
#836=DIRECTION('',(0.707106781186548,0.707106781186547,0.0));
#837=ORIENTED_EDGE('',*,*,#1050,.F.);
#838=ORIENTED_EDGE('',*,*,#1002,.T.);
#839=ORIENTED_EDGE('',*,*,#1109,.T.);
#840=ORIENTED_EDGE('',*,*,#1073,.F.);
#841=CARTESIAN_POINT('',(52.0450307333586,3.5,0.0));
#842=DIRECTION('',(-1.0,6.12303176911189E-17,0.0));
#843=DIRECTION('',(-6.12303176911189E-17,-1.0,0.0));
#844=ORIENTED_EDGE('',*,*,#1109,.F.);
#845=ORIENTED_EDGE('',*,*,#1001,.T.);
#846=ORIENTED_EDGE('',*,*,#1096,.T.);
#847=ORIENTED_EDGE('',*,*,#1074,.F.);
#848=CARTESIAN_POINT('',(53.0450307333586,1.0,0.0));
#849=DIRECTION('',(-0.707106781186547,-0.707106781186548,0.0));
#850=DIRECTION('',(0.707106781186548,-0.707106781186547,0.0));
#851=ORIENTED_EDGE('',*,*,#1029,.F.);
#852=ORIENTED_EDGE('',*,*,#1057,.T.);
#853=ORIENTED_EDGE('',*,*,#986,.F.);
#854=ORIENTED_EDGE('',*,*,#1110,.T.);
#855=CARTESIAN_POINT('',(90.045030733358,19.75,0.0));
#856=DIRECTION('',(-1.0,6.12303176911189E-17,0.0));
#857=DIRECTION('',(-6.12303176911189E-17,-1.0,0.0));
#858=ORIENTED_EDGE('',*,*,#982,.F.);
#859=ORIENTED_EDGE('',*,*,#1101,.T.);
#860=ORIENTED_EDGE('',*,*,#1033,.F.);
#861=ORIENTED_EDGE('',*,*,#1111,.F.);
#862=CARTESIAN_POINT('',(88.045030733358,19.75,0.0));
#863=DIRECTION('',(1.0,6.12303176911189E-17,0.0));
#864=DIRECTION('',(-6.12303176911189E-17,1.0,0.0));
#865=ORIENTED_EDGE('',*,*,#1032,.F.);
#866=ORIENTED_EDGE('',*,*,#1112,.F.);
#867=ORIENTED_EDGE('',*,*,#983,.F.);
#868=ORIENTED_EDGE('',*,*,#1111,.T.);
#869=CARTESIAN_POINT('',(88.545030733358,21.0,0.0));
#870=DIRECTION('',(0.0,0.0,1.0));
#871=DIRECTION('',(-1.0,0.0,0.0));
#872=ORIENTED_EDGE('',*,*,#1031,.F.);
#873=ORIENTED_EDGE('',*,*,#1113,.F.);
#874=ORIENTED_EDGE('',*,*,#984,.F.);
#875=ORIENTED_EDGE('',*,*,#1112,.T.);
#876=CARTESIAN_POINT('',(89.045030733358,21.5,0.0));
#877=DIRECTION('',(-1.22460635382238E-16,-1.0,0.0));
#878=DIRECTION('',(1.0,-1.22460635382238E-16,0.0));
#879=ORIENTED_EDGE('',*,*,#1030,.F.);
#880=ORIENTED_EDGE('',*,*,#1110,.F.);
#881=ORIENTED_EDGE('',*,*,#985,.F.);
#882=ORIENTED_EDGE('',*,*,#1113,.T.);
#883=CARTESIAN_POINT('',(89.545030733358,21.0,0.0));
#884=DIRECTION('',(0.0,0.0,1.0));
#885=DIRECTION('',(-1.0,0.0,0.0));
#886=ORIENTED_EDGE('',*,*,#976,.F.);
#887=ORIENTED_EDGE('',*,*,#1056,.T.);
#888=ORIENTED_EDGE('',*,*,#1026,.F.);
#889=ORIENTED_EDGE('',*,*,#1114,.F.);
#890=CARTESIAN_POINT('',(90.045030733358,30.25,0.0));
#891=DIRECTION('',(-1.0,6.12303176911189E-17,0.0));
#892=DIRECTION('',(-6.12303176911189E-17,-1.0,0.0));
#893=ORIENTED_EDGE('',*,*,#1022,.F.);
#894=ORIENTED_EDGE('',*,*,#1100,.T.);
#895=ORIENTED_EDGE('',*,*,#980,.F.);
#896=ORIENTED_EDGE('',*,*,#1115,.T.);
#897=CARTESIAN_POINT('',(88.045030733358,30.25,0.0));
#898=DIRECTION('',(1.0,6.12303176911189E-17,0.0));
#899=DIRECTION('',(-6.12303176911189E-17,1.0,0.0));
#900=ORIENTED_EDGE('',*,*,#1025,.F.);
#901=ORIENTED_EDGE('',*,*,#1116,.F.);
#902=ORIENTED_EDGE('',*,*,#977,.F.);
#903=ORIENTED_EDGE('',*,*,#1114,.T.);
#904=CARTESIAN_POINT('',(89.545030733358,29.0,0.0));
#905=DIRECTION('',(0.0,0.0,1.0));
#906=DIRECTION('',(-1.0,0.0,0.0));
#907=ORIENTED_EDGE('',*,*,#1024,.F.);
#908=ORIENTED_EDGE('',*,*,#1117,.F.);
#909=ORIENTED_EDGE('',*,*,#978,.F.);
#910=ORIENTED_EDGE('',*,*,#1116,.T.);
#911=CARTESIAN_POINT('',(89.045030733358,28.5,0.0));
#912=DIRECTION('',(0.0,1.0,0.0));
#913=DIRECTION('',(-1.0,0.0,0.0));
#914=ORIENTED_EDGE('',*,*,#1023,.F.);
#915=ORIENTED_EDGE('',*,*,#1115,.F.);
#916=ORIENTED_EDGE('',*,*,#979,.F.);
#917=ORIENTED_EDGE('',*,*,#1117,.T.);
#918=CARTESIAN_POINT('',(88.545030733358,29.0,0.0));
#919=DIRECTION('',(0.0,0.0,1.0));
#920=DIRECTION('',(-1.0,0.0,0.0));
#921=ORIENTED_EDGE('',*,*,#1087,.F.);
#922=ORIENTED_EDGE('',*,*,#1118,.F.);
#923=ORIENTED_EDGE('',*,*,#964,.F.);
#924=ORIENTED_EDGE('',*,*,#1119,.T.);
#925=CARTESIAN_POINT('',(69.545030733358,29.0,0.0));
#926=DIRECTION('',(0.0,0.0,1.0));
#927=DIRECTION('',(-1.0,0.0,0.0));
#928=ORIENTED_EDGE('',*,*,#1086,.F.);
#929=ORIENTED_EDGE('',*,*,#1120,.F.);
#930=ORIENTED_EDGE('',*,*,#965,.F.);
#931=ORIENTED_EDGE('',*,*,#1118,.T.);
#932=CARTESIAN_POINT('',(69.045030733358,28.5,0.0));
#933=DIRECTION('',(0.0,1.0,0.0));
#934=DIRECTION('',(-1.0,0.0,0.0));
#935=ORIENTED_EDGE('',*,*,#1085,.F.);
#936=ORIENTED_EDGE('',*,*,#1121,.F.);
#937=ORIENTED_EDGE('',*,*,#966,.F.);
#938=ORIENTED_EDGE('',*,*,#1120,.T.);
#939=CARTESIAN_POINT('',(68.545030733358,29.0,0.0));
#940=DIRECTION('',(0.0,0.0,1.0));
#941=DIRECTION('',(-1.0,0.0,0.0));
#942=ORIENTED_EDGE('',*,*,#1084,.F.);
#943=ORIENTED_EDGE('',*,*,#1102,.T.);
#944=ORIENTED_EDGE('',*,*,#967,.F.);
#945=ORIENTED_EDGE('',*,*,#1121,.T.);
#946=CARTESIAN_POINT('',(68.045030733358,30.25,0.0));
#947=DIRECTION('',(1.0,6.12303176911189E-17,0.0));
#948=DIRECTION('',(-6.12303176911189E-17,1.0,0.0));
#949=ORIENTED_EDGE('',*,*,#963,.F.);
#950=ORIENTED_EDGE('',*,*,#1046,.T.);
#951=ORIENTED_EDGE('',*,*,#1088,.F.);
#952=ORIENTED_EDGE('',*,*,#1119,.F.);
#953=CARTESIAN_POINT('',(70.045030733358,30.25,0.0));
#954=DIRECTION('',(-1.0,6.12303176911189E-17,0.0));
#955=DIRECTION('',(-6.12303176911189E-17,-1.0,0.0));
#956=EDGE_CURVE('',#1122,#1122,#1123,.F.);
#957=EDGE_CURVE('',#1124,#1124,#1125,.F.);
#958=EDGE_CURVE('',#1126,#1126,#1127,.T.);
#959=CARTESIAN_POINT('',(52.0450307331863,15.3716878365287,8.99999999922279));
#960=EDGE_CURVE('',#1128,#1128,#1129,.F.);
#961=EDGE_CURVE('',#1130,#1130,#1131,.F.);
#962=EDGE_CURVE('',#1132,#1133,#1134,.T.);
#963=EDGE_CURVE('',#1133,#1135,#1136,.T.);
#964=EDGE_CURVE('',#1135,#1137,#1138,.T.);
#965=EDGE_CURVE('',#1137,#1139,#1140,.T.);
#966=EDGE_CURVE('',#1139,#1141,#1142,.T.);
#967=EDGE_CURVE('',#1141,#1143,#1144,.T.);
#968=EDGE_CURVE('',#1143,#1145,#1146,.T.);
#969=EDGE_CURVE('',#1145,#1147,#1148,.T.);
#970=EDGE_CURVE('',#1147,#1149,#1150,.T.);
#971=EDGE_CURVE('',#1149,#1151,#1152,.T.);
#972=EDGE_CURVE('',#1151,#1153,#1154,.T.);
#973=EDGE_CURVE('',#1153,#1155,#1156,.T.);
#974=EDGE_CURVE('',#1155,#1132,#1157,.T.);
#975=EDGE_CURVE('',#1158,#1159,#1160,.T.);
#976=EDGE_CURVE('',#1159,#1161,#1162,.T.);
#977=EDGE_CURVE('',#1161,#1163,#1164,.T.);
#978=EDGE_CURVE('',#1163,#1165,#1166,.T.);
#979=EDGE_CURVE('',#1165,#1167,#1168,.T.);
#980=EDGE_CURVE('',#1167,#1169,#1170,.T.);
#981=EDGE_CURVE('',#1169,#1171,#1172,.T.);
#982=EDGE_CURVE('',#1171,#1173,#1174,.T.);
#983=EDGE_CURVE('',#1173,#1175,#1176,.T.);
#984=EDGE_CURVE('',#1175,#1177,#1178,.T.);
#985=EDGE_CURVE('',#1177,#1179,#1180,.T.);
#986=EDGE_CURVE('',#1179,#1181,#1182,.T.);
#987=EDGE_CURVE('',#1181,#1158,#1183,.T.);
#988=EDGE_CURVE('',#1184,#1185,#1186,.T.);
#989=EDGE_CURVE('',#1185,#1187,#1188,.T.);
#990=EDGE_CURVE('',#1187,#1189,#1190,.T.);
#991=EDGE_CURVE('',#1189,#1184,#1191,.T.);
#992=EDGE_CURVE('',#1192,#1193,#1194,.T.);
#993=EDGE_CURVE('',#1195,#1192,#1196,.T.);
#994=EDGE_CURVE('',#1197,#1195,#1198,.T.);
#995=EDGE_CURVE('',#1199,#1197,#1200,.T.);
#996=EDGE_CURVE('',#1201,#1199,#1202,.T.);
#997=EDGE_CURVE('',#1203,#1201,#1204,.T.);
#998=EDGE_CURVE('',#1205,#1203,#1206,.T.);
#999=EDGE_CURVE('',#1207,#1205,#1208,.T.);
#1000=EDGE_CURVE('',#1209,#1207,#1210,.T.);
#1001=EDGE_CURVE('',#1211,#1209,#1212,.T.);
#1002=EDGE_CURVE('',#1213,#1211,#1214,.T.);
#1003=EDGE_CURVE('',#1215,#1213,#1216,.T.);
#1004=EDGE_CURVE('',#1217,#1215,#1218,.T.);
#1005=EDGE_CURVE('',#1219,#1217,#1220,.T.);
#1006=EDGE_CURVE('',#1221,#1219,#1222,.T.);
#1007=EDGE_CURVE('',#1223,#1221,#1224,.T.);
#1008=EDGE_CURVE('',#1225,#1223,#1226,.T.);
#1009=EDGE_CURVE('',#1225,#1193,#1227,.T.);
#1010=EDGE_CURVE('',#1228,#1229,#1230,.T.);
#1011=EDGE_CURVE('',#1228,#1193,#1231,.T.);
#1012=EDGE_CURVE('',#1229,#1225,#1232,.T.);
#1013=EDGE_CURVE('',#1233,#1234,#1235,.T.);
#1014=EDGE_CURVE('',#1236,#1233,#1237,.T.);
#1015=EDGE_CURVE('',#1236,#1238,#1239,.T.);
#1016=EDGE_CURVE('',#1238,#1234,#1240,.T.);
#1017=EDGE_CURVE('',#1236,#1241,#1242,.T.);
#1018=EDGE_CURVE('',#1243,#1233,#1244,.T.);
#1019=EDGE_CURVE('',#1197,#1243,#1245,.T.);
#1020=EDGE_CURVE('',#1241,#1195,#1246,.T.);
#1021=EDGE_CURVE('',#1247,#1248,#1249,.T.);
#1022=EDGE_CURVE('',#1247,#1250,#1251,.T.);
#1023=EDGE_CURVE('',#1250,#1252,#1253,.T.);
#1024=EDGE_CURVE('',#1252,#1254,#1255,.T.);
#1025=EDGE_CURVE('',#1254,#1256,#1257,.T.);
#1026=EDGE_CURVE('',#1256,#1258,#1259,.T.);
#1027=EDGE_CURVE('',#1260,#1258,#1261,.T.);
#1028=EDGE_CURVE('',#1262,#1260,#1263,.T.);
#1029=EDGE_CURVE('',#1262,#1264,#1265,.T.);
#1030=EDGE_CURVE('',#1264,#1266,#1267,.T.);
#1031=EDGE_CURVE('',#1266,#1268,#1269,.T.);
#1032=EDGE_CURVE('',#1268,#1270,#1271,.T.);
#1033=EDGE_CURVE('',#1270,#1248,#1272,.T.);
#1034=EDGE_CURVE('',#1273,#1273,#1274,.T.);
#1035=EDGE_CURVE('',#1275,#1189,#1276,.T.);
#1036=EDGE_CURVE('',#1275,#1277,#1278,.T.);
#1037=EDGE_CURVE('',#1277,#1184,#1279,.T.);
#1038=EDGE_CURVE('',#1234,#1280,#1281,.T.);
#1039=EDGE_CURVE('',#1280,#1282,#1283,.T.);
#1040=EDGE_CURVE('',#1282,#1243,#1284,.T.);
#1041=EDGE_CURVE('',#1285,#1286,#1287,.T.);
#1042=EDGE_CURVE('',#1285,#1221,#1288,.T.);
#1043=EDGE_CURVE('',#1219,#1289,#1290,.T.);
#1044=EDGE_CURVE('',#1291,#1289,#1292,.T.);
#1045=EDGE_CURVE('',#1286,#1291,#1293,.T.);
#1046=EDGE_CURVE('',#1133,#1294,#1295,.F.);
#1047=EDGE_CURVE('',#1296,#1155,#1297,.T.);
#1048=EDGE_CURVE('',#1296,#1298,#1299,.T.);
#1049=EDGE_CURVE('',#1298,#1294,#1300,.T.);
#1050=EDGE_CURVE('',#1213,#1301,#1302,.T.);
#1051=EDGE_CURVE('',#1301,#1303,#1304,.T.);
#1052=EDGE_CURVE('',#1303,#1305,#1306,.T.);
#1053=EDGE_CURVE('',#1307,#1305,#1308,.T.);
#1054=EDGE_CURVE('',#1215,#1307,#1309,.T.);
#1055=EDGE_CURVE('',#1199,#1282,#1310,.T.);
#1056=EDGE_CURVE('',#1159,#1258,#1311,.F.);
#1057=EDGE_CURVE('',#1262,#1181,#1312,.T.);
#1058=EDGE_CURVE('',#1238,#1313,#1314,.T.);
#1059=EDGE_CURVE('',#1203,#1313,#1315,.T.);
#1060=EDGE_CURVE('',#1201,#1280,#1316,.T.);
#1061=EDGE_CURVE('',#1228,#1317,#1318,.T.);
#1062=EDGE_CURVE('',#1317,#1192,#1319,.T.);
#1063=EDGE_CURVE('',#1317,#1241,#1320,.T.);
#1064=EDGE_CURVE('',#1285,#1321,#1322,.T.);
#1065=EDGE_CURVE('',#1321,#1223,#1323,.T.);
#1066=EDGE_CURVE('',#1321,#1229,#1324,.T.);
#1067=EDGE_CURVE('',#1325,#1325,#1326,.T.);
#1068=CARTESIAN_POINT('',(106.045030733186,15.3716878369349,9.00000000069856));
#1069=EDGE_CURVE('',#1289,#1327,#1328,.T.);
#1070=EDGE_CURVE('',#1327,#1307,#1329,.T.);
#1071=EDGE_CURVE('',#1305,#1291,#1330,.T.);
#1072=EDGE_CURVE('',#1303,#1286,#1331,.T.);
#1073=EDGE_CURVE('',#1301,#1332,#1333,.T.);
#1074=EDGE_CURVE('',#1332,#1334,#1335,.T.);
#1075=EDGE_CURVE('',#1334,#1336,#1337,.T.);
#1076=EDGE_CURVE('',#1336,#1338,#1339,.T.);
#1077=EDGE_CURVE('',#1338,#1313,#1340,.T.);
#1078=EDGE_CURVE('',#1341,#1342,#1343,.T.);
#1079=EDGE_CURVE('',#1277,#1341,#1344,.T.);
#1080=EDGE_CURVE('',#1342,#1275,#1345,.T.);
#1081=EDGE_CURVE('',#1346,#1346,#1347,.T.);
#1082=EDGE_CURVE('',#1348,#1348,#1349,.T.);
#1083=EDGE_CURVE('',#1350,#1351,#1352,.T.);
#1084=EDGE_CURVE('',#1350,#1353,#1354,.T.);
#1085=EDGE_CURVE('',#1353,#1355,#1356,.T.);
#1086=EDGE_CURVE('',#1355,#1357,#1358,.T.);
#1087=EDGE_CURVE('',#1357,#1359,#1360,.T.);
#1088=EDGE_CURVE('',#1359,#1294,#1361,.T.);
#1089=EDGE_CURVE('',#1296,#1362,#1363,.T.);
#1090=EDGE_CURVE('',#1362,#1364,#1365,.T.);
#1091=EDGE_CURVE('',#1364,#1366,#1367,.T.);
#1092=EDGE_CURVE('',#1366,#1368,#1369,.T.);
#1093=EDGE_CURVE('',#1368,#1351,#1370,.T.);
#1094=EDGE_CURVE('',#1371,#1371,#1372,.T.);
#1095=EDGE_CURVE('',#1207,#1336,#1373,.T.);
#1096=EDGE_CURVE('',#1209,#1334,#1374,.T.);
#1097=EDGE_CURVE('',#1217,#1327,#1375,.T.);
#1098=EDGE_CURVE('',#1341,#1185,#1376,.T.);
#1099=EDGE_CURVE('',#1342,#1187,#1377,.T.);
#1100=EDGE_CURVE('',#1247,#1169,#1378,.T.);
#1101=EDGE_CURVE('',#1171,#1248,#1379,.F.);
#1102=EDGE_CURVE('',#1350,#1143,#1380,.T.);
#1103=EDGE_CURVE('',#1145,#1351,#1381,.F.);
#1104=EDGE_CURVE('',#1147,#1368,#1382,.T.);
#1105=EDGE_CURVE('',#1149,#1366,#1383,.T.);
#1106=EDGE_CURVE('',#1153,#1362,#1384,.T.);
#1107=EDGE_CURVE('',#1151,#1364,#1385,.T.);
#1108=EDGE_CURVE('',#1205,#1338,#1386,.T.);
#1109=EDGE_CURVE('',#1211,#1332,#1387,.T.);
#1110=EDGE_CURVE('',#1179,#1264,#1388,.T.);
#1111=EDGE_CURVE('',#1173,#1270,#1389,.T.);
#1112=EDGE_CURVE('',#1175,#1268,#1390,.T.);
#1113=EDGE_CURVE('',#1177,#1266,#1391,.T.);
#1114=EDGE_CURVE('',#1161,#1256,#1392,.T.);
#1115=EDGE_CURVE('',#1167,#1250,#1393,.T.);
#1116=EDGE_CURVE('',#1163,#1254,#1394,.T.);
#1117=EDGE_CURVE('',#1165,#1252,#1395,.T.);
#1118=EDGE_CURVE('',#1137,#1357,#1396,.T.);
#1119=EDGE_CURVE('',#1135,#1359,#1397,.T.);
#1120=EDGE_CURVE('',#1139,#1355,#1398,.T.);
#1121=EDGE_CURVE('',#1141,#1353,#1399,.T.);
#1122=VERTEX_POINT('',#1400);
#1123=CIRCLE('',#1401,1.25);
#1124=VERTEX_POINT('',#1402);
#1125=CIRCLE('',#1403,1.25);
#1126=VERTEX_POINT('',#1404);
#1127=CIRCLE('',#1405,1.25);
#1128=VERTEX_POINT('',#1406);
#1129=CIRCLE('',#1407,1.25);
#1130=VERTEX_POINT('',#1408);
#1131=CIRCLE('',#1409,1.25);
#1132=VERTEX_POINT('',#1410);
#1133=VERTEX_POINT('',#1411);
#1134=CIRCLE('',#1412,6.0);
#1135=VERTEX_POINT('',#1413);
#1136=LINE('',#1414,#1415);
#1137=VERTEX_POINT('',#1416);
#1138=CIRCLE('',#1417,0.5);
#1139=VERTEX_POINT('',#1418);
#1140=LINE('',#1419,#1420);
#1141=VERTEX_POINT('',#1421);
#1142=CIRCLE('',#1422,0.5);
#1143=VERTEX_POINT('',#1423);
#1144=LINE('',#1424,#1425);
#1145=VERTEX_POINT('',#1426);
#1146=CIRCLE('',#1427,6.0);
#1147=VERTEX_POINT('',#1428);
#1148=LINE('',#1429,#1430);
#1149=VERTEX_POINT('',#1431);
#1150=CIRCLE('',#1432,0.5);
#1151=VERTEX_POINT('',#1433);
#1152=LINE('',#1434,#1435);
#1153=VERTEX_POINT('',#1436);
#1154=CIRCLE('',#1437,0.5);
#1155=VERTEX_POINT('',#1438);
#1156=LINE('',#1439,#1440);
#1157=CIRCLE('',#1441,6.0);
#1158=VERTEX_POINT('',#1442);
#1159=VERTEX_POINT('',#1443);
#1160=CIRCLE('',#1444,6.0);
#1161=VERTEX_POINT('',#1445);
#1162=LINE('',#1446,#1447);
#1163=VERTEX_POINT('',#1448);
#1164=CIRCLE('',#1449,0.5);
#1165=VERTEX_POINT('',#1450);
#1166=LINE('',#1451,#1452);
#1167=VERTEX_POINT('',#1453);
#1168=CIRCLE('',#1454,0.5);
#1169=VERTEX_POINT('',#1455);
#1170=LINE('',#1456,#1457);
#1171=VERTEX_POINT('',#1458);
#1172=CIRCLE('',#1459,6.0);
#1173=VERTEX_POINT('',#1460);
#1174=LINE('',#1461,#1462);
#1175=VERTEX_POINT('',#1463);
#1176=CIRCLE('',#1464,0.5);
#1177=VERTEX_POINT('',#1465);
#1178=LINE('',#1466,#1467);
#1179=VERTEX_POINT('',#1468);
#1180=CIRCLE('',#1469,0.5);
#1181=VERTEX_POINT('',#1470);
#1182=LINE('',#1471,#1472);
#1183=CIRCLE('',#1473,6.0);
#1184=VERTEX_POINT('',#1474);
#1185=VERTEX_POINT('',#1475);
#1186=CIRCLE('',#1476,4.1);
#1187=VERTEX_POINT('',#1477);
#1188=LINE('',#1478,#1479);
#1189=VERTEX_POINT('',#1480);
#1190=CIRCLE('',#1481,4.1);
#1191=LINE('',#1482,#1483);
#1192=VERTEX_POINT('',#1484);
#1193=VERTEX_POINT('',#1485);
#1194=CIRCLE('',#1486,10.0);
#1195=VERTEX_POINT('',#1487);
#1196=LINE('',#1488,#1489);
#1197=VERTEX_POINT('',#1490);
#1198=LINE('',#1491,#1492);
#1199=VERTEX_POINT('',#1493);
#1200=LINE('',#1494,#1495);
#1201=VERTEX_POINT('',#1496);
#1202=LINE('',#1497,#1498);
#1203=VERTEX_POINT('',#1499);
#1204=LINE('',#1500,#1501);
#1205=VERTEX_POINT('',#1502);
#1206=LINE('',#1503,#1504);
#1207=VERTEX_POINT('',#1505);
#1208=LINE('',#1506,#1507);
#1209=VERTEX_POINT('',#1508);
#1210=LINE('',#1509,#1510);
#1211=VERTEX_POINT('',#1511);
#1212=LINE('',#1512,#1513);
#1213=VERTEX_POINT('',#1514);
#1214=LINE('',#1515,#1516);
#1215=VERTEX_POINT('',#1517);
#1216=LINE('',#1518,#1519);
#1217=VERTEX_POINT('',#1520);
#1218=LINE('',#1521,#1522);
#1219=VERTEX_POINT('',#1523);
#1220=LINE('',#1524,#1525);
#1221=VERTEX_POINT('',#1526);
#1222=LINE('',#1527,#1528);
#1223=VERTEX_POINT('',#1529);
#1224=LINE('',#1530,#1531);
#1225=VERTEX_POINT('',#1532);
#1226=CIRCLE('',#1533,10.0);
#1227=LINE('',#1534,#1535);
#1228=VERTEX_POINT('',#1536);
#1229=VERTEX_POINT('',#1537);
#1230=LINE('',#1538,#1539);
#1231=LINE('',#1540,#1541);
#1232=LINE('',#1542,#1543);
#1233=VERTEX_POINT('',#1544);
#1234=VERTEX_POINT('',#1545);
#1235=LINE('',#1546,#1547);
#1236=VERTEX_POINT('',#1548);
#1237=LINE('',#1549,#1550);
#1238=VERTEX_POINT('',#1551);
#1239=LINE('',#1552,#1553);
#1240=LINE('',#1554,#1555);
#1241=VERTEX_POINT('',#1556);
#1242=LINE('',#1557,#1558);
#1243=VERTEX_POINT('',#1559);
#1244=LINE('',#1560,#1561);
#1245=LINE('',#1562,#1563);
#1246=LINE('',#1564,#1565);
#1247=VERTEX_POINT('',#1566);
#1248=VERTEX_POINT('',#1567);
#1249=CIRCLE('',#1568,6.0);
#1250=VERTEX_POINT('',#1569);
#1251=LINE('',#1570,#1571);
#1252=VERTEX_POINT('',#1572);
#1253=CIRCLE('',#1573,0.5);
#1254=VERTEX_POINT('',#1574);
#1255=LINE('',#1575,#1576);
#1256=VERTEX_POINT('',#1577);
#1257=CIRCLE('',#1578,0.5);
#1258=VERTEX_POINT('',#1579);
#1259=LINE('',#1580,#1581);
#1260=VERTEX_POINT('',#1582);
#1261=CIRCLE('',#1583,6.0);
#1262=VERTEX_POINT('',#1584);
#1263=CIRCLE('',#1585,6.0);
#1264=VERTEX_POINT('',#1586);
#1265=LINE('',#1587,#1588);
#1266=VERTEX_POINT('',#1589);
#1267=CIRCLE('',#1590,0.5);
#1268=VERTEX_POINT('',#1591);
#1269=LINE('',#1592,#1593);
#1270=VERTEX_POINT('',#1594);
#1271=CIRCLE('',#1595,0.5);
#1272=LINE('',#1596,#1597);
#1273=VERTEX_POINT('',#1598);
#1274=CIRCLE('',#1599,9.0);
#1275=VERTEX_POINT('',#1600);
#1276=LINE('',#1601,#1602);
#1277=VERTEX_POINT('',#1603);
#1278=LINE('',#1604,#1605);
#1279=LINE('',#1606,#1607);
#1280=VERTEX_POINT('',#1608);
#1281=LINE('',#1609,#1610);
#1282=VERTEX_POINT('',#1611);
#1283=LINE('',#1612,#1613);
#1284=LINE('',#1614,#1615);
#1285=VERTEX_POINT('',#1616);
#1286=VERTEX_POINT('',#1617);
#1287=LINE('',#1618,#1619);
#1288=LINE('',#1620,#1621);
#1289=VERTEX_POINT('',#1622);
#1290=LINE('',#1623,#1624);
#1291=VERTEX_POINT('',#1625);
#1292=LINE('',#1626,#1627);
#1293=LINE('',#1628,#1629);
#1294=VERTEX_POINT('',#1630);
#1295=LINE('',#1631,#1632);
#1296=VERTEX_POINT('',#1633);
#1297=LINE('',#1634,#1635);
#1298=VERTEX_POINT('',#1636);
#1299=CIRCLE('',#1637,6.0);
#1300=CIRCLE('',#1638,6.0);
#1301=VERTEX_POINT('',#1639);
#1302=LINE('',#1640,#1641);
#1303=VERTEX_POINT('',#1642);
#1304=LINE('',#1643,#1644);
#1305=VERTEX_POINT('',#1645);
#1306=LINE('',#1646,#1647);
#1307=VERTEX_POINT('',#1648);
#1308=LINE('',#1649,#1650);
#1309=LINE('',#1651,#1652);
#1310=LINE('',#1653,#1654);
#1311=LINE('',#1655,#1656);
#1312=LINE('',#1657,#1658);
#1313=VERTEX_POINT('',#1659);
#1314=LINE('',#1660,#1661);
#1315=LINE('',#1662,#1663);
#1316=LINE('',#1664,#1665);
#1317=VERTEX_POINT('',#1666);
#1318=CIRCLE('',#1667,10.0);
#1319=LINE('',#1668,#1669);
#1320=LINE('',#1670,#1671);
#1321=VERTEX_POINT('',#1672);
#1322=LINE('',#1673,#1674);
#1323=LINE('',#1675,#1676);
#1324=CIRCLE('',#1677,10.0);
#1325=VERTEX_POINT('',#1678);
#1326=CIRCLE('',#1679,1.25);
#1327=VERTEX_POINT('',#1680);
#1328=LINE('',#1681,#1682);
#1329=LINE('',#1683,#1684);
#1330=LINE('',#1685,#1686);
#1331=LINE('',#1687,#1688);
#1332=VERTEX_POINT('',#1689);
#1333=LINE('',#1690,#1691);
#1334=VERTEX_POINT('',#1692);
#1335=LINE('',#1693,#1694);
#1336=VERTEX_POINT('',#1695);
#1337=LINE('',#1696,#1697);
#1338=VERTEX_POINT('',#1698);
#1339=LINE('',#1699,#1700);
#1340=LINE('',#1701,#1702);
#1341=VERTEX_POINT('',#1703);
#1342=VERTEX_POINT('',#1704);
#1343=LINE('',#1705,#1706);
#1344=CIRCLE('',#1707,4.1);
#1345=CIRCLE('',#1708,4.1);
#1346=VERTEX_POINT('',#1709);
#1347=CIRCLE('',#1710,9.0);
#1348=VERTEX_POINT('',#1711);
#1349=CIRCLE('',#1712,9.0);
#1350=VERTEX_POINT('',#1713);
#1351=VERTEX_POINT('',#1714);
#1352=CIRCLE('',#1715,6.0);
#1353=VERTEX_POINT('',#1716);
#1354=LINE('',#1717,#1718);
#1355=VERTEX_POINT('',#1719);
#1356=CIRCLE('',#1720,0.5);
#1357=VERTEX_POINT('',#1721);
#1358=LINE('',#1722,#1723);
#1359=VERTEX_POINT('',#1724);
#1360=CIRCLE('',#1725,0.5);
#1361=LINE('',#1726,#1727);
#1362=VERTEX_POINT('',#1728);
#1363=LINE('',#1729,#1730);
#1364=VERTEX_POINT('',#1731);
#1365=CIRCLE('',#1732,0.5);
#1366=VERTEX_POINT('',#1733);
#1367=LINE('',#1734,#1735);
#1368=VERTEX_POINT('',#1736);
#1369=CIRCLE('',#1737,0.5);
#1370=LINE('',#1738,#1739);
#1371=VERTEX_POINT('',#1740);
#1372=CIRCLE('',#1741,9.0);
#1373=LINE('',#1742,#1743);
#1374=LINE('',#1744,#1745);
#1375=LINE('',#1746,#1747);
#1376=LINE('',#1748,#1749);
#1377=LINE('',#1750,#1751);
#1378=LINE('',#1752,#1753);
#1379=LINE('',#1754,#1755);
#1380=LINE('',#1756,#1757);
#1381=LINE('',#1758,#1759);
#1382=LINE('',#1760,#1761);
#1383=LINE('',#1762,#1763);
#1384=LINE('',#1764,#1765);
#1385=LINE('',#1766,#1767);
#1386=LINE('',#1768,#1769);
#1387=LINE('',#1770,#1771);
#1388=LINE('',#1772,#1773);
#1389=LINE('',#1774,#1775);
#1390=LINE('',#1776,#1777);
#1391=LINE('',#1778,#1779);
#1392=LINE('',#1780,#1781);
#1393=LINE('',#1782,#1783);
#1394=LINE('',#1784,#1785);
#1395=LINE('',#1786,#1787);
#1396=LINE('',#1788,#1789);
#1397=LINE('',#1790,#1791);
#1398=LINE('',#1792,#1793);
#1399=LINE('',#1794,#1795);
#1400=CARTESIAN_POINT('',(52.0450307332643,5.0,7.74999999965309));
#1401=AXIS2_PLACEMENT_3D('',#1796,#1797,#1798);
#1402=CARTESIAN_POINT('',(53.2950307332105,12.1500000000511,8.99999999939061));
#1403=AXIS2_PLACEMENT_3D('',#1799,#1800,#1801);
#1404=CARTESIAN_POINT('',(53.2950307331917,14.6500000000511,8.99999999928689));
#1405=AXIS2_PLACEMENT_3D('',#1802,#1803,#1804);
#1406=CARTESIAN_POINT('',(106.045030733264,5.0,7.75000000112886));
#1407=AXIS2_PLACEMENT_3D('',#1805,#1806,#1807);
#1408=CARTESIAN_POINT('',(107.29503073321,12.1500000004572,9.00000000086638));
#1409=AXIS2_PLACEMENT_3D('',#1808,#1809,#1810);
#1410=CARTESIAN_POINT('',(75.045030733358,25.0,0.0));
#1411=CARTESIAN_POINT('',(70.045030733358,30.9160797830996,0.0));
#1412=AXIS2_PLACEMENT_3D('',#1811,#1812,#1813);
#1413=CARTESIAN_POINT('',(70.045030733358,29.0,0.0));
#1414=CARTESIAN_POINT('',(70.045030733358,30.25,0.0));
#1415=VECTOR('',#1814,1.0);
#1416=CARTESIAN_POINT('',(69.545030733358,28.5,0.0));
#1417=AXIS2_PLACEMENT_3D('',#1815,#1816,#1817);
#1418=CARTESIAN_POINT('',(68.545030733358,28.5,0.0));
#1419=CARTESIAN_POINT('',(69.045030733358,28.5,0.0));
#1420=VECTOR('',#1818,1.0);
#1421=CARTESIAN_POINT('',(68.045030733358,29.0,0.0));
#1422=AXIS2_PLACEMENT_3D('',#1819,#1820,#1821);
#1423=CARTESIAN_POINT('',(68.045030733358,30.9160797830996,0.0));
#1424=CARTESIAN_POINT('',(68.045030733358,30.25,0.0));
#1425=VECTOR('',#1822,1.0);
#1426=CARTESIAN_POINT('',(68.045030733358,19.0839202169004,0.0));
#1427=AXIS2_PLACEMENT_3D('',#1823,#1824,#1825);
#1428=CARTESIAN_POINT('',(68.045030733358,21.0,0.0));
#1429=CARTESIAN_POINT('',(68.045030733358,19.75,0.0));
#1430=VECTOR('',#1826,1.0);
#1431=CARTESIAN_POINT('',(68.545030733358,21.5,0.0));
#1432=AXIS2_PLACEMENT_3D('',#1827,#1828,#1829);
#1433=CARTESIAN_POINT('',(69.545030733358,21.5,0.0));
#1434=CARTESIAN_POINT('',(69.045030733358,21.5,0.0));
#1435=VECTOR('',#1830,1.0);
#1436=CARTESIAN_POINT('',(70.045030733358,21.0,0.0));
#1437=AXIS2_PLACEMENT_3D('',#1831,#1832,#1833);
#1438=CARTESIAN_POINT('',(70.045030733358,19.0839202169004,0.0));
#1439=CARTESIAN_POINT('',(70.045030733358,19.75,0.0));
#1440=VECTOR('',#1834,1.0);
#1441=AXIS2_PLACEMENT_3D('',#1835,#1836,#1837);
#1442=CARTESIAN_POINT('',(95.045030733358,25.0,0.0));
#1443=CARTESIAN_POINT('',(90.045030733358,30.9160797830996,0.0));
#1444=AXIS2_PLACEMENT_3D('',#1838,#1839,#1840);
#1445=CARTESIAN_POINT('',(90.045030733358,29.0,0.0));
#1446=CARTESIAN_POINT('',(90.045030733358,30.25,0.0));
#1447=VECTOR('',#1841,1.0);
#1448=CARTESIAN_POINT('',(89.545030733358,28.5,0.0));
#1449=AXIS2_PLACEMENT_3D('',#1842,#1843,#1844);
#1450=CARTESIAN_POINT('',(88.545030733358,28.5,0.0));
#1451=CARTESIAN_POINT('',(89.045030733358,28.5,0.0));
#1452=VECTOR('',#1845,1.0);
#1453=CARTESIAN_POINT('',(88.045030733358,29.0,0.0));
#1454=AXIS2_PLACEMENT_3D('',#1846,#1847,#1848);
#1455=CARTESIAN_POINT('',(88.045030733358,30.9160797830996,0.0));
#1456=CARTESIAN_POINT('',(88.045030733358,30.25,0.0));
#1457=VECTOR('',#1849,1.0);
#1458=CARTESIAN_POINT('',(88.045030733358,19.0839202169004,0.0));
#1459=AXIS2_PLACEMENT_3D('',#1850,#1851,#1852);
#1460=CARTESIAN_POINT('',(88.045030733358,21.0,0.0));
#1461=CARTESIAN_POINT('',(88.045030733358,19.75,0.0));
#1462=VECTOR('',#1853,1.0);
#1463=CARTESIAN_POINT('',(88.545030733358,21.5,0.0));
#1464=AXIS2_PLACEMENT_3D('',#1854,#1855,#1856);
#1465=CARTESIAN_POINT('',(89.545030733358,21.5,0.0));
#1466=CARTESIAN_POINT('',(89.045030733358,21.5,0.0));
#1467=VECTOR('',#1857,1.0);
#1468=CARTESIAN_POINT('',(90.045030733358,21.0,0.0));
#1469=AXIS2_PLACEMENT_3D('',#1858,#1859,#1860);
#1470=CARTESIAN_POINT('',(90.045030733358,19.0839202169004,0.0));
#1471=CARTESIAN_POINT('',(90.045030733358,19.75,0.0));
#1472=VECTOR('',#1861,1.0);
#1473=AXIS2_PLACEMENT_3D('',#1862,#1863,#1864);
#1474=CARTESIAN_POINT('',(99.045030733358,2.95,0.0));
#1475=CARTESIAN_POINT('',(99.045030733358,11.15,0.0));
#1476=AXIS2_PLACEMENT_3D('',#1865,#1866,#1867);
#1477=CARTESIAN_POINT('',(59.045030733358,11.15,0.0));
#1478=CARTESIAN_POINT('',(79.045030733358,11.15,0.0));
#1479=VECTOR('',#1868,1.0);
#1480=CARTESIAN_POINT('',(59.045030733358,2.95,0.0));
#1481=AXIS2_PLACEMENT_3D('',#1869,#1870,#1871);
#1482=CARTESIAN_POINT('',(79.045030733358,2.95,0.0));
#1483=VECTOR('',#1872,1.0);
#1484=CARTESIAN_POINT('',(99.045030733358,25.0,0.0));
#1485=CARTESIAN_POINT('',(89.045030733358,35.0,0.0));
#1486=AXIS2_PLACEMENT_3D('',#1873,#1874,#1875);
#1487=CARTESIAN_POINT('',(99.045030733358,16.0,0.0));
#1488=CARTESIAN_POINT('',(99.045030733358,6.06455869753014E-15,0.0));
#1489=VECTOR('',#1876,1.0);
#1490=CARTESIAN_POINT('',(107.045030733358,16.0,0.0));
#1491=CARTESIAN_POINT('',(103.795030733358,16.0,0.0));
#1492=VECTOR('',#1877,1.0);
#1493=CARTESIAN_POINT('',(109.045030733358,14.0,0.0));
#1494=CARTESIAN_POINT('',(108.045030733358,15.0,0.0));
#1495=VECTOR('',#1878,1.0);
#1496=CARTESIAN_POINT('',(109.045030733359,4.99999999999993,0.0));
#1497=CARTESIAN_POINT('',(109.045030733358,9.5,0.0));
#1498=VECTOR('',#1879,1.0);
#1499=CARTESIAN_POINT('',(106.045030733359,4.99999999999993,0.0));
#1500=CARTESIAN_POINT('',(107.545030733359,4.99999999999993,0.0));
#1501=VECTOR('',#1880,1.0);
#1502=CARTESIAN_POINT('',(106.045030733359,1.99999999999996,0.0));
#1503=CARTESIAN_POINT('',(106.045030733359,3.49999999999995,0.0));
#1504=VECTOR('',#1881,1.0);
#1505=CARTESIAN_POINT('',(104.045030733359,-3.46944695195361E-14,0.0));
#1506=CARTESIAN_POINT('',(105.045030733359,0.999999999999965,0.0));
#1507=VECTOR('',#1882,1.0);
#1508=CARTESIAN_POINT('',(54.0450307333586,0.0,0.0));
#1509=CARTESIAN_POINT('',(79.5,1.7347234759768E-15,0.0));
#1510=VECTOR('',#1883,1.0);
#1511=CARTESIAN_POINT('',(52.0450307333586,2.0,0.0));
#1512=CARTESIAN_POINT('',(53.0450307333586,1.0,0.0));
#1513=VECTOR('',#1884,1.0);
#1514=CARTESIAN_POINT('',(52.0450307333586,5.0,0.0));
#1515=CARTESIAN_POINT('',(52.0450307333586,3.5,0.0));
#1516=VECTOR('',#1885,1.0);
#1517=CARTESIAN_POINT('',(49.0450307333578,5.0,0.0));
#1518=CARTESIAN_POINT('',(50.5450307333583,5.0,0.0));
#1519=VECTOR('',#1886,1.0);
#1520=CARTESIAN_POINT('',(49.045030733358,14.0,0.0));
#1521=CARTESIAN_POINT('',(49.045030733358,9.5,0.0));
#1522=VECTOR('',#1887,1.0);
#1523=CARTESIAN_POINT('',(51.045030733358,16.0,0.0));
#1524=CARTESIAN_POINT('',(50.045030733358,15.0,0.0));
#1525=VECTOR('',#1888,1.0);
#1526=CARTESIAN_POINT('',(59.045030733358,16.0,0.0));
#1527=CARTESIAN_POINT('',(54.295030733358,16.0,0.0));
#1528=VECTOR('',#1889,1.0);
#1529=CARTESIAN_POINT('',(59.045030733358,25.0,0.0));
#1530=CARTESIAN_POINT('',(59.045030733358,3.61534598988538E-15,0.0));
#1531=VECTOR('',#1890,1.0);
#1532=CARTESIAN_POINT('',(69.045030733358,35.0,0.0));
#1533=AXIS2_PLACEMENT_3D('',#1891,#1892,#1893);
#1534=CARTESIAN_POINT('',(79.045030733358,35.0,0.0));
#1535=VECTOR('',#1894,1.0);
#1536=CARTESIAN_POINT('',(89.045030733358,35.0,5.0));
#1537=CARTESIAN_POINT('',(69.045030733358,35.0,5.0));
#1538=CARTESIAN_POINT('',(79.045030733358,35.0,5.0));
#1539=VECTOR('',#1895,1.0);
#1540=CARTESIAN_POINT('',(89.045030733358,35.0,5.0));
#1541=VECTOR('',#1896,1.0);
#1542=CARTESIAN_POINT('',(69.045030733358,35.0,5.0));
#1543=VECTOR('',#1897,1.0);
#1544=CARTESIAN_POINT('',(104.045030733358,16.0,12.0));
#1545=CARTESIAN_POINT('',(104.045030733358,5.0,12.0));
#1546=CARTESIAN_POINT('',(104.045030733358,10.5,12.0));
#1547=VECTOR('',#1898,1.0);
#1548=CARTESIAN_POINT('',(104.045030733358,16.0,5.0));
#1549=CARTESIAN_POINT('',(104.045030733358,16.0,5.0));
#1550=VECTOR('',#1899,1.0);
#1551=CARTESIAN_POINT('',(104.045030733358,5.0,5.0));
#1552=CARTESIAN_POINT('',(104.045030733358,10.5,5.0));
#1553=VECTOR('',#1900,1.0);
#1554=CARTESIAN_POINT('',(104.045030733358,5.0,5.0));
#1555=VECTOR('',#1901,1.0);
#1556=CARTESIAN_POINT('',(99.045030733358,16.0,5.0));
#1557=CARTESIAN_POINT('',(103.795030733358,16.0,5.0));
#1558=VECTOR('',#1902,1.0);
#1559=CARTESIAN_POINT('',(107.045030733358,16.0,12.0));
#1560=CARTESIAN_POINT('',(105.545030733358,16.0,12.0));
#1561=VECTOR('',#1903,1.0);
#1562=CARTESIAN_POINT('',(107.045030733358,16.0,0.0));
#1563=VECTOR('',#1904,1.0);
#1564=CARTESIAN_POINT('',(99.045030733358,16.0,5.0));
#1565=VECTOR('',#1905,1.0);
#1566=CARTESIAN_POINT('',(88.045030733358,30.9160797830996,2.0));
#1567=CARTESIAN_POINT('',(88.045030733358,19.0839202169004,2.0));
#1568=AXIS2_PLACEMENT_3D('',#1906,#1907,#1908);
#1569=CARTESIAN_POINT('',(88.045030733358,29.0,2.0));
#1570=CARTESIAN_POINT('',(88.045030733358,30.25,2.0));
#1571=VECTOR('',#1909,1.0);
#1572=CARTESIAN_POINT('',(88.545030733358,28.5,2.0));
#1573=AXIS2_PLACEMENT_3D('',#1910,#1911,#1912);
#1574=CARTESIAN_POINT('',(89.545030733358,28.5,2.0));
#1575=CARTESIAN_POINT('',(89.045030733358,28.5,2.0));
#1576=VECTOR('',#1913,1.0);
#1577=CARTESIAN_POINT('',(90.045030733358,29.0,2.0));
#1578=AXIS2_PLACEMENT_3D('',#1914,#1915,#1916);
#1579=CARTESIAN_POINT('',(90.045030733358,30.9160797830996,2.0));
#1580=CARTESIAN_POINT('',(90.045030733358,30.25,2.0));
#1581=VECTOR('',#1917,1.0);
#1582=CARTESIAN_POINT('',(95.045030733358,25.0,2.0));
#1583=AXIS2_PLACEMENT_3D('',#1918,#1919,#1920);
#1584=CARTESIAN_POINT('',(90.045030733358,19.0839202169004,2.0));
#1585=AXIS2_PLACEMENT_3D('',#1921,#1922,#1923);
#1586=CARTESIAN_POINT('',(90.045030733358,21.0,2.0));
#1587=CARTESIAN_POINT('',(90.045030733358,19.75,2.0));
#1588=VECTOR('',#1924,1.0);
#1589=CARTESIAN_POINT('',(89.545030733358,21.5,2.0));
#1590=AXIS2_PLACEMENT_3D('',#1925,#1926,#1927);
#1591=CARTESIAN_POINT('',(88.545030733358,21.5,2.0));
#1592=CARTESIAN_POINT('',(89.045030733358,21.5,2.0));
#1593=VECTOR('',#1928,1.0);
#1594=CARTESIAN_POINT('',(88.045030733358,21.0,2.0));
#1595=AXIS2_PLACEMENT_3D('',#1929,#1930,#1931);
#1596=CARTESIAN_POINT('',(88.045030733358,19.75,2.0));
#1597=VECTOR('',#1932,1.0);
#1598=CARTESIAN_POINT('',(98.045030733358,25.0,2.0));
#1599=AXIS2_PLACEMENT_3D('',#1933,#1934,#1935);
#1600=CARTESIAN_POINT('',(59.045030733358,2.95,5.0));
#1601=CARTESIAN_POINT('',(59.045030733358,2.95,5.0));
#1602=VECTOR('',#1936,1.0);
#1603=CARTESIAN_POINT('',(99.045030733358,2.95,5.0));
#1604=CARTESIAN_POINT('',(79.045030733358,2.95,5.0));
#1605=VECTOR('',#1937,1.0);
#1606=CARTESIAN_POINT('',(99.045030733358,2.95,5.0));
#1607=VECTOR('',#1938,1.0);
#1608=CARTESIAN_POINT('',(109.045030733358,5.0,12.0));
#1609=CARTESIAN_POINT('',(106.545030733358,5.0,12.0));
#1610=VECTOR('',#1939,1.0);
#1611=CARTESIAN_POINT('',(109.045030733358,14.0,12.0));
#1612=CARTESIAN_POINT('',(109.045030733358,9.5,12.0));
#1613=VECTOR('',#1940,1.0);
#1614=CARTESIAN_POINT('',(108.045030733358,15.0,12.0));
#1615=VECTOR('',#1941,1.0);
#1616=CARTESIAN_POINT('',(59.045030733358,16.0,5.0));
#1617=CARTESIAN_POINT('',(54.045030733358,16.0,5.0));
#1618=CARTESIAN_POINT('',(54.295030733358,16.0,5.0));
#1619=VECTOR('',#1942,1.0);
#1620=CARTESIAN_POINT('',(59.045030733358,16.0,5.0));
#1621=VECTOR('',#1943,1.0);
#1622=CARTESIAN_POINT('',(51.045030733358,16.0,12.0));
#1623=CARTESIAN_POINT('',(51.045030733358,16.0,0.0));
#1624=VECTOR('',#1944,1.0);
#1625=CARTESIAN_POINT('',(54.045030733358,16.0,12.0));
#1626=CARTESIAN_POINT('',(52.545030733358,16.0,12.0));
#1627=VECTOR('',#1945,1.0);
#1628=CARTESIAN_POINT('',(54.045030733358,16.0,5.0));
#1629=VECTOR('',#1946,1.0);
#1630=CARTESIAN_POINT('',(70.045030733358,30.9160797830996,2.0));
#1631=CARTESIAN_POINT('',(70.045030733358,30.9160797830996,5.0));
#1632=VECTOR('',#1947,1.0);
#1633=CARTESIAN_POINT('',(70.045030733358,19.0839202169004,2.0));
#1634=CARTESIAN_POINT('',(70.045030733358,19.0839202169004,5.0));
#1635=VECTOR('',#1948,1.0);
#1636=CARTESIAN_POINT('',(75.045030733358,25.0,2.0));
#1637=AXIS2_PLACEMENT_3D('',#1949,#1950,#1951);
#1638=AXIS2_PLACEMENT_3D('',#1952,#1953,#1954);
#1639=CARTESIAN_POINT('',(52.0450307333586,5.0,5.0));
#1640=CARTESIAN_POINT('',(52.0450307333586,5.0,0.0));
#1641=VECTOR('',#1955,1.0);
#1642=CARTESIAN_POINT('',(54.045030733358,5.0,5.0));
#1643=CARTESIAN_POINT('',(51.545030733358,5.0,5.0));
#1644=VECTOR('',#1956,1.0);
#1645=CARTESIAN_POINT('',(54.045030733358,5.0,12.0));
#1646=CARTESIAN_POINT('',(54.045030733358,5.0,5.0));
#1647=VECTOR('',#1957,1.0);
#1648=CARTESIAN_POINT('',(49.045030733358,5.0,12.0));
#1649=CARTESIAN_POINT('',(51.545030733358,5.0,12.0));
#1650=VECTOR('',#1958,1.0);
#1651=CARTESIAN_POINT('',(49.045030733358,5.0,0.0));
#1652=VECTOR('',#1959,1.0);
#1653=CARTESIAN_POINT('',(109.045030733358,14.0,0.0));
#1654=VECTOR('',#1960,1.0);
#1655=CARTESIAN_POINT('',(90.045030733358,30.9160797830996,5.0));
#1656=VECTOR('',#1961,1.0);
#1657=CARTESIAN_POINT('',(90.045030733358,19.0839202169004,5.0));
#1658=VECTOR('',#1962,1.0);
#1659=CARTESIAN_POINT('',(106.045030733359,4.99999999999993,5.0));
#1660=CARTESIAN_POINT('',(106.545030733358,5.0,5.0));
#1661=VECTOR('',#1963,1.0);
#1662=CARTESIAN_POINT('',(106.045030733359,4.99999999999993,0.0));
#1663=VECTOR('',#1964,1.0);
#1664=CARTESIAN_POINT('',(109.045030733358,5.0,0.0));
#1665=VECTOR('',#1965,1.0);
#1666=CARTESIAN_POINT('',(99.045030733358,25.0,5.0));
#1667=AXIS2_PLACEMENT_3D('',#1966,#1967,#1968);
#1668=CARTESIAN_POINT('',(99.045030733358,25.0,5.0));
#1669=VECTOR('',#1969,1.0);
#1670=CARTESIAN_POINT('',(99.045030733358,20.5,5.0));
#1671=VECTOR('',#1970,1.0);
#1672=CARTESIAN_POINT('',(59.045030733358,25.0,5.0));
#1673=CARTESIAN_POINT('',(59.045030733358,20.5,5.0));
#1674=VECTOR('',#1971,1.0);
#1675=CARTESIAN_POINT('',(59.045030733358,25.0,5.0));
#1676=VECTOR('',#1972,1.0);
#1677=AXIS2_PLACEMENT_3D('',#1973,#1974,#1975);
#1678=CARTESIAN_POINT('',(107.295030733192,14.6500000004572,9.00000000076266));
#1679=AXIS2_PLACEMENT_3D('',#1976,#1977,#1978);
#1680=CARTESIAN_POINT('',(49.045030733358,14.0,12.0));
#1681=CARTESIAN_POINT('',(50.045030733358,15.0,12.0));
#1682=VECTOR('',#1979,1.0);
#1683=CARTESIAN_POINT('',(49.045030733358,9.5,12.0));
#1684=VECTOR('',#1980,1.0);
#1685=CARTESIAN_POINT('',(54.045030733358,10.5,12.0));
#1686=VECTOR('',#1981,1.0);
#1687=CARTESIAN_POINT('',(54.045030733358,10.5,5.0));
#1688=VECTOR('',#1982,1.0);
#1689=CARTESIAN_POINT('',(52.0450307333586,2.0,5.0));
#1690=CARTESIAN_POINT('',(52.0450307333586,-3.18673376604759E-15,5.0));
#1691=VECTOR('',#1983,1.0);
#1692=CARTESIAN_POINT('',(54.0450307333586,4.33680868994201E-15,5.0));
#1693=CARTESIAN_POINT('',(27.0225153666793,27.0225153666793,5.0));
#1694=VECTOR('',#1984,1.0);
#1695=CARTESIAN_POINT('',(104.045030733359,-3.46944695195361E-14,5.0));
#1696=CARTESIAN_POINT('',(79.5,1.7347234759768E-15,5.0));
#1697=VECTOR('',#1985,1.0);
#1698=CARTESIAN_POINT('',(106.045030733359,1.99999999999996,5.0));
#1699=CARTESIAN_POINT('',(52.0225153666793,-52.0225153666793,5.0));
#1700=VECTOR('',#1986,1.0);
#1701=CARTESIAN_POINT('',(106.045030733359,6.49317092136801E-15,5.0));
#1702=VECTOR('',#1987,1.0);
#1703=CARTESIAN_POINT('',(99.045030733358,11.15,5.0));
#1704=CARTESIAN_POINT('',(59.045030733358,11.15,5.0));
#1705=CARTESIAN_POINT('',(79.045030733358,11.15,5.0));
#1706=VECTOR('',#1988,1.0);
#1707=AXIS2_PLACEMENT_3D('',#1989,#1990,#1991);
#1708=AXIS2_PLACEMENT_3D('',#1992,#1993,#1994);
#1709=CARTESIAN_POINT('',(98.045030733358,25.0,5.0));
#1710=AXIS2_PLACEMENT_3D('',#1995,#1996,#1997);
#1711=CARTESIAN_POINT('',(78.045030733358,25.0,5.0));
#1712=AXIS2_PLACEMENT_3D('',#1998,#1999,#2000);
#1713=CARTESIAN_POINT('',(68.045030733358,30.9160797830996,2.0));
#1714=CARTESIAN_POINT('',(68.045030733358,19.0839202169004,2.0));
#1715=AXIS2_PLACEMENT_3D('',#2001,#2002,#2003);
#1716=CARTESIAN_POINT('',(68.045030733358,29.0,2.0));
#1717=CARTESIAN_POINT('',(68.045030733358,30.25,2.0));
#1718=VECTOR('',#2004,1.0);
#1719=CARTESIAN_POINT('',(68.545030733358,28.5,2.0));
#1720=AXIS2_PLACEMENT_3D('',#2005,#2006,#2007);
#1721=CARTESIAN_POINT('',(69.545030733358,28.5,2.0));
#1722=CARTESIAN_POINT('',(69.045030733358,28.5,2.0));
#1723=VECTOR('',#2008,1.0);
#1724=CARTESIAN_POINT('',(70.045030733358,29.0,2.0));
#1725=AXIS2_PLACEMENT_3D('',#2009,#2010,#2011);
#1726=CARTESIAN_POINT('',(70.045030733358,30.25,2.0));
#1727=VECTOR('',#2012,1.0);
#1728=CARTESIAN_POINT('',(70.045030733358,21.0,2.0));
#1729=CARTESIAN_POINT('',(70.045030733358,19.75,2.0));
#1730=VECTOR('',#2013,1.0);
#1731=CARTESIAN_POINT('',(69.545030733358,21.5,2.0));
#1732=AXIS2_PLACEMENT_3D('',#2014,#2015,#2016);
#1733=CARTESIAN_POINT('',(68.545030733358,21.5,2.0));
#1734=CARTESIAN_POINT('',(69.045030733358,21.5,2.0));
#1735=VECTOR('',#2017,1.0);
#1736=CARTESIAN_POINT('',(68.045030733358,21.0,2.0));
#1737=AXIS2_PLACEMENT_3D('',#2018,#2019,#2020);
#1738=CARTESIAN_POINT('',(68.045030733358,19.75,2.0));
#1739=VECTOR('',#2021,1.0);
#1740=CARTESIAN_POINT('',(78.045030733358,25.0,2.0));
#1741=AXIS2_PLACEMENT_3D('',#2022,#2023,#2024);
#1742=CARTESIAN_POINT('',(104.045030733359,-3.46944695195361E-14,0.0));
#1743=VECTOR('',#2025,1.0);
#1744=CARTESIAN_POINT('',(54.0450307333586,0.0,0.0));
#1745=VECTOR('',#2026,1.0);
#1746=CARTESIAN_POINT('',(49.045030733358,14.0,0.0));
#1747=VECTOR('',#2027,1.0);
#1748=CARTESIAN_POINT('',(99.045030733358,11.15,5.0));
#1749=VECTOR('',#2028,1.0);
#1750=CARTESIAN_POINT('',(59.045030733358,11.15,5.0));
#1751=VECTOR('',#2029,1.0);
#1752=CARTESIAN_POINT('',(88.045030733358,30.9160797830996,5.0));
#1753=VECTOR('',#2030,1.0);
#1754=CARTESIAN_POINT('',(88.045030733358,19.0839202169004,5.0));
#1755=VECTOR('',#2031,1.0);
#1756=CARTESIAN_POINT('',(68.045030733358,30.9160797830996,5.0));
#1757=VECTOR('',#2032,1.0);
#1758=CARTESIAN_POINT('',(68.045030733358,19.0839202169004,5.0));
#1759=VECTOR('',#2033,1.0);
#1760=CARTESIAN_POINT('',(68.045030733358,21.0,0.0));
#1761=VECTOR('',#2034,1.0);
#1762=CARTESIAN_POINT('',(68.545030733358,21.5,0.0));
#1763=VECTOR('',#2035,1.0);
#1764=CARTESIAN_POINT('',(70.045030733358,21.0,0.0));
#1765=VECTOR('',#2036,1.0);
#1766=CARTESIAN_POINT('',(69.545030733358,21.5,0.0));
#1767=VECTOR('',#2037,1.0);
#1768=CARTESIAN_POINT('',(106.045030733359,1.99999999999996,0.0));
#1769=VECTOR('',#2038,1.0);
#1770=CARTESIAN_POINT('',(52.0450307333586,2.0,0.0));
#1771=VECTOR('',#2039,1.0);
#1772=CARTESIAN_POINT('',(90.045030733358,21.0,0.0));
#1773=VECTOR('',#2040,1.0);
#1774=CARTESIAN_POINT('',(88.045030733358,21.0,0.0));
#1775=VECTOR('',#2041,1.0);
#1776=CARTESIAN_POINT('',(88.545030733358,21.5,0.0));
#1777=VECTOR('',#2042,1.0);
#1778=CARTESIAN_POINT('',(89.545030733358,21.5,0.0));
#1779=VECTOR('',#2043,1.0);
#1780=CARTESIAN_POINT('',(90.045030733358,29.0,0.0));
#1781=VECTOR('',#2044,1.0);
#1782=CARTESIAN_POINT('',(88.045030733358,29.0,0.0));
#1783=VECTOR('',#2045,1.0);
#1784=CARTESIAN_POINT('',(89.545030733358,28.5,0.0));
#1785=VECTOR('',#2046,1.0);
#1786=CARTESIAN_POINT('',(88.545030733358,28.5,0.0));
#1787=VECTOR('',#2047,1.0);
#1788=CARTESIAN_POINT('',(69.545030733358,28.5,0.0));
#1789=VECTOR('',#2048,1.0);
#1790=CARTESIAN_POINT('',(70.045030733358,29.0,0.0));
#1791=VECTOR('',#2049,1.0);
#1792=CARTESIAN_POINT('',(68.545030733358,28.5,0.0));
#1793=VECTOR('',#2050,1.0);
#1794=CARTESIAN_POINT('',(68.045030733358,29.0,0.0));
#1795=VECTOR('',#2051,1.0);
#1796=CARTESIAN_POINT('',(52.0450307332643,5.0,8.99999999965309));
#1797=DIRECTION('',(0.0,-1.0,0.0));
#1798=DIRECTION('',(0.0,0.0,-1.0));
#1799=CARTESIAN_POINT('',(52.0450307332105,12.1500000000417,8.99999999935645));
#1800=DIRECTION('',(-7.52061061606098E-12,1.0,-4.14878169283672E-11));
#1801=DIRECTION('',(0.0,4.14878169283672E-11,1.0));
#1802=CARTESIAN_POINT('',(52.0450307331917,14.6500000000417,8.99999999925273));
#1803=DIRECTION('',(-7.52061061606098E-12,1.0,-4.14878169283672E-11));
#1804=DIRECTION('',(1.0,7.5206106171948E-12,2.73289484470764E-11));
#1805=CARTESIAN_POINT('',(106.045030733264,5.0,9.00000000112886));
#1806=DIRECTION('',(0.0,-1.0,0.0));
#1807=DIRECTION('',(0.0,0.0,-1.0));
#1808=CARTESIAN_POINT('',(106.04503073321,12.1500000004478,9.00000000083222));
#1809=DIRECTION('',(-7.52061061606098E-12,1.0,-4.14878169283672E-11));
#1810=DIRECTION('',(0.0,4.14878169283672E-11,1.0));
#1811=CARTESIAN_POINT('',(69.045030733358,25.0,0.0));
#1812=DIRECTION('',(0.0,0.0,1.0));
#1813=DIRECTION('',(1.0,0.0,0.0));
#1814=DIRECTION('',(-6.12303176911189E-17,-1.0,0.0));
#1815=CARTESIAN_POINT('',(69.545030733358,29.0,0.0));
#1816=DIRECTION('',(0.0,0.0,-1.0));
#1817=DIRECTION('',(-1.0,0.0,0.0));
#1818=DIRECTION('',(-1.0,0.0,0.0));
#1819=CARTESIAN_POINT('',(68.545030733358,29.0,0.0));
#1820=DIRECTION('',(0.0,0.0,-1.0));
#1821=DIRECTION('',(-1.0,0.0,0.0));
#1822=DIRECTION('',(-6.12303176911189E-17,1.0,0.0));
#1823=CARTESIAN_POINT('',(69.045030733358,25.0,0.0));
#1824=DIRECTION('',(0.0,0.0,1.0));
#1825=DIRECTION('',(1.0,0.0,0.0));
#1826=DIRECTION('',(-6.12303176911189E-17,1.0,0.0));
#1827=CARTESIAN_POINT('',(68.545030733358,21.0,0.0));
#1828=DIRECTION('',(0.0,0.0,-1.0));
#1829=DIRECTION('',(-1.0,0.0,0.0));
#1830=DIRECTION('',(1.0,-1.22460635382238E-16,0.0));
#1831=CARTESIAN_POINT('',(69.545030733358,21.0,0.0));
#1832=DIRECTION('',(0.0,0.0,-1.0));
#1833=DIRECTION('',(-1.0,0.0,0.0));
#1834=DIRECTION('',(-6.12303176911189E-17,-1.0,0.0));
#1835=CARTESIAN_POINT('',(69.045030733358,25.0,0.0));
#1836=DIRECTION('',(0.0,0.0,1.0));
#1837=DIRECTION('',(1.0,0.0,0.0));
#1838=CARTESIAN_POINT('',(89.045030733358,25.0,0.0));
#1839=DIRECTION('',(0.0,0.0,1.0));
#1840=DIRECTION('',(1.0,0.0,0.0));
#1841=DIRECTION('',(-6.12303176911189E-17,-1.0,0.0));
#1842=CARTESIAN_POINT('',(89.545030733358,29.0,0.0));
#1843=DIRECTION('',(0.0,0.0,-1.0));
#1844=DIRECTION('',(-1.0,0.0,0.0));
#1845=DIRECTION('',(-1.0,0.0,0.0));
#1846=CARTESIAN_POINT('',(88.545030733358,29.0,0.0));
#1847=DIRECTION('',(0.0,0.0,-1.0));
#1848=DIRECTION('',(-1.0,0.0,0.0));
#1849=DIRECTION('',(-6.12303176911189E-17,1.0,0.0));
#1850=CARTESIAN_POINT('',(89.045030733358,25.0,0.0));
#1851=DIRECTION('',(0.0,0.0,1.0));
#1852=DIRECTION('',(1.0,0.0,0.0));
#1853=DIRECTION('',(-6.12303176911189E-17,1.0,0.0));
#1854=CARTESIAN_POINT('',(88.545030733358,21.0,0.0));
#1855=DIRECTION('',(0.0,0.0,-1.0));
#1856=DIRECTION('',(-1.0,0.0,0.0));
#1857=DIRECTION('',(1.0,-1.22460635382238E-16,0.0));
#1858=CARTESIAN_POINT('',(89.545030733358,21.0,0.0));
#1859=DIRECTION('',(0.0,0.0,-1.0));
#1860=DIRECTION('',(-1.0,0.0,0.0));
#1861=DIRECTION('',(-6.12303176911189E-17,-1.0,0.0));
#1862=CARTESIAN_POINT('',(89.045030733358,25.0,0.0));
#1863=DIRECTION('',(0.0,0.0,1.0));
#1864=DIRECTION('',(1.0,0.0,0.0));
#1865=CARTESIAN_POINT('',(99.045030733358,7.05,0.0));
#1866=DIRECTION('',(0.0,0.0,1.0));
#1867=DIRECTION('',(1.0,0.0,0.0));
#1868=DIRECTION('',(-1.0,0.0,0.0));
#1869=CARTESIAN_POINT('',(59.045030733358,7.05,0.0));
#1870=DIRECTION('',(0.0,0.0,1.0));
#1871=DIRECTION('',(1.0,0.0,0.0));
#1872=DIRECTION('',(1.0,-1.22460635382238E-16,0.0));
#1873=CARTESIAN_POINT('',(89.045030733358,25.0,0.0));
#1874=DIRECTION('',(0.0,0.0,1.0));
#1875=DIRECTION('',(1.0,0.0,0.0));
#1876=DIRECTION('',(-6.12303176911189E-17,1.0,0.0));
#1877=DIRECTION('',(-1.0,-1.22460635382238E-16,0.0));
#1878=DIRECTION('',(-0.707106781186545,0.70710678118655,0.0));
#1879=DIRECTION('',(6.12303176911189E-17,1.0,0.0));
#1880=DIRECTION('',(1.0,-1.22460635382238E-16,0.0));
#1881=DIRECTION('',(-6.12303176911189E-17,1.0,0.0));
#1882=DIRECTION('',(0.707106781186548,0.707106781186547,0.0));
#1883=DIRECTION('',(1.0,0.0,0.0));
#1884=DIRECTION('',(0.707106781186548,-0.707106781186547,0.0));
#1885=DIRECTION('',(-6.12303176911189E-17,-1.0,0.0));
#1886=DIRECTION('',(1.0,1.22460635382238E-16,0.0));
#1887=DIRECTION('',(6.12303176911189E-17,-1.0,0.0));
#1888=DIRECTION('',(-0.707106781186548,-0.707106781186548,0.0));
#1889=DIRECTION('',(-1.0,-1.22460635382238E-16,0.0));
#1890=DIRECTION('',(6.12303176911189E-17,-1.0,0.0));
#1891=CARTESIAN_POINT('',(69.045030733358,25.0,0.0));
#1892=DIRECTION('',(0.0,0.0,1.0));
#1893=DIRECTION('',(1.0,0.0,0.0));
#1894=DIRECTION('',(1.0,0.0,0.0));
#1895=DIRECTION('',(-1.0,0.0,0.0));
#1896=DIRECTION('',(0.0,0.0,-1.0));
#1897=DIRECTION('',(0.0,0.0,-1.0));
#1898=DIRECTION('',(-6.12303176911189E-17,-1.0,0.0));
#1899=DIRECTION('',(0.0,0.0,1.0));
#1900=DIRECTION('',(-6.12303176911189E-17,-1.0,0.0));
#1901=DIRECTION('',(0.0,0.0,1.0));
#1902=DIRECTION('',(-1.0,-1.22460635382238E-16,0.0));
#1903=DIRECTION('',(-1.0,0.0,0.0));
#1904=DIRECTION('',(0.0,0.0,1.0));
#1905=DIRECTION('',(0.0,0.0,-1.0));
#1906=CARTESIAN_POINT('',(89.045030733358,25.0,2.0));
#1907=DIRECTION('',(0.0,0.0,1.0));
#1908=DIRECTION('',(1.0,0.0,0.0));
#1909=DIRECTION('',(6.12303176911189E-17,-1.0,0.0));
#1910=CARTESIAN_POINT('',(88.545030733358,29.0,2.0));
#1911=DIRECTION('',(0.0,0.0,1.0));
#1912=DIRECTION('',(1.0,0.0,0.0));
#1913=DIRECTION('',(1.0,0.0,0.0));
#1914=CARTESIAN_POINT('',(89.545030733358,29.0,2.0));
#1915=DIRECTION('',(0.0,0.0,1.0));
#1916=DIRECTION('',(1.0,0.0,0.0));
#1917=DIRECTION('',(6.12303176911189E-17,1.0,0.0));
#1918=CARTESIAN_POINT('',(89.045030733358,25.0,2.0));
#1919=DIRECTION('',(0.0,0.0,1.0));
#1920=DIRECTION('',(1.0,0.0,0.0));
#1921=CARTESIAN_POINT('',(89.045030733358,25.0,2.0));
#1922=DIRECTION('',(0.0,0.0,1.0));
#1923=DIRECTION('',(1.0,0.0,0.0));
#1924=DIRECTION('',(6.12303176911189E-17,1.0,0.0));
#1925=CARTESIAN_POINT('',(89.545030733358,21.0,2.0));
#1926=DIRECTION('',(0.0,0.0,1.0));
#1927=DIRECTION('',(1.0,0.0,0.0));
#1928=DIRECTION('',(-1.0,1.22460635382238E-16,0.0));
#1929=CARTESIAN_POINT('',(88.545030733358,21.0,2.0));
#1930=DIRECTION('',(0.0,0.0,1.0));
#1931=DIRECTION('',(1.0,0.0,0.0));
#1932=DIRECTION('',(6.12303176911189E-17,-1.0,0.0));
#1933=CARTESIAN_POINT('',(89.045030733358,25.0,2.0));
#1934=DIRECTION('',(0.0,0.0,1.0));
#1935=DIRECTION('',(1.0,0.0,0.0));
#1936=DIRECTION('',(0.0,0.0,-1.0));
#1937=DIRECTION('',(1.0,-1.22460635382238E-16,0.0));
#1938=DIRECTION('',(0.0,0.0,-1.0));
#1939=DIRECTION('',(1.0,1.22460635382238E-16,0.0));
#1940=DIRECTION('',(-6.12303176911189E-17,1.0,0.0));
#1941=DIRECTION('',(-0.707106781186546,0.707106781186549,0.0));
#1942=DIRECTION('',(-1.0,-1.22460635382238E-16,0.0));
#1943=DIRECTION('',(0.0,0.0,-1.0));
#1944=DIRECTION('',(0.0,0.0,1.0));
#1945=DIRECTION('',(-1.0,-2.44921270764476E-16,0.0));
#1946=DIRECTION('',(0.0,0.0,1.0));
#1947=DIRECTION('',(0.0,0.0,-1.0));
#1948=DIRECTION('',(0.0,0.0,-1.0));
#1949=CARTESIAN_POINT('',(69.045030733358,25.0,2.0));
#1950=DIRECTION('',(0.0,0.0,1.0));
#1951=DIRECTION('',(1.0,0.0,0.0));
#1952=CARTESIAN_POINT('',(69.045030733358,25.0,2.0));
#1953=DIRECTION('',(0.0,0.0,1.0));
#1954=DIRECTION('',(1.0,0.0,0.0));
#1955=DIRECTION('',(0.0,0.0,1.0));
#1956=DIRECTION('',(1.0,1.22460635382238E-16,0.0));
#1957=DIRECTION('',(0.0,0.0,1.0));
#1958=DIRECTION('',(1.0,1.22460635382238E-16,0.0));
#1959=DIRECTION('',(0.0,0.0,1.0));
#1960=DIRECTION('',(0.0,0.0,1.0));
#1961=DIRECTION('',(0.0,0.0,-1.0));
#1962=DIRECTION('',(0.0,0.0,-1.0));
#1963=DIRECTION('',(1.0,1.22460635382238E-16,0.0));
#1964=DIRECTION('',(0.0,0.0,1.0));
#1965=DIRECTION('',(0.0,0.0,1.0));
#1966=CARTESIAN_POINT('',(89.045030733358,25.0,5.0));
#1967=DIRECTION('',(0.0,0.0,-1.0));
#1968=DIRECTION('',(1.0,0.0,0.0));
#1969=DIRECTION('',(0.0,0.0,-1.0));
#1970=DIRECTION('',(6.12303176911189E-17,-1.0,0.0));
#1971=DIRECTION('',(-6.12303176911189E-17,1.0,0.0));
#1972=DIRECTION('',(0.0,0.0,-1.0));
#1973=CARTESIAN_POINT('',(69.045030733358,25.0,5.0));
#1974=DIRECTION('',(0.0,0.0,-1.0));
#1975=DIRECTION('',(1.0,0.0,0.0));
#1976=CARTESIAN_POINT('',(106.045030733192,14.6500000004478,9.0000000007285));
#1977=DIRECTION('',(-7.52061061606098E-12,1.0,-4.14878169283672E-11));
#1978=DIRECTION('',(1.0,7.5206106171948E-12,2.73289484470764E-11));
#1979=DIRECTION('',(-0.707106781186546,-0.707106781186549,0.0));
#1980=DIRECTION('',(-6.12303176911189E-17,-1.0,0.0));
#1981=DIRECTION('',(-6.12303176911189E-17,1.0,0.0));
#1982=DIRECTION('',(-6.12303176911189E-17,1.0,0.0));
#1983=DIRECTION('',(-6.12303176911189E-17,-1.0,0.0));
#1984=DIRECTION('',(0.707106781186548,-0.707106781186547,0.0));
#1985=DIRECTION('',(1.0,0.0,0.0));
#1986=DIRECTION('',(0.707106781186548,0.707106781186547,0.0));
#1987=DIRECTION('',(-6.12303176911189E-17,1.0,0.0));
#1988=DIRECTION('',(-1.0,0.0,0.0));
#1989=CARTESIAN_POINT('',(99.045030733358,7.05,5.0));
#1990=DIRECTION('',(0.0,0.0,1.0));
#1991=DIRECTION('',(1.0,0.0,0.0));
#1992=CARTESIAN_POINT('',(59.045030733358,7.05,5.0));
#1993=DIRECTION('',(0.0,0.0,1.0));
#1994=DIRECTION('',(1.0,0.0,0.0));
#1995=CARTESIAN_POINT('',(89.045030733358,25.0,5.0));
#1996=DIRECTION('',(0.0,0.0,1.0));
#1997=DIRECTION('',(1.0,0.0,0.0));
#1998=CARTESIAN_POINT('',(69.045030733358,25.0,5.0));
#1999=DIRECTION('',(0.0,0.0,1.0));
#2000=DIRECTION('',(1.0,0.0,0.0));
#2001=CARTESIAN_POINT('',(69.045030733358,25.0,2.0));
#2002=DIRECTION('',(0.0,0.0,1.0));
#2003=DIRECTION('',(1.0,0.0,0.0));
#2004=DIRECTION('',(6.12303176911189E-17,-1.0,0.0));
#2005=CARTESIAN_POINT('',(68.545030733358,29.0,2.0));
#2006=DIRECTION('',(0.0,0.0,1.0));
#2007=DIRECTION('',(1.0,0.0,0.0));
#2008=DIRECTION('',(1.0,0.0,0.0));
#2009=CARTESIAN_POINT('',(69.545030733358,29.0,2.0));
#2010=DIRECTION('',(0.0,0.0,1.0));
#2011=DIRECTION('',(1.0,0.0,0.0));
#2012=DIRECTION('',(6.12303176911189E-17,1.0,0.0));
#2013=DIRECTION('',(6.12303176911189E-17,1.0,0.0));
#2014=CARTESIAN_POINT('',(69.545030733358,21.0,2.0));
#2015=DIRECTION('',(0.0,0.0,1.0));
#2016=DIRECTION('',(1.0,0.0,0.0));
#2017=DIRECTION('',(-1.0,1.22460635382238E-16,0.0));
#2018=CARTESIAN_POINT('',(68.545030733358,21.0,2.0));
#2019=DIRECTION('',(0.0,0.0,1.0));
#2020=DIRECTION('',(1.0,0.0,0.0));
#2021=DIRECTION('',(6.12303176911189E-17,-1.0,0.0));
#2022=CARTESIAN_POINT('',(69.045030733358,25.0,2.0));
#2023=DIRECTION('',(0.0,0.0,1.0));
#2024=DIRECTION('',(1.0,0.0,0.0));
#2025=DIRECTION('',(0.0,0.0,1.0));
#2026=DIRECTION('',(0.0,0.0,1.0));
#2027=DIRECTION('',(0.0,0.0,1.0));
#2028=DIRECTION('',(0.0,0.0,-1.0));
#2029=DIRECTION('',(0.0,0.0,-1.0));
#2030=DIRECTION('',(0.0,0.0,-1.0));
#2031=DIRECTION('',(0.0,0.0,-1.0));
#2032=DIRECTION('',(0.0,0.0,-1.0));
#2033=DIRECTION('',(0.0,0.0,-1.0));
#2034=DIRECTION('',(0.0,0.0,1.0));
#2035=DIRECTION('',(0.0,0.0,1.0));
#2036=DIRECTION('',(0.0,0.0,1.0));
#2037=DIRECTION('',(0.0,0.0,1.0));
#2038=DIRECTION('',(0.0,0.0,1.0));
#2039=DIRECTION('',(0.0,0.0,1.0));
#2040=DIRECTION('',(0.0,0.0,1.0));
#2041=DIRECTION('',(0.0,0.0,1.0));
#2042=DIRECTION('',(0.0,0.0,1.0));
#2043=DIRECTION('',(0.0,0.0,1.0));
#2044=DIRECTION('',(0.0,0.0,1.0));
#2045=DIRECTION('',(0.0,0.0,1.0));
#2046=DIRECTION('',(0.0,0.0,1.0));
#2047=DIRECTION('',(0.0,0.0,1.0));
#2048=DIRECTION('',(0.0,0.0,1.0));
#2049=DIRECTION('',(0.0,0.0,1.0));
#2050=DIRECTION('',(0.0,0.0,1.0));
#2051=DIRECTION('',(0.0,0.0,1.0));
ENDSEC;
END-ISO-10303-21;
