Distance;Time;Velocity Kalman
0;144214;0
0;5415433;0
0;10823054;0
0;15549011;0
0;20895777;0
0;25321512;0
0;30393799;0
0;35971792;0
0;40574371;0
0;45232018;0
0;51001036;0
0;55460059;0
0;60021572;0
0;65484814;0
0;69999556;0
0;75453567;0
0;80665153;0
0;85037962;0
0;90594087;0
0;94971778;0
0;100490767;0
0;105939487;0
0;110642908;0
0;115265567;0
0;120723837;0
0;125554240;0
0;130476376;0
0;135925017;0
0;140439535;0
0;145124920;0
0;149977959;0
0;155432112;0
0;160791153;0
0;165242756;0
0;170661280;0
0;174997944;0
0;180542429;0
0;185858836;0
0;190341195;0
0;195085614;0
0;200151176;0
0;205510423;0
0;211089564;0
0;215659695;0
0;220077329;0
0;225511375;0
0;230547332;0
0;234989131;0
0;240435990;0
0;245614069;0
0;250247061;0
0;255589149;0
0;260226090;0
0;265142291;0
0;270561214;0
0;275030885;0
0;280281423;0
0;285744251;0
0;290224103;0
0;295625542;0
0;300073578;0
0;305469276;0
0;310969840;0
0;315760170;0
0;320114504;0
0;325520796;0
0;330957178;0
0;335569104;0
0;340895614;0
0;344980273;0
0;350640368;0
0;355343759;0
0;360877032;0
0;365999229;0
0;370558248;0
0;375960121;0
0;380547736;0
0;385938012;0
0;390459958;0
0;395510294;0
0;401010628;0
0;405317546;0
0;410775273;0
0;415407662;0
0;420751737;0
0;424993683;0
0;430526030;0
0;434990900;0
0;440457485;0
0;445151484;0
0;450813701;0
0;455287789;0
0;460667707;0
0;465030352;0
0;470478470;0
0;475878043;0
0;480627505;0
0;484977227;0
0;490441284;0
0;495549358;0
0;501011652;0
0;505402673;0
0;510968532;0
0;515022063;0
0;520681213;0
0;525141453;0
0;530171320;0
0;535667144;0
0;540122860;0
0;545913718;0
0;550398699;0
0;555848023;0
0;560496711;0
0;565136434;0
0;570646867;0
0;574944522;0
0;580376726;0
0;585708331;0
0;590201729;0
0;595876482;0
0;600386433;0
0;605834861;0
0;610305443;0
0;615251574;0
0;620746369;0
0;625079060;0
0;630221835;0
0;635701610;0
0;640121561;0
0;645304520;0
0;650971478;0
0;655372790;0
0;660004207;0
0;664951074;0
2.79932;670383235;0.0279932
5.52466;675872409;0.0552466
8.17627;680038990;0.0817627
13.418;685554566;0.13418
18.5161;690055268;0.185161
23.471;694908374;0.23471
30.8113;700486488;0.308113
37.9431;705825472;0.379431
44.8677;710426658;0.448677
51.5859;715628279;0.515859
60.492;720060672;0.60492
69.1319;725360852;0.691319
77.5078;730985795;0.775078
87.8782;735784078;0.878782
97.9297;740243436;0.979297
107.665;745571470;1.07665
119.208;750254554;1.19208
130.385;755166880;1.30385
141.199;760955962;1.41199
151.656;765020133;1.48856
163.765;770531258;1.58241
175.472;775954960;1.67296
186.782;779979977;1.73364
199.686;785451439;1.8117
212.15;790852140;1.88679
224.18;795374953;1.93369
237.761;800862677;1.99818
250.867;805222742;2.06
263.506;810706598;2.1192
275.685;815113932;2.15193
289.379;820439402;2.20247
302.575;825722947;2.25067
315.281;830660417;2.27403
329.464;835683507;2.31534
343.122;840185967;2.35457
356.262;845751856;2.37054
370.844;850199656;2.40459
384.875;855649769;2.43676
398.364;860353782;2.46708
411.321;865932564;2.47556
425.697;870378253;2.50225
439.509;875803255;2.52728
452.768;880213542;2.53083
467.416;885638734;2.55266
481.481;890126557;2.573
494.973;895004030;2.57212
509.827;900467618;2.5896
524.081;905893910;2.60574
537.744;910613473;2.62059
550.831;915237050;2.61452
565.265;920687467;2.6269
579.096;925219203;2.63815
592.335;930108262;2.62871
606.899;935572629;2.63778
620.847;940945009;2.64585
634.19;945656082;2.63347
648.838;950085982;2.63963
662.857;955548875;2.64493
676.262;960257234;2.64941
689.065;965934318;2.63368
703.167;970384894;2.63657
716.644;975843354;2.63876
729.511;980409345;2.62095
743.659;985768521;2.62178
757.175;990398770;2.62202
770.074;995455914;2.60246
782.369;1000429396;2.58288
795.942;1005821904;2.58198
808.892;1010338190;2.58061
821.232;1015425826;2.55967
834.835;1020867304;2.5574
847.81;1025293191;2.55475
860.17;1030029222;2.53271
873.779;1035426190;2.52933
886.755;1040798421;2.52565
899.112;1045808223;2.50275
912.706;1050312925;2.49849
925.662;1055902216;2.49401
937.997;1060574530;2.48932
949.725;1065109050;2.46558
962.692;1070773184;2.46048
975.035;1075256027;2.45524
986.768;1080331474;2.43109
999.73;1085751206;2.42555
1012.07;1090236638;2.41992
1023.79;1095836869;2.41421
1036.73;1100264635;2.40789
1049.04;1105611784;2.40153
1060.75;1110113934;2.39514
1071.85;1115927659;2.37015
1084.18;1120292023;2.36368
1095.89;1125620353;2.35722
1107.01;1130752430;2.3323
1119.34;1135450809;2.32583
1131.05;1140858238;2.31941
1142.17;1144920882;2.29466
1154.49;1150474991;2.28829
1166.2;1155140970;2.28202
1177.31;1160704920;2.27583
1187.83;1165827945;2.25142
1199.57;1170367232;2.24535
1210.71;1175747407;2.23939
1221.26;1180282536;2.21532
1233.02;1185618687;2.20952
1244.17;1190114691;2.20385
1254.75;1194998366;2.18019
1266.52;1200491502;2.17471
1277.68;1205822276;2.16938
1288.27;1210275384;2.1642
1298.29;1215826622;2.14113
1309.51;1220270328;2.13617
1320.15;1225669664;2.13136
1330.22;1230320032;2.10877
1341.47;1235889878;2.1042
1352.15;1240442487;2.0998
1362.26;1244990820;2.07771
1373.55;1250447569;2.07355
1384.26;1255912018;2.06957
1394.41;1260279193;2.06576
1405.73;1265751451;2.06156
1416.46;1270189354;2.05754
1426.63;1275609871;2.05369
1436.25;1279999567;2.03235
1447.05;1285361501;2.02875
1457.28;1290701393;2.02533
1466.97;1295779757;2.00451
1477.82;1300351042;2.00134
1488.11;1305814908;1.99835
1497.84;1310396524;1.99553
1507.05;1316025609;1.9754
1517.43;1320683374;1.97281
1527.26;1325163821;1.9704
1536.55;1330539342;1.95077
1547.01;1335366710;1.94859
1556.92;1340721077;1.94658
1566.3;1345154286;1.92744
1576.83;1350649448;1.92565
1586.81;1354997878;1.92403
1596.26;1360210803;1.90536
1606.86;1365696208;1.90395
1616.9;1370167574;1.9027
1626.41;1375570666;1.90161
1635.41;1380282306;1.88355
1645.55;1385586583;1.88264
1655.16;1390928009;1.88189
1664.24;1395281668;1.86425
1674.47;1400863795;1.86367
1684.17;1405217743;1.86323
1693.34;1410664669;1.86292
1702.01;1415126638;1.84583
1711.82;1420501347;1.84567
1721.12;1425900338;1.84565
1729.9;1430925700;1.82892
1739.82;1435355099;1.82902
1749.22;1440638207;1.82926
1758.12;1445626012;1.81287
1768.14;1450086668;1.81323
1777.63;1455676716;1.81371
1786.62;1460097235;1.79765
1796.72;1465472784;1.79823
1806.31;1470951547;1.79893
1815.38;1475793973;1.79973
1823.96;1480443556;1.78408
1833.65;1485838789;1.78496
1842.84;1490293028;1.78595
1851.53;1495937220;1.77056
1861.33;1500434510;1.77161
1870.62;1505765814;1.77276
1879.41;1510229621;1.774
1887.72;1515496783;1.75895
1897.14;1520974805;1.76023
1906.06;1525383748;1.7616
1914.5;1530454141;1.74676
1924.04;1535047904;1.74816
1933.08;1540371235;1.74963
1941.64;1545344222;1.735
1951.28;1551144879;1.7365
1960.43;1555878178;1.73807
1969.09;1560294306;1.72362
1977.27;1565553402;1.70967
1986.55;1571011762;1.71173
1995.34;1575453441;1.71387
2003.66;1580865720;1.70006
2013.06;1585293460;1.70219
2021.97;1590636494;1.70437
2030.4;1595579064;1.6907
2039.9;1600146930;1.69286
2048.92;1605483761;1.69508
2057.45;1610954664;1.69736
2065.52;1615170954;1.68386
2074.67;1620642531;1.68608
2083.34;1625045368;1.68836
2091.54;1630360736;1.67495
2100.8;1635836066;1.67718
2109.58;1640190952;1.67945
2117.89;1645496411;1.66613
2127.26;1650904799;1.66834
2136.15;1655396796;1.67059
2144.56;1660046346;1.67289
2152.52;1665616355;1.65968
2161.53;1670068826;1.6619
2170.07;1675451896;1.66416
2178.16;1680959839;1.65101
2187.28;1685320907;1.65319
2195.94;1690671634;1.6554
2204.13;1695440814;1.6423
2213.36;1700930377;1.64443
2222.11;1705318547;1.64661
2230.41;1710914149;1.64881
2238.25;1715122228;1.63578
2247.13;1720697440;1.63789
2255.54;1725135990;1.64004
2263.5;1730907710;1.62704
2272.49;1735599039;1.62909
2281.01;1739994245;1.63117
2289.08;1745737865;1.6182
2298.16;1750208673;1.62018
2306.78;1755666248;1.6222
2314.94;1760283485;1.62425
2322.67;1765732519;1.61134
2331.4;1770217322;1.61328
2339.68;1775652552;1.61525
2347.52;1780002877;1.60236
2356.36;1785358026;1.60422
2364.75;1790896361;1.60612
2372.69;1795477129;1.59325
2380.19;1800253273;1.58079
2388.71;1805607044;1.58299
2396.77;1810087551;1.58523
2404.4;1815490349;1.57278
2413.03;1820999213;1.5749
2421.21;1825499349;1.57705
2428.95;1830353046;1.56461
2437.68;1835926162;1.56665
2445.95;1840268343;1.56871
2453.79;1845763272;1.55628
2462.6;1850219857;1.55823
2470.97;1855712259;1.56021
2478.89;1860175349;1.56223
2487.77;1865606965;1.56371
2496.21;1870105772;1.56523
2504.2;1875657668;1.56678
2511.76;1880083180;1.55402
2520.29;1885578518;1.55545
2528.38;1890911311;1.55692
2536.03;1895994065;1.55842
2544.64;1900398653;1.55939
2552.81;1905702860;1.5604
2560.55;1910184084;1.56145
2567.87;1915380051;1.54836
2576.14;1920844991;1.54929
2583.98;1925210012;1.55026
2591.4;1930942022;1.5372
2599.76;1935303143;1.53805
2607.69;1940636369;1.53896
2615.2;1945267577;1.52592
2623.64;1951066381;1.52672
2631.64;1955951425;1.52756
2639.23;1960380177;1.51457
2646.4;1965670096;1.50198
2654.51;1970085589;1.50313
2662.2;1975536501;1.50433
2669.47;1980683431;1.49177
2677.66;1985071573;1.49286
2685.43;1990578543;1.494
2692.79;1995057885;1.48149
2701.06;2000532045;1.48253
2708.91;2005856114;1.48361
2716.34;2010356210;1.48475
2723.37;2015300885;1.47233
2731.31;2020766134;1.47335
2738.84;2025123416;1.47443
2745.96;2030487110;1.46204
2753.99;2035005440;1.46301
2761.6;2040371697;1.46403
2768.81;2045686289;1.45168
2776.91;2050245228;1.4526
2784.59;2055988081;1.45358
2791.86;2059899338;1.4546
2800.02;2065300272;1.45512
2807.77;2070773908;1.4557
2815.1;2075203057;1.45633
2822.04;2080652141;1.44377
2829.86;2085039662;1.44429
2837.28;2090545718;1.44487
2844.3;2095100648;1.43236
2852.19;2100560538;1.43284
2859.68;2105966408;1.43338
2866.77;2110976008;1.43398
2874.72;2115828427;1.43408
2882.26;2120245949;1.43424
2889.41;2125598171;1.43446
2896.17;2130101836;1.42178
2903.79;2135756018;1.4219
2911.01;2140087355;1.42208
2917.85;2145448569;1.40946
2925.54;2150890494;1.40956
2932.84;2155428065;1.40972
2939.74;2160066562;1.39716
2947.49;2165444479;1.39724
2954.84;2170802565;1.39738
2961.8;2175232929;1.39759
2968.38;2180761557;1.38518
2975.81;2185088757;1.3853
2982.85;2190586252;1.38548
2989.51;2195005267;1.37315
2995.8;2200952464;1.3612
3002.94;2205377285;1.36169
3009.69;2210895527;1.34975
3016.08;2215937353;1.3382
3023.31;2220418492;1.33899
3030.15;2225805751;1.33985
3036.63;2230497498;1.32837
3043.93;2235269678;1.32913
3050.85;2240620318;1.32996
3057.4;2245620641;1.31854
3064.76;2250046180;1.31927
3071.75;2255564446;1.32007
3078.36;2260338849;1.30872
3085.78;2265784986;1.30941
3092.82;2270255958;1.31018
3099.48;2275860410;1.31102
3105.79;2280055515;1.29978
3112.9;2285454852;1.3005
3119.64;2290820307;1.30129
3126.01;2295800691;1.30215
3133.19;2300361741;1.3025
3139.99;2305733493;1.30293
3146.43;2310250562;1.30342
3152.51;2315154848;1.29203
3159.39;2320652287;1.2924
3165.91;2325124414;1.29283
3172.08;2330921336;1.28148
3179.03;2335283541;1.2818
3185.62;2340619655;1.28219
3191.85;2345789263;1.27088
3198.86;2350214939;1.27116
3205.51;2355675228;1.2715
3211.8;2360488235;1.26025
3217.75;2365627456;1.24936
3224.48;2370306124;1.24996
3230.85;2375707850;1.25063
3236.88;2380584134;1.23979
3243.67;2385063505;1.24034
3250.11;2390419508;1.24095
3256.2;2395264050;1.23015
3263.05;2400854450;1.23065
3269.55;2405223151;1.23121
3275.69;2410748562;1.23185
3281.51;2415260532;1.22115
3288.08;2420714569;1.22166
3294.3;2425158786;1.22223
3300.18;2430022897;1.21156
3306.82;2435589785;1.21201
3313.1;2440905772;1.21252
3319.05;2445122973;1.20189
3325.74;2450606277;1.20227
3332.08;2455092055;1.20273
3338.08;2460726516;1.20326
3344.81;2465275844;1.20329
3351.19;2470658886;1.2034
3357.24;2475042922;1.20358
3362.95;2480293978;1.1928
3369.39;2485630838;1.19285
3375.5;2490091498;1.19297
3381.27;2495519468;1.18222
3387.77;2501058916;1.18221
3393.92;2505393193;1.18228
3399.75;2510984598;1.18241
3405.25;2515254022;1.17178
3411.48;2520819409;1.17178
3417.37;2525462283;1.17186
3422.94;2530700288;1.16126
3429.22;2535248396;1.1612
3435.17;2540640764;1.16123
3440.81;2545762341;1.15067
3447.13;2550748468;1.15056
3453.13;2555332309;1.15054
3458.81;2560852920;1.14002
3465.18;2565427764;1.13987
3471.22;2570827837;1.1398
3476.93;2575351423;1.13981
3482.34;2580280748;1.12942
3488.43;2585607107;1.1293
3494.2;2590227381;1.12925
3499.66;2595040009;1.11891
3504.81;2600801373;1.10891
3510.66;2605139653;1.10907
3516.19;2610611952;1.10932
3521.41;2615565791;1.09935
3527.32;2620965158;1.09947
3532.91;2625500330;1.09965
3538.2;2630696220;1.08972
3544.15;2635072077;1.08978
3549.8;2640394154;1.08991
3555.14;2645122826;1.08002
3561.13;2650616441;1.08001
3566.82;2655394611;1.08009
3572.2;2660812016;1.07024
3578.23;2665264020;1.07019
3583.95;2670734715;1.07021
3589.37;2675520502;1.07032
3594.49;2680136215;1.06059
3600.25;2685510015;1.06055
3605.72;2690870622;1.0606
3610.89;2694968201;1.06072
3616.69;2700490415;1.06037
3622.2;2705792999;1.06009
3627.4;2710362957;1.0599
3632.32;2715351980;1.05005
3637.88;2720724600;1.04971
3643.14;2725263311;1.04945
3648.12;2730186115;1.03963
3653.72;2735780273;1.03923
3659.03;2740141315;1.03892
3664.05;2745132954;1.02913
3669.69;2750868624;1.02868
3675.03;2755719857;1.02831
3680.09;2760145675;1.01857
3684.87;2765432963;1.00915
3690.27;2770853938;1.00897
3695.37;2775435060;1.00888
3700.2;2780703853;0.999498
3705.64;2785060736;0.999257
3710.8;2790485192;0.999105
3715.67;2795165107;0.989761
3721.14;2800616343;0.989463
3726.33;2804919960;0.989255
3731.23;2810428538;0.989131
3735.87;2815854054;0.979906
3741.1;2820311506;0.979631
3746.06;2825510438;0.979444
3751.6;2830262146;0.978785
3756.85;2835198010;0.978219
3761.82;2840631728;0.977745
3766.52;2845155836;0.968356
3771.81;2850663670;0.967732
3776.81;2855170752;0.967201
3781.54;2860815098;0.966757
3786.85;2865285703;0.965844
3791.88;2870717913;0.965026
3796.63;2875209794;0.964298
3801.13;2880429333;0.954847
3806.19;2885810375;0.95397
3810.99;2890300504;0.953189
3815.52;2894968969;0.943776
3820.61;2900447625;0.942851
3825.44;2905863735;0.942023
3830;2910296252;0.941287
3835.11;2915941793;0.940089
3839.96;2920552948;0.938991
3844.54;2925994251;0.929453
3848.87;2930548395;0.920236
3853.75;2935057140;0.919314
3858.37;2940492545;0.918495
3862.74;2944996273;0.909327
3867.65;2950524100;0.908366
3872.29;2955991962;0.907506
3876.69;2960924469;0.898393
3881.62;2965423955;0.897392
3886.28;2970782681;0.896501
3890.7;2975300107;0.895706
3894.87;2980667554;0.886747
3899.57;2985034472;0.885807
3904.02;2990651346;0.88497
3908.22;2995263473;0.876062
3912.95;3000819550;0.875081
3917.42;3005221054;0.874204
3921.65;3010675919;0.865352
3925.64;3015420967;0.856811
3930.15;3020726834;0.856097
3934.42;3025157606;0.855484
3938.45;3030515464;0.846988
3943;3035861839;0.846225
3947.3;3040211166;0.845565
3951.36;3046006556;0.837113
3955.93;3050609613;0.836304
3960.25;3055165409;0.8356
3964.34;3060627556;0.827198
3968.92;3064970322;0.826341
3973.26;3070403860;0.825592
3977.36;3075058512;0.824945
3981.24;3080750926;0.816687
3985.6;3085058194;0.815882
3989.74;3090431510;0.81518
3993.64;3095219070;0.806958
3998.03;3100716395;0.806099
4002.18;3105051160;0.805341
4006.11;3110540581;0.804684
4009.81;3115555339;0.796602
4014;3120859697;0.795779
4017.96;3125418036;0.795058
4021.7;3130282671;0.787005
4025.91;3135659430;0.78612
4029.89;3139987173;0.785338
4033.66;3146089148;0.777317
4037.89;3151281486;0.776371
4041.89;3155892836;0.77553
4045.67;3160499262;0.767544
4049.24;3165017371;0.759848
4053.27;3170550569;0.759129
4057.09;3175085232;0.758514
4060.69;3180512451;0.75084
4064.74;3185862620;0.750052
4068.58;3190327153;0.749368
4072.2;3195847342;0.74172
4076.27;3200420019;0.740866
4080.12;3205823785;0.740116
4083.76;3210363947;0.739466
4087.19;3215241228;0.731944
4091.07;3220640875;0.731115
4094.74;3225144521;0.73039
4098.2;3230753273;0.722884
4102.09;3235668562;0.721978
4105.77;3240262464;0.721178
4109.25;3245729096;0.713693
4113.16;3250170974;0.712714
4116.86;3255731622;0.711842
4120.35;3259896928;0.711071
4124.26;3265370229;0.709846
4127.96;3270744571;0.708728
4131.46;3275361365;0.707715
4134.76;3280761714;0.700202
4138.48;3285134126;0.699005
4141.99;3290497422;0.697917
4145.31;3295645966;0.690423
4149.04;3300264655;0.689153
4152.56;3305827122;0.687995
4155.89;3310689295;0.686941
4159.03;3315360754;0.679572
4162.57;3320788558;0.678333
4165.92;3325610623;0.677202
4169.08;3330380707;0.66985
4172.63;3336015395;0.668537
4175.99;3340362407;0.667333
4179.16;3345112502;0.660005
4182.72;3350912268;0.658622
4186.08;3355543815;0.657353
4189.26;3360574001;0.65005
4192.82;3365013323;0.648604
4196.19;3370398160;0.647273
4199.37;3375666400;0.646051
4202.92;3380208555;0.644385
4206.28;3385547025;0.642835
4209.45;3390960990;0.641399
4212.45;3395945061;0.634118
4215.81;3400400259;0.632501
4218.99;3405853127;0.631002
4221.99;3410862832;0.629616
4224.82;3414948803;0.622473
4228.01;3420354926;0.620901
4231.02;3425493115;0.619447
4233.86;3430044004;0.612329
4237.06;3435446922;0.610692
4240.08;3440750188;0.609173
4242.93;3445257034;0.602088
4246.12;3450684879;0.600388
4249.15;3455170894;0.59881
4252;3460640397;0.591761
4255.19;3465089665;0.590005
4258.2;3470559850;0.588373
4261.05;3475327145;0.581366
4263.74;3480631583;0.574618
4266.76;3485006689;0.573067
4269.61;3490511927;0.571637
4272.3;3495721081;0.564922
4275.32;3500140250;0.563311
4278.17;3505465706;0.561822
4280.86;3510613030;0.560452
4283.87;3515252992;0.558644
4286.72;3520562379;0.556957
4289.4;3525114144;0.555395
4291.93;3530847665;0.548727
4294.78;3535338981;0.546977
4297.46;3540640986;0.545349
4300;3545515045;0.538714
4302.84;3550106430;0.536901
4305.52;3555142292;0.535215
4308.05;3560713128;0.528613
4310.43;3565316442;0.522263
4313.12;3570782988;0.520639
4315.65;3575437308;0.519137
4318.04;3580300343;0.512813
4320.72;3585690014;0.511121
4323.26;3590171283;0.509553
4325.65;3595865299;0.503258
4328.32;3600255057;0.501504
4330.85;3605634622;0.499876
4333.23;3610123174;0.49361
4335.47;3615770354;0.487589
4338;3620149496;0.486012
4340.39;3625513442;0.484558
4343.04;3630162960;0.482671
4345.55;3635192489;0.480912
4347.92;3640702249;0.479281
4350.15;3645025146;0.473197
4352.66;3650547258;0.471369
4355.02;3655904285;0.469669
4357.24;3660770556;0.468092
4359.73;3665130666;0.46608
4362.07;3670452776;0.464199
4364.28;3675951990;0.462442
4366.36;3680482400;0.456419
4368.7;3685866247;0.454463
4370.91;3690322089;0.452633
4372.98;3695370838;0.446631
4375.31;3700848737;0.444606
4377.5;3705237651;0.442711
4379.57;3710799551;0.440944
4381.51;3716022868;0.435091
4383.7;3720592356;0.43312
4385.76;3725374669;0.427162
4387.7;3730722763;0.421441
4389.87;3735243215;0.419503
4391.92;3740606702;0.417697
4393.85;3745608976;0.411997
4396.02;3750180361;0.409993
4398.05;3755707669;0.40812
4399.97;3760367034;0.402448
4402.11;3765802924;0.400376
4404.13;3770130873;0.39844
4406.03;3775672574;0.396632
4408.14;3780069361;0.394398
4410.14;3785376573;0.3923
4412.02;3790762972;0.390333
4413.78;3795625393;0.38475
4415.76;3800149444;0.38258
4417.62;3805484448;0.380542
4419.37;3810997975;0.378637
4421.33;3815572580;0.376303
4423.17;3820935233;0.374107
4424.9;3825327246;0.37204
4426.53;3829968959;0.366544
4428.35;3835335230;0.364274
4430.07;3840693742;0.362138
4431.68;3845540527;0.356664
4433.48;3850532244;0.354324
4435.18;3855130926;0.35212
4436.78;3860335587;0.346676
4438.55;3865715902;0.344271
4440.23;3870154255;0.342007
4441.8;3875996592;0.336593
4443.28;3880510750;0.3314
4444.93;3885870312;0.329149
4446.49;3890384790;0.327036
4447.95;3895899033;0.321867
4449.58;3900402038;0.319548
4451.11;3905759197;0.317369
4452.55;3910260298;0.312227
4453.9;3915442113;0.307297
4455.41;3920899836;0.305123
4456.84;3925320990;0.303085
4458.17;3930018007;0.298173
4459.66;3935383223;0.295924
4461.06;3940758061;0.293812
4462.38;3944983724;0.288922
4463.84;3950497297;0.2866
4465.22;3956065826;0.284419
4466.51;3960319907;0.279552
4467.94;3965811552;0.277161
4469.29;3970292345;0.274913
4470.56;3975813879;0.272802
4471.74;3980307556;0.268097
4473.06;3985597934;0.265769
4474.31;3990067493;0.263582
4475.47;3995431570;0.258892
4476.76;4000978837;0.256488
4477.97;4005367767;0.254227
4479.11;4010736515;0.252103
4480.37;4015286136;0.249559
4481.55;4020682784;0.247162
4482.66;4025373076;0.244902
4483.69;4030386911;0.240325
4484.85;4035269863;0.237847
4485.93;4040747192;0.235508
4486.94;4045614577;0.230946
4488.06;4050076031;0.22839
4489.11;4055550959;0.225978
4490.09;4060553819;0.221436
4491.17;4065929018;0.218805
4492.19;4070348034;0.216322
4493.14;4075752499;0.213981
4494.19;4080168946;0.211224
4495.17;4085517497;0.208617
4496.08;4090881247;0.206155
4496.94;4095558232;0.201748
4497.88;4100232874;0.199064
4498.76;4105743988;0.196526
4499.58;4110198215;0.19214
4500.35;4115923769;0.187943
4501.2;4120381924;0.185375
4501.99;4125994135;0.182949
4502.72;4130685405;0.178766
4503.54;4135228047;0.176115
4504.3;4140584519;0.173612
4505;4145752425;0.169445
4505.78;4150502102;0.166718
4506.5;4155858558;0.164139
4507.17;4160291664;0.159992
4507.91;4165722201;0.157192
4508.59;4170031197;0.154542
4509.23;4175477918;0.15042
4509.81;4180039989;0.14648
4510.46;4185346136;0.143793
4511.06;4190965905;0.141254
4511.61;4195440299;0.137329
4512.22;4199965593;0.134565
4512.78;4205326634;0.131951
4513.29;4210482366;0.129482
4513.86;4215067575;0.126605
4514.38;4220417426;0.123879
4514.85;4225925215;0.121304
4515.29;4230896501;0.117526
4515.77;4235313251;0.114718
4516.21;4240664580;0.112058
4516.61;4245550546;0.108293
4517.04;4250442093;0.105405
4517.44;4255838050;0.102671
4517.8;4260261416;0.0989222
4518.19;4265705150;0.0959595
4518.54;4270144595;0.0931495
4518.86;4275859358;0.0904932
4519.15;4280274864;0.0869104
4519.46;4285564476;0.0840198
4519.74;4290980752;0.0812805
4519.99;4295928195;0.07771
4520.25;4300466862;0.0747376
4520.49;4305871137;0.0719214
4520.69;4310449016;0.068368
4520.88;4315234125;0.0649878
4521.06;4320689597;0.0621033
4521.23;4325332778;0.0593738
4521.37;4330936614;0.0559986
4521.51;4335412646;0.0530322
4521.63;4340750881;0.0502185
4521.73;4345702829;0.0468567
4521.82;4350865619;0.0438074
4521.89;4355785827;0.0409155
4521.95;4360439594;0.0375684
4521.98;4365020695;0.0343848
4522;4370737836;0.0313977
4522.01;4375505237;0.0285669
4522;4380526614;0.0253674
4521.97;4385898074;0.0223303
4521.94;4390438480;0.0194519
4521.88;4395951248;0.0163001
4521.82;4400504714;0.0133069
4521.74;4405913392;0.0104712
4521.65;4410606300;0.00778687
4521.56;4415345562;0.00491577
4521.45;4420803999;0.00219849
4521.33;4425526402;0.000371094
4521.21;4430477873;0.00303955
4521.07;4435973781;0.00555908
4520.94;4440570524;0.00793824
4520.79;4445481461;0.0103284
4520.64;4450954792;0.0125806
4520.48;4455489574;0.0146985
4520.31;4460467416;0.0166858
4520.15;4465872276;0.0185828
4519.97;4470289334;0.0203565
4519.8;4475472196;0.0220105
4519.62;4480882742;0.0235498
4519.44;4485342203;0.024978
4519.25;4490676436;0.0263001
4519.07;4495445265;0.0275171
4518.88;4500975428;0.028634
4518.69;4505402529;0.0296546
4518.5;4510949462;0.0305823
4518.31;4515286954;0.0314209
4518.11;4520907662;0.0321741
4517.92;4525634792;0.0328442
4517.73;4530854195;0.0334375
4517.54;4535601628;0.0339526
4517.35;4541093724;0.0343958
4517.16;4545152193;0.0347681
4516.97;4550606528;0.0350757
4516.78;4555959362;0.0353198
4516.6;4560906544;0.0355029
4516.41;4565393910;0.0356287
4516.23;4570879156;0.0356995
4516.05;4575457689;0.0357178
4515.87;4580895419;0.0356873
4515.69;4585266881;0.0356079
4515.52;4590860230;0.0354859
4515.35;4595027865;0.0353211
4515.18;4600642101;0.0351196
4515.01;4604991319;0.0348779
4514.85;4610518153;0.0346021
4514.69;4615523075;0.0342932
4514.53;4621000765;0.0339539
4514.37;4625726338;0.0335852
4514.22;4630668314;0.0331909
4514.07;4635066193;0.032771
4513.93;4640450569;0.0323291
4513.78;4645417602;0.0318665
4513.64;4650058342;0.0313818
4513.51;4655399841;0.0308826
4513.37;4660657096;0.030365
4513.24;4665015029;0.0298328
4513.12;4670401270;0.0292871
4513;4675034880;0.0287317
4512.88;4680661030;0.0281641
4512.76;4685171690;0.0275879
4512.65;4690510149;0.0270056
4512.54;4695288095;0.0264136
4512.43;4700728734;0.0258179
4512.32;4705051357;0.0252185
4512.22;4710933140;0.0246143
4512.13;4715362774;0.0240076
4512.03;4720879771;0.0234009
4511.94;4725695646;0.022793
4511.85;4730326276;0.0221838
4511.77;4735875792;0.0215784
4511.69;4740252481;0.0209729
4511.61;4745101395;0.0203711
4511.53;4750441388;0.0197717
4511.46;4755855726;0.019176
4511.39;4760752805;0.0185877
4511.32;4765356025;0.0180017
4511.25;4770894158;0.0174207
4511.19;4775616110;0.0168494
4511.13;4780021512;0.0162817
4511.07;4785310265;0.0157227
4511.02;4790735470;0.0151697
4510.97;4795146122;0.0146252
4510.92;4800619925;0.0140894
4510.87;4805001122;0.013562
4510.82;4810458379;0.0130432
4510.78;4815093494;0.0125305
4510.74;4820585020;0.01203
4510.7;4825074480;0.0115405
4510.66;4829930700;0.0110571
4510.63;4835475569;0.0105847
4510.59;4840167830;0.0101233
4510.56;4845354114;0.00967041
4510.53;4850850837;0.00922974
4510.51;4855255643;0.00879639
4510.48;4860421773;0.00837647
4510.46;4865820110;0.00796509
4510.43;4870189567;0.00756226
4510.41;4875453672;0.00717285
4510.39;4880908396;0.00679199
4510.38;4885317006;0.00642334
4510.36;4890753095;0.00606324
4510.34;4895081786;0.00571289
4510.33;4900634441;0.00537354
4510.32;4904974736;0.00504517
4510.31;4911201462;0.00472656
4510.3;4915269964;0.00441773
4510.29;4920974312;0.00411865
4510.28;4925740493;0.00382935
4510.27;4930067811;0.00354981
4510.27;4935606089;0.00327881
4510.26;4941002047;0.0030188
4510.26;4945920295;0.00276734
4510.25;4950307645;0.00252564
4510.25;4955680874;0.00229248
4510.25;4960784176;0.00206787
4510.25;4965178002;0.00185425
4510.25;4970677892;0.00164551
4510.25;4975392163;0.00144653
