Distance;Time;Velocity Kalman
0;230452;0
0;5419934;0
0;9755676;0
0;14754998;0
0;20048798;0
0;25176596;0
0;30416140;0
0;35002487;0
0;40015609;0
0;44789656;0
0;49953216;0
0;55479221;0
0;59467830;0
0;65034507;0
0;71654826;0
0;75131255;0
0;79871533;0
0;84705571;0
0;89988834;0
0;95157681;0
0;100390047;0
0;104920384;0
0;109779464;0
0;114823731;0
0;120111752;0
0;124836240;0
0;130362288;0
0;135469145;0
0;139774985;0
0;144704650;0
0;150036723;0
0;155033746;0
0;160237600;0
0;165461935;0
0;169617782;0
0;174790636;0
0;179845537;0
0;185124323;0
0;189555054;0
0;194720181;0
0;200015616;0
0;205248694;0
0;210421429;0
0;215489483;0
0;220422536;0
0;224723582;0
0;229999294;0
0;235445142;0
0;239657852;0
0;245272166;0
0;249845844;0
0;254935664;0
0;259477946;0
0;265226550;0
0;270256350;0
0;275306169;0
0;280426853;0
0;284635775;0
0;290033084;0
0;294700352;0
36.2372;299858975;0.362372
36.2372;305155302;0.362372
36.2372;310284512;0.362372
36.2372;315444870;0.362372
36.2372;320521453;0.362372
36.2372;325072539;0.362372
36.2372;330327975;0.362372
36.2372;335347627;0.362372
36.2372;340231722;0.362372
36.2372;344532493;0.362372
63.2159;349583405;0.632159
87.7656;355004697;0.877656
109.903;359721562;1.09903
138.594;365160106;1.38594
164.093;369714277;1.64093
186.53;375233832;1.8653
214.129;380363833;2.14129
238.256;384909764;2.38256
259.227;389904475;2.59227
277.373;395507644;2.41138
301.348;399777005;2.65114
322.221;404807172;2.85986
340.358;410356899;3.04123
362.877;414510449;3.26642
382.581;420234811;3.46346
399.813;425115925;3.63579
422.247;430259217;3.86013
442.04;435373782;4.05806
459.506;440539219;4.23272
474.924;446134292;4.11708
494.092;450212591;4.06326
511.148;455143871;4.01245
526.333;460053617;3.87739
544.704;465423306;3.80611
561.174;469684920;3.74643
575.947;474774439;3.61818
594.219;480249824;3.55963
610.719;485493654;3.51493
625.628;490284385;3.48257
639.105;494646607;3.37759
656.132;499667385;3.33914
671.625;504701686;3.31271
685.728;510411381;3.22855
702.414;515444952;3.19837
717.676;520196597;3.17868
731.642;524722989;3.09399
748.258;529837562;3.06223
763.533;534599405;3.0403
777.576;540007062;3.02655
794.171;545443707;3.00084
809.493;550341559;2.9835
823.639;555415675;2.97312
836.7;560021712;2.92006
851.775;564744416;2.90614
865.742;569863075;2.89811
878.681;574823336;2.84477
894.004;579562195;2.833
908.253;585001975;2.82639
921.499;590231810;2.82408
933.809;594693126;2.77691
947.88;599848178;2.76266
960.996;605138137;2.75276
973.215;609676669;2.70809
987.461;614822421;2.69791
1000.78;620178446;2.6914
1013.21;625423172;2.64962
1027.41;629761400;2.63887
1040.71;634775423;2.63143
1053.16;640511736;2.58993
1064.8;645306721;2.55314
1078.04;650290517;2.54401
1090.45;654867890;2.5375
1102.08;659630557;2.50304
1115.39;664929345;2.4965
1127.89;669512900;2.49217
1139.63;674636185;2.45632
1153.09;679840772;2.44838
1165.75;684884911;2.44253
1177.65;690479509;2.43846
1190.93;694738378;2.43051
1203.43;700157026;2.4244
1215.2;705357179;2.41987
1226.26;710126831;2.38801
1238.92;714856284;2.3815
1250.85;720080912;2.37646
1262.09;724993261;2.34681
1274.89;730475325;2.34186
1286.97;734545840;2.33818
1298.35;739704296;2.33558
1311.14;744719496;2.33105
1323.21;749919156;2.32763
1334.59;754949001;2.32516
1345.31;759816018;2.29924
1357.57;765085065;2.29681
1369.15;770142947;2.29521
1380.07;774954228;2.26986
1392.73;780221361;2.26988
1404.71;784715640;2.27059
1416.02;790475441;2.25095
1426.69;794774420;2.23258
1436.73;800011504;2.21535
1448.16;804886289;2.21906
1458.95;810002566;2.20032
1471.21;815086406;2.20356
1482.8;819880297;2.2072
1493.76;824562828;2.18874
1506.2;829793581;2.19235
1517.98;835243098;2.19631
1529.12;839809111;2.17989
1541.56;844769745;2.18355
1553.33;850266524;2.18751
1564.47;855333523;2.19171
1575;860545155;2.17429
1586.91;865440162;2.17763
1598.19;870088972;2.18121
1608.85;874877089;2.16115
1620.93;879704607;2.1622
1632.37;885222852;2.16353
1643.19;890086644;2.1651
1653.41;894530127;2.16687
1665.14;899628523;2.16982
1676.24;904477634;2.17294
1686.73;910344793;2.15532
1698.6;915423037;2.15804
1709.85;920498685;2.16092
1720.49;924494983;2.14289
1732.61;929619123;2.14632
1744.1;934655789;2.14988
1754.99;939608254;2.13436
1765.28;945237157;2.11946
1776.95;949890794;2.12481
1788.01;954664877;2.1302
1798.48;960219208;2.11571
1810.22;965485881;2.12036
1821.35;970068315;2.12506
1831.88;975232313;2.10957
1843.88;980319692;2.11516
1855.26;985460400;2.12076
1866.05;989441718;2.12637
1878.3;994670169;2.13164
1889.93;1000446959;2.13692
1900.95;1005427420;2.14218
1913.34;1010451956;2.14741
1925.11;1015119519;2.15262
1936.26;1019779303;2.1578
1946.82;1025273283;2.14218
1958.87;1030067529;2.1477
1970.3;1035331417;2.15318
1981.13;1039905311;2.15861
1993.45;1045052388;2.16504
2005.15;1050113303;2.17138
2016.23;1054808730;2.17763
2028.56;1060513212;2.18346
2040.26;1064929443;2.18921
2051.36;1070475041;2.19486
2061.87;1075201746;2.17991
2073.84;1080318465;2.18584
2085.21;1085569197;2.19166
2095.98;1090218650;2.17682
2108.28;1095272379;2.18358
2119.97;1100414698;2.19021
2131.05;1104463418;2.17709
2143.36;1109749430;2.1825
2155.04;1114909841;2.18782
2166.13;1120118412;2.19304
2176.62;1124866180;2.17753
2188.53;1130036894;2.18228
2199.83;1135513254;2.18695
2210.53;1140514649;2.17082
2222.65;1144666438;2.17507
2234.16;1150130703;2.17925
2245.07;1155346511;2.16509
2257.47;1160442609;2.17205
2269.25;1165311780;2.17887
2280.42;1170241599;2.18555
2291.01;1174984068;2.17165
2302.96;1179925419;2.17753
2314.31;1185194819;2.18328
2325.06;1189684164;2.16776
2337.14;1195207707;2.17176
2348.62;1200236742;2.17568
2359.5;1204927474;2.16141
2371.86;1209521886;2.16819
2383.61;1214651932;2.17483
2394.76;1219910730;2.18133
2405.32;1224945950;2.16788
2417.09;1230015502;2.17263
2428.26;1235023898;2.17729
2438.85;1240038671;2.16194
2448.86;1244921952;2.14702
2460.3;1250038015;2.15227
2471.14;1254540680;2.13672
2483.42;1259550627;2.14173
2497.64;1264820599;2.17217
2497.64;1270177378;2.06627
2526.52;1275307101;2.23658
2533.09;1280410603;2.18781
2533.09;1286211807;2.08029
2533.09;1289615158;1.95945
2572.08;1295166101;2.23467
2565.24;1300108730;2.05812
2565.24;1305363575;1.93451
2608.89;1310378571;2.25288
2601.66;1314935509;2.06956
2601.66;1320111829;1.96398
2647.39;1325352542;2.30303
2647.39;1330087950;2.19132
2647.39;1335077449;2.08546
2675.15;1340253484;2.26329
2683.24;1344545673;2.22948
2683.24;1349863291;2.12103
2683.24;1355087335;1.99826
2692.9;1360251390;1.95265
2699.15;1365497493;2.01523
2703.76;1369895706;1.7741
2714.16;1374698521;1.81069
2722.94;1379944456;1.8985
2730.58;1384689773;1.97495
2785.41;1389485706;2.13358
2793.04;1394581707;2.27935
2793.04;1399854425;2.27935
2793.04;1415035634;1.84148
2802.55;1421005000;2.0102
2857.5;1425235162;2.55857
2872.18;1432772742;2.24791
2872.18;1435722938;2.24791
2894.31;1440597161;2.46918
2900.43;1446865544;2.25299
2902.64;1450646342;2.19405
2909.53;1455740310;2.26296
2936.44;1460404989;2.53241
2936.44;1465881038;2.43585
2936.44;1470445112;2.37329
2965.27;1475454674;2.61516
2965.27;1480687141;2.51116
2965.27;1485126732;2.42335
2974.2;1490595745;2.43621
2979.99;1495316856;1.94601
2984.25;1500901550;1.91227
2994.2;1505104014;2.01187
3002.61;1510680448;2.09599
3009.93;1515820405;2.07413
3016.38;1520450489;1.58885
3028.15;1525733740;1.55991
3038.65;1530820615;1.66493
3047.94;1535866197;1.53636
3061.44;1540181421;1.61015
3073.32;1545627037;1.70681
3083.67;1550221435;1.74146
3092.62;1555337286;1.56393
3106.21;1560441618;1.69955
3118.02;1565392077;1.81754
3128.26;1570905234;1.6299
3142.4;1576087395;1.77136
3154.74;1580196373;1.8947
3165.47;1585643826;1.91272
3179.59;1591028187;1.99608
3191.98;1595808834;2.07731
3202.83;1600124666;2.08633
3216.95;1605335491;2.14345
3229.43;1610144770;2.19501
3240.45;1615185624;2.24078
3250.2;1620509960;2.22065
3262.76;1625613391;2.2412
3273.95;1630857165;2.26028
3283.94;1635293350;2.22516
3296.57;1640253402;2.23264
3307.91;1645677751;2.24256
3318.11;1650794199;2.2551
3330.8;1655390348;2.24618
3342.29;1660711755;2.24286
3352.68;1665395520;2.24452
3362.1;1670613057;2.1972
3373.84;1675708682;2.19118
3384.53;1680738801;2.19076
3394.28;1685739977;2.14705
3406.23;1690626411;2.14273
3417.18;1695642442;2.14371
3427.22;1700427235;2.10297
3439.4;1705172038;2.09997
3450.61;1710243587;2.10184
3460.94;1715779219;2.10765
3473.26;1720957921;2.10536
3484.66;1725283388;2.10743
3495.21;1730837553;2.11306
3504.97;1735789657;2.08439
3516.52;1740991188;2.08644
3527.24;1745361509;2.09169
3537.21;1750302174;2.06437
3548.95;1755978691;2.06693
3559.88;1761096260;2.07234
3570.08;1766043798;2.08007
3581.92;1770618501;2.08117
3592.99;1776080218;2.08492
3603.33;1780336161;2.09084
3612.99;1785328044;2.06793
3624.22;1791046775;2.07072
3634.74;1795152479;2.07551
3644.59;1800390919;2.0523
3656.06;1805180903;2.05491
3666.83;1810151320;2.05935
3676.94;1815047603;2.0372
3688.66;1820793775;2.04041
3699.69;1826144355;2.04524
3710.07;1830605222;2.0514
3719.82;1835453916;2.03344
3730.98;1840613605;2.03778
3741.5;1845942112;2.04333
3751.4;1850524507;2.02494
3762.81;1856037391;2.02963
3773.57;1860109960;2.03539
3783.73;1865692295;2.01848
3795.12;1870453488;2.0217
3805.88;1875553616;2.02592
3816.04;1880387654;2.03094
3825.63;1885646562;2.01449
3836.81;1890726773;2.02109
3847.38;1895179860;2.02832
3857.38;1900925615;2.01352
3868.76;1905675876;2.01964
3879.54;1910234541;2.02633
3889.74;1915409884;2.0111
3901.13;1920655965;2.01469
3911.92;1925597484;2.01887
3922.14;1930315660;2.0235
3933.66;1935652484;2.02709
3944.58;1940377403;2.03117
3954.93;1945751276;2.03564
3964.72;1950620114;2.01948
3975.93;1955368108;2.02396
3986.57;1960754088;2.02877
3996.65;1965891783;2.0156
4007.96;1970554780;2.02113
4018.69;1975762602;2.02687
4028.87;1981078060;2.03277
4040.36;1985149470;2.03589
4051.27;1990469688;2.03927
4061.62;1995748120;2.04282
4071.42;2000997474;2.02699
4082.54;2005626510;2.03038
4093.09;2010628241;2.03391
4103.09;2015190188;2.02003
4114.33;2020302861;2.02442
4124.99;2025807248;2.0289
4135.1;2030776366;2.01482
4146.49;2036015157;2.01948
4157.3;2040346565;2.02418
4167.56;2045543646;2.02889
4177.28;2050772579;2.01397
4188.33;2055823251;2.01806
4198.81;2060116864;2.02217
4208.75;2066015692;2.0084
4219.95;2070829612;2.01304
4230.59;2075813498;2.01766
4240.68;2080566497;2.00364
4252.11;2085363200;2.0088
4262.97;2091001421;2.01391
4273.28;2096084283;2.01896
4283.05;2100208069;2.00543
4293.95;2105078611;2.0089
4304.3;2110166356;2.01233
4314.1;2115538186;1.99807
4325.25;2121135010;2.00287
4335.83;2125435132;2.00759
4345.87;2130993730;1.99409
4356.93;2135596112;1.99652
4367.44;2140882376;1.99893
4377.39;2145498861;2.00131
4386.83;2150319687;1.98517
4397.78;2155488117;1.98985
4408.18;2160733021;1.99444
4418.04;2165109491;1.98103
4429.2;2170954002;1.98629
4439.81;2175995809;1.99145
4449.87;2181038584;1.97777
4461;2185977235;1.98046
4471.57;2191048487;1.9831
4481.59;2195155045;1.98571
4492.91;2200171858;1.98987
4503.66;2205329272;1.99394
4513.87;2210872547;1.99791
4523.54;2215209801;1.98317
4534.59;2220379053;1.98786
4545.09;2225252616;1.99243
4555.04;2230722157;1.98138
4566.27;2235905033;1.98864
4576.94;2240966898;1.99573
4587.06;2245571354;2.00265
4598.4;2250865748;2.00653
4609.18;2255451251;2.01032
4619.41;2260502141;2.014
4629.1;2266003955;1.99928
4639.95;2270583407;2.00169
4650.25;2275746752;2.00404
4660.01;2280344755;1.99035
4671.07;2285139137;1.99524
4681.58;2290477377;2.00002
4691.54;2295515287;1.98649
4700.97;2300799588;1.97333
4709.9;2305405533;1.96053
4720;2310712647;1.96481
4729.57;2315444800;1.94998
4740.38;2321093462;1.95316
4750.64;2325474966;1.95628
4760.37;2330358849;1.94132
4771.45;2335239237;1.94543
4781.98;2340274900;1.94947
4791.96;2345246101;1.93592
4802.93;2351054845;1.93782
4813.35;2355184260;1.93971
4823.23;2360940371;1.94158
4832.59;2365509753;1.9267
4843.4;2370900371;1.93184
4853.66;2375838159;1.93688
4863.4;2380994324;1.9236
4874.27;2385411087;1.92728
4884.6;2390174007;1.9309
4894.39;2395995468;1.93446
4905.29;2400653747;1.95424
4915.65;2405550601;1.95679
4925.47;2410753926;1.9593
4936.17;2415141967;1.95808
4946.32;2421013967;1.95691
4955.94;2425176037;1.95579
4965.05;2430563089;1.93607
4975.5;2436027102;1.93532
4985.42;2440882649;1.93462
4994.82;2446033022;1.91891
5005.47;2451825577;1.92125
