Distance;Time;Velocity Kalman
0;384424;0.0173916
0.025782;4735869;0.015143
0.048495;9558461;0.0134566
0.066923;14970294;0.0118906
0.112814;19553971;0.0107091
0.161166;24550608;0.00997858
0.207345;30163058;0.00924639
0.260261;35360010;0.00821625
0.314526;39872017;0.00766691
0.423331;45335943;0.00814346
0.525446;50310094;0.00993854
0.621341;54767780;0.0119517
0.624711;60242103;0.0129172
0.632457;64729176;0.0119541
0.643972;69828278;0.0111641
0.681473;75274237;0.00965004
0.723225;79716925;0.00857765
0.767258;84936401;0.00799239
0.758844;90596778;0.00731699
0.782738;94799083;0.00782738
0.83053;99659151;0.00856295
0.823579;105271483;0.00871989
0.818145;109583642;0.00857603
0.813284;115540976;0.00848827
0.822378;120458064;0.00858291
0.831791;125455186;0.00828777
0.841622;129631758;0.00806005
0.866541;135144996;0.00788152
0.890818;139546241;0.00804821
0.915515;144700351;0.00826388
0.934104;150314103;0.00873982
0.95326;154568006;0.00846728
0.971854;160316075;0.00821219
0.93965;165082790;0.00658283
0.92661;169438412;0.0048512
0.931477;175113031;0.00328131
0.941619;179777470;0.00305155
0.954337;184983786;0.00229125
0.969755;189835246;0.00187033
0.992776;195327463;0.00201132
1.01675;199417925;0.00217984
1.04146;205121191;0.00239282
1.06919;209537979;0.00261256
1.0989;215169416;0.00277873
1.10973;219818446;0.0028754
1.12136;225289038;0.00303678
1.13318;229402198;0.00289681
1.14556;235444042;0.00277363
1.94586;240025782;0.0114118
1.94586;245385322;0.0111445
1.94586;250292815;0.0108789
2.11283;254810887;0.0131265
2.24214;259823554;0.0162215
2.34613;265471453;0.0188949
27.927;270394266;0.273413
27.927;274925509;0.272924
27.927;279657798;0.272451
81.703;285187496;0.807484
81.703;290161908;0.807194
81.703;294948873;0.806911
97.8053;300438901;0.967643
108.283;304472709;1.07214
116.014;310147596;1.1492
133.925;314661361;1.3282
149.079;319591404;1.4796
162.289;324791137;1.61158
184.812;329662693;1.83668
204.96;335373235;2.0326
222.869;340269224;2.21176
250.033;345008113;2.48349
274.094;349524840;2.72452
295.176;355382431;2.93565
325.266;360057687;3.23686
351.576;365213087;3.30776
374.415;369629348;3.53665
404.888;375106953;3.8422
431.415;380167135;3.51409
454.424;385297753;3.74466
482.772;389945086;4.02843
507.481;394778414;4.1119
528.99;399905441;4.22102
556.11;405323736;4.41426
579.9;409382062;4.47185
600.766;415393353;4.52825
626.386;419968931;4.65188
649.028;425175096;4.65191
669.045;429696578;4.6498
694.49;435059011;4.72462
717.167;439548002;4.6787
744.038;445040280;4.70613
768.132;450480860;4.73577
789.75;455364712;4.65024
809.157;459982726;4.58062
832.83;464504269;4.58851
854.218;469743451;4.49681
873.552;474990390;4.42425
896.687;480520867;4.425
917.716;485004638;4.35153
936.839;490467613;4.29546
959.311;495037049;4.30495
979.846;499925770;4.23895
998.617;505023163;4.18865
1020.38;509494940;4.19757
1040.37;514823728;4.14111
1058.72;520440368;4.0981
1075.57;525003128;4.06638
1091.05;529652553;3.96659
1105.26;534393175;3.88184
1126.92;539812131;3.82968
1146.99;544720828;3.7893
1165.57;550390395;3.75888
1186.8;554820156;3.77705
1206.53;560131118;3.7375
1224.85;564777685;3.70679
1245.51;570487559;3.72005
1264.75;574650297;3.68117
1282.68;579697761;3.65012
1302.82;585495573;3.6603
1321.62;589455155;3.62359
1339.18;595156335;3.59373
1358.88;599568953;3.60304
1377.31;604442953;3.5697
1394.55;610133723;3.54225
1410.67;614663766;3.51987
1425.72;619628720;3.50185
1439.76;625320976;3.48754
1459.04;629783993;3.53823
1477.15;635126551;3.50259
1497.01;639757284;3.50059
1515.7;645332895;3.50165
1533.28;649680518;3.46506
1552.58;655361496;3.4609
1570.77;660005586;3.45949
1587.88;665324384;3.42393
1603.96;670288039;3.39229
1621.87;674816695;3.39209
1638.73;680440058;3.35932
1654.6;685377592;3.32997
1672.16;689854414;3.33002
1688.71;694659346;3.29846
1704.29;700324814;3.26993
1721.41;704750220;3.26874
1737.56;710268492;3.26906
1755.29;714992778;3.29592
1772.04;720377947;3.32294
1787.84;724509523;3.28813
1802.72;730203296;3.25589
1819.31;734818293;3.22311
1834.97;740009641;3.19277
1849.73;744769533;3.16462
1866.03;750251529;3.13462
1881.43;754452349;3.10675
1898.4;759945710;3.10537
1914.45;765384168;3.10497
1929.6;770387195;3.07741
1943.88;775106839;3.0516
1959.72;779750436;3.05125
1974.67;785737669;3.02524
1991.25;790679968;3.02555
2006.94;795355011;3.02658
2021.75;800356599;3.00352
2035.73;805311945;2.98182
2051.18;809938877;2.95899
2065.78;814644634;2.9375
2082.01;820176439;2.94177
2097.36;824939428;2.94648
2111.87;830170594;2.92565
2125.56;835048440;2.90596
2140.81;840462460;2.91085
2155.22;845485264;2.8919
2168.82;850489490;2.87396
2184.06;854891675;2.85664
2198.47;859826262;2.84028
2212.07;865479770;2.82482
2227.15;869979073;2.83279
2241.42;874567556;2.81707
2254.88;880360613;2.80217
2269.95;884935493;2.78703
2284.2;889888182;2.7727
2300.04;894634038;2.78296
2315.05;900154622;2.7933
2329.25;905045698;2.78079
2342.67;909540153;2.76896
2357.69;915129621;2.75696
2371.91;920089722;2.74563
2385.35;924831716;2.73492
2400.25;930474617;2.74699
2414.35;935429747;2.73549
2427.67;940107403;2.7246
2442.73;944547910;2.73918
2456.99;949902425;2.72942
2472.55;955093395;2.74096
2487.31;959611997;2.75245
2501.27;964870996;2.74128
2514.47;969609402;2.73065
2529.45;975111231;2.74578
2543.64;980395718;2.73703
2557.06;985220171;2.72873
2571.91;989555972;2.71878
2585.97;994474466;2.70933
2599.28;1000379414;2.70033
2614.14;1004873517;2.71484
2628.23;1009982011;2.70545
2641.56;1014666710;2.6965
2656.52;1020193849;2.71172
2670.69;1024986124;2.70456
2686.35;1029531159;2.7201
2701.2;1035085030;2.73541
2715.28;1040380400;2.72558
2728.6;1045536879;2.71617
2743.55;1050155838;2.71004
2757.72;1055367014;2.70423
2771.14;1060074640;2.69873
2786.15;1064578627;2.7168
2800.38;1069477294;2.70931
2813.85;1075215733;2.70215
2828.85;1079747777;2.71793
2843.08;1085261578;2.7117
2856.55;1089900050;2.70577
2871.55;1095278696;2.72273
2885.77;1100263504;2.71632
2899.25;1105099593;2.71019
2914.18;1109970293;2.72625
2928.34;1115408376;2.71828
2941.76;1120089219;2.71062
2956.87;1124802083;2.7052
2971.21;1130017865;2.70004
2984.79;1134808167;2.69512
2999.84;1140476945;2.71235
3014.11;1145130344;2.7056
3027.64;1150003027;2.69914
3042.8;1155379655;2.71664
3057.2;1159379929;2.71051
3070.84;1165176884;2.70464
3085.95;1169589099;2.72095
3100.28;1174986309;2.71433
3113.87;1179556913;2.70795
3128.96;1185081343;2.72407
3143.27;1190397243;2.71725
3156.84;1194835856;2.71068
3171.94;1200450043;2.72697
3186.28;1204939780;2.721
3199.86;1209663965;2.71525
3214.91;1215355452;2.73156
3229.19;1219994049;2.72326
3242.72;1225359007;2.71523
3257.85;1230013297;2.7306
3272.21;1234470916;2.72373
3285.82;1239788829;2.71708
3300.95;1245301713;2.73317
3315.32;1249437642;2.7252
3328.94;1255068943;2.71748
3344.12;1259620670;2.7328
3358.52;1265250393;2.72581
3374.35;1269722753;2.74073
3389.4;1275320537;2.7553
3403.68;1279987087;2.74728
3417.22;1285445213;2.73949
3432.29;1289830638;2.75454
3446.6;1294869693;2.74662
3460.17;1299594760;2.73892
3475.19;1305150387;2.75332
3489.46;1309744081;2.74553
3502.98;1315105761;2.73797
3518.08;1319588863;2.75359
3532.41;1325012984;2.74568
3546;1329977675;2.73801
3561.01;1334616847;2.752
3575.26;1339665099;2.74315
3588.77;1344900801;2.73455
3603.72;1350434157;2.74785
3617.92;1354454613;2.73805
3631.37;1360163650;2.72853
3646.27;1365645150;2.71916
3660.4;1370852866;2.71006
3673.8;1374933849;2.70124
3688.77;1380543702;2.71557
3702.98;1385241248;2.70696
3716.46;1389674147;2.69861
3731.39;1395105166;2.7123
3745.57;1399384935;2.70381
3759.01;1405253538;2.69557
3774.39;1409841257;2.7141
3789;1415407128;2.70923
3802.86;1419448659;2.70452
3817.89;1424894151;2.71888
3832.16;1429798230;2.71146
3845.69;1435477925;2.70425
3860.53;1440392383;2.71761
3874.62;1444935972;2.709
3887.98;1450191863;2.70064
3902.78;1454497088;2.71408
3916.83;1459671796;2.70564
3932.24;1465119270;2.71836
3946.87;1470429173;2.73077
3960.77;1475441495;2.71998
3973.93;1479963086;2.70949
3988.68;1485292278;2.72227
4002.69;1489625616;2.71296
4015.96;1494973820;2.7039
4028.52;1500295573;2.69511
4040.39;1505299038;2.66005
4055.9;1509666316;2.66902
4070.64;1515047335;2.6778
4084.64;1519556457;2.66748
4100.03;1525050153;2.67871
4114.65;1529480294;2.68968
4128.53;1534709124;2.68005
4143.91;1540087830;2.69289
4158.52;1544591043;2.70542
4172.39;1549756095;2.6961
4185.53;1555411025;2.68703
4200.15;1559929453;2.67917
4214.03;1565288492;2.67153
4227.18;1570122472;2.66413
4241.76;1574599571;2.67836
4255.61;1580076165;2.66927
4268.73;1584824604;2.66044
4283.25;1590393036;2.67288
4297.02;1594440618;2.68503
4310.08;1600170742;2.69688
4324.73;1604951797;2.68833
4338.64;1609921129;2.68001
4351.83;1614708297;2.67193
4366.22;1620228055;2.66196
4379.88;1624513038;2.65228
4392.82;1630162026;2.64288
4407.28;1634659846;2.63375
4421.01;1639453090;2.6249
4434.02;1644638785;2.61634
4448.54;1650236168;2.63013
4462.33;1655247524;2.62176
4475.39;1659955593;2.61367
4489.82;1665423832;2.6264
4503.51;1669894009;2.61745
4518.61;1675403295;2.63003
4532.96;1680109150;2.64233
4546.58;1684476657;2.63335
4559.48;1690319330;2.62464
4573.91;1695087783;2.63833
4587.6;1699677025;2.62875
4600.58;1704677104;2.61945
4614.79;1710113344;2.62967
4628.27;1715351755;2.62056
4641.05;1720220398;2.61172
4655.4;1724740485;2.6258
4669.02;1730844977;2.61737
4681.93;1734676449;2.6092
4696.19;1740152096;2.6217
4709.72;1744744662;2.61185
4724.67;1750222901;2.62345
4738.87;1754981973;2.63479
4752.34;1761197796;2.62531
4765.11;1765029924;2.61609
4779.16;1769687460;2.60556
4792.49;1775128655;2.59535
4805.12;1780044406;2.58544
4819.37;1784716655;2.59884
4832.89;1789941864;2.58981
4847.61;1795556873;2.6001
4861.6;1800240203;2.61017
4874.86;1804380463;2.60076
4887.43;1809991919;2.59164
4901.53;1814654284;2.60489
4914.91;1819492410;2.59519
4929.58;1824963755;2.60562
4943.51;1830536738;2.61582
4956.72;1834445768;2.60535
4969.24;1840184791;2.59518
4983.3;1845065818;2.58632
4996.64;1849630312;2.57772
5009.28;1854704104;2.56939
5023.24;1860418326;2.58132
5036.49;1864465178;2.57329
5049.04;1870323227;2.56552
5062.99;1875169206;2.57868
5076.22;1880466176;2.56852
5088.75;1884983931;2.55867
5102.81;1889555907;2.55204
5116.16;1895112610;2.54563
5128.81;1899732601;2.53945
5140.78;1905088112;2.53347
5152.09;1910398297;2.50561
5162.77;1915020983;2.47854
5176.83;1920567895;2.47256
5190.19;1925114630;2.46682
5202.85;1929641293;2.46132
5214.84;1935237337;2.45607
5226.18;1940110165;2.42886
5241.03;1945046205;2.44395
5255.15;1949576299;2.45876
5268.57;1955917292;2.45328
5283.27;1960018184;2.46782
5297.25;1964562571;2.48207
5310.52;1970167994;2.47534
5325.12;1975414907;2.48905
5339;1979687469;2.50247
5352.18;1984535760;2.49362
5366.64;1989721400;2.50477
5380.37;1994933917;2.51567
5393.41;1999551761;2.52633
5407.92;2005126329;2.55831
5421.71;2010417271;2.58947
5434.8;2014559749;2.57967
5449.21;2020142616;2.59019
5462.89;2024673375;2.60043
5475.88;2029614643;2.61037
5490.09;2035275331;2.63914
5503.59;2039781543;2.62562
5516.4;2044920022;2.61242
5528.52;2049620398;2.59953
5542.11;2054996400;2.58838
5555;2060135863;2.57751
5569.25;2064589463;2.58732
5582.79;2070267917;2.57667
5595.63;2074730229;2.56629
5607.79;2079748769;2.55618
5621.3;2085194571;2.54672
5634.12;2090296849;2.53751
5646.27;2094471924;2.52857
5659.76;2099954298;2.5184
5672.56;2105176892;2.50854
5684.69;2115128719;2.49897
5698.18;2120354871;2.4898
5710.98;2126111079;2.48092
5725.02;2130664375;2.4914
5738.35;2136115552;2.48256
5753.13;2141196897;2.49538
5767.19;2145613154;2.50791
5780.54;2151175344;2.52016
5795.16;2155704659;2.53057
5809.07;2161359268;2.54073
5822.27;2165505517;2.53024
5834.79;2170535667;2.52002
5848.65;2176020029;2.53022
5861.81;2180135987;2.54018
5874.28;2185848098;2.52979
5888.07;2190404716;2.53951
5901.17;2195807366;2.54898
5913.57;2200458294;2.53813
5927.24;2205865955;2.5468
5940.22;2211018494;2.55525
5952.51;2215732295;2.54328
5964.15;2221170187;2.53162
5975.14;2225432036;2.50121
5985.51;2231138424;2.47161
5999.2;2235518018;2.46069
6012.2;2240299756;2.45011
6024.52;2246225720;2.43987
6038.12;2251013012;2.42959
6051.04;2255536021;2.41966
6063.28;2260589940;2.41005
6076.99;2266284877;2.42202
6090.01;2270716028;2.41363
6104.17;2276183721;2.42361
6117.62;2280695959;2.4334
6130.39;2285696995;2.42318
6142.49;2290469567;2.41329
6156.01;2295294064;2.42431
6168.83;2300526721;2.41588
6180.99;2306006519;2.40772
6192.49;2310475983;2.39984
6203.37;2315708999;2.39224
6213.63;2320752446;2.38491
6227.15;2325475667;2.41642
6239.99;2330844379;2.40792
6252.17;2335572143;2.3997
6265.56;2340424829;2.41038
6278.27;2345240267;2.40153
6290.33;2350546303;2.39296
6303.78;2356027198;2.40509
6316.56;2361221559;2.39571
6328.67;2365227550;2.38664
6342.05;2370717616;2.37885
6354.75;2375736529;2.37133
6366.8;2380278347;2.36408
6380.2;2385675270;2.37703
6392.92;2391172859;2.36912
6404.98;2395379226;2.36148
6418.29;2400977760;2.37301
6430.92;2405257279;2.3843
6444.76;2410739543;2.41391
6457.91;2416170585;2.44278
6470.38;2421132323;2.43235
6482.21;2425990123;2.42219
6495.39;2430624756;2.4322
6507.89;2435815002;2.42334
6519.75;2440717271;2.41472
6532.79;2445298202;2.42457
6545.16;2450719393;2.41378
6556.89;2455629184;2.4033
6570.03;2461130035;2.41356
6582.5;2465362068;2.40451
6594.33;2470866298;2.39572
6607.43;2475466743;2.40634
6619.87;2481257049;2.39678
6633.48;2486215807;2.40567
6646.41;2490762513;2.41436
6658.68;2495895081;2.40394
6670.3;2501009884;2.39381
6683.27;2505430863;2.38506
6695.56;2510441486;2.37657
6707.22;2516258080;2.36835
6720.16;2520718341;2.37951
6732.44;2526628262;2.37054
6745.97;2530167984;2.38075
6758.82;2535555964;2.39074
6771.01;2540580393;2.38226
6782.57;2545509941;2.37404
6795.35;2550967528;2.38459
6807.47;2555426590;2.37444
6818.96;2561125629;2.36459
6831.71;2565657859;2.37385
6843.81;2570562596;2.36374
6855.27;2575204182;2.35394
6867.92;2580654957;2.34436
6879.92;2586317353;2.33507
6893.16;2590159871;2.3448
6905.74;2596205895;2.35431
6917.66;2600323931;2.34399
6928.96;2606093333;2.33397
6941.56;2610531348;2.34342
6953.51;2616336189;2.33352
6966.76;2620688420;2.34319
6979.34;2626083922;2.33375
6991.28;2631223719;2.3246
7002.58;2635299737;2.31574
7015.22;2640863933;2.32654
7027.2;2645899955;2.31858
7038.56;2650885862;2.31088
7050.97;2655547207;2.32008
7062.74;2660625385;2.31028
7073.88;2666132098;2.30077
7086.45;2670564581;2.31188
7098.38;2675795790;2.30464
7109.68;2680523788;2.29764
7122.13;2685951710;2.28973
7133.94;2690977155;2.28208
7145.13;2695820132;2.27469
7157.61;2700208523;2.28648
7169.44;2705469275;2.27887
7180.66;2710673176;2.27152
7193.09;2716177362;2.26335
7204.89;2721298181;2.25546
7216.06;2725486000;2.24784
7228.46;2731101339;2.25874
7240.22;2735248729;2.25004
7251.37;2740959825;2.24164
7263.69;2745421901;2.25136
7275.39;2750523907;2.24425
7286.47;2756081376;2.23739
7298.87;2760542172;2.24992
7310.64;2766201000;2.24188
7321.79;2770838008;2.23411
7334.1;2775201224;2.24422
7345.78;2780285601;2.23655
7356.85;2785536022;2.22915
7369.17;2790936635;2.24038
7380.85;2795313331;2.23246
7391.92;2801143935;2.2248
7404.22;2805520014;2.23562
7415.89;2810546111;2.22802
7426.95;2815459907;2.22067
7439.18;2821137209;2.2312
7450.78;2825577157;2.22327
7461.78;2830289212;2.2156
7474.01;2835702123;2.2265
7485.62;2840847330;2.21933
7496.63;2845697169;2.2124
7508.92;2851157733;2.22453
7520.6;2856440564;2.21726
7531.66;2861034058;2.21022
7543.93;2865467630;2.22141
7555.58;2871097844;2.21476
7568.32;2875738551;2.22537
7580.43;2880430290;2.23575
7591.92;2886157331;2.22751
7602.8;2891104883;2.21953
7615;2895585467;2.23078
7626.57;2900683845;2.22355
7637.54;2905328865;2.21654
7649.62;2911242842;2.22667
7661.07;2915652757;2.21895
7671.93;2920424555;2.21146
7684.1;2925822803;2.22319
7695.65;2930314773;2.21634
7706.59;2936098450;2.2097
7718.62;2940646054;2.21995
7730.04;2945799857;2.21113
7740.85;2950338653;2.20258
7753.01;2955721685;2.21354
7764.55;2960728089;2.20626
7775.5;2965434054;2.1992
7787.55;2970923398;2.19233
7798.99;2975579835;2.18568
7809.84;2981006772;2.17924
7821.98;2986033048;2.19183
7833.51;2990445910;2.18515
7844.44;2995242318;2.1787
7856.37;3000765115;2.18833
7867.7;3006300942;2.18084
7878.43;3010504415;2.17358
7890.37;3015928545;2.18449
7901.71;3020915420;2.17618
7912.46;3025744369;2.16813
7924.36;3030630797;2.17773
7935.66;3035872277;2.17044
7946.37;3040661787;2.16339
7958.32;3045343764;2.17466
7969.65;3050562484;2.16643
7980.4;3056432556;2.15846
7992.21;3061442889;2.16718
8003.42;3065295236;2.15872
8014.05;3071096919;2.15053
8025.89;3075541341;2.16055
8037.14;3080925633;2.15156
8047.8;3086195307;2.14285
8059.73;3090683348;2.15287
8071.05;3095693227;2.1468
8081.79;3101224809;2.14094
8093.53;3105679673;2.15099
8104.66;3111705634;2.1429
8115.22;3115425910;2.13506
8126.99;3121082003;2.14529
8138.15;3126117952;2.13791
8148.74;3130970926;2.13076
8160.58;3135498266;2.14206
8171.82;3140670845;2.13501
8182.47;3146070852;2.1282
8194.31;3150543434;2.13912
8205.54;3155592718;2.13334
8216.2;3160458501;2.12775
8227.89;3165937420;2.13845
8238.99;3170882794;2.13096
8249.51;3175504576;2.12371
8261.24;3180902189;2.13441
8272.37;3186114696;2.12641
8282.92;3190752411;2.11867
8294.64;3195640859;2.12845
8305.76;3201130545;2.1223
8316.3;3205108132;2.11635
8327.95;3210510556;2.12734
8339.01;3216191934;2.12027
8349.5;3220321977;2.11342
8361.19;3225790570;2.12453
8372.3;3230984161;2.11717
8382.82;3235801196;2.11004
8399.58;3240384372;2.17115
8399.58;3245458983;2.05277
8410.36;3251063335;2.04819
8416.1;3255434308;1.9991
8419.84;3260829616;1.91957
8422.61;3266137067;1.83623
8424.83;3270466941;1.75322
8426.69;3275736194;1.65461
8428.3;3280861967;1.55937
8440.79;3285324912;1.57877
8452.06;3290594295;1.57429
8467.58;3296041948;1.61826
8481.48;3300530329;1.6519
8493.81;3306126777;1.65864
8504.62;3311006243;1.65614
8518.88;3315904151;1.69384
8531.32;3320679976;1.70132
8542.11;3325936522;1.69816
8556.7;3330473053;1.73878
8569.39;3335474963;1.69802
8580.38;3341192754;1.80804
8594.8;3345617830;1.84437
8607.37;3350702742;1.91268
8618.33;3355671599;1.98485
8632.11;3361139574;2.09503
8644.21;3365499539;2.19384
8658.5;3371112839;2.31809
8671.12;3375823584;2.42822
8682.27;3380351630;2.41479
8692.12;3386169259;2.40065
8704.88;3390739743;2.37302
8716.25;3396338699;2.34763
8730.12;3400784574;2.36311
8742.57;3406156232;2.37946
8753.74;3410400638;2.34864
8763.78;3416100089;2.32454
8776.07;3420494442;2.33964
8787.19;3425514502;2.3049
8797.24;3431204419;2.27852
8809.19;3435823730;2.28805
8820.06;3440133057;2.25261
8832.86;3445635691;2.25495
8844.57;3451118811;2.26239
8855.26;3455611481;2.23153
8867.77;3461109820;2.23567
8879.26;3465647866;2.20761
8889.8;3471123692;2.18686
8902.04;3475557042;2.1977
8913.31;3480997360;2.21195
8923.71;3485130820;2.18836
8935.79;3490607363;2.19545
8946.97;3496061261;2.16845
8957.31;3500578803;2.14741
8968.97;3505941595;2.15225
8979.79;3510531511;2.1601
8989.83;3516078805;2.13757
9001.73;3520635137;2.14547
9012.82;3526063110;2.15584
9023.15;3530240066;2.1396
9032.77;3535999893;2.1271
9043.56;3540491941;2.10695
9053.63;3545496198;2.09069
9063.04;3550311416;2.07777
9074.07;3555986803;2.06304
9084.41;3560799499;2.05153
9094.08;3565851972;2.04277
9104.89;3570221543;2.02857
9115.03;3575294828;2.0172
9124.54;3581065194;2.00827
9135.33;3585529531;1.99539
9145.46;3591155604;1.98499
9154.98;3596086785;1.97674
9165.86;3600626991;1.9689
9176.09;3605932242;1.96304
9185.71;3610629288;1.95885
9194.76;3616184389;1.93027
9203.25;3620613326;1.90432
9214.87;3626087336;1.91723
9225.85;3630699486;1.93081
9236.21;3636155609;1.92648
9247.54;3640723005;1.93902
9258.24;3646168774;1.95208
9268.36;3650244726;1.94282
9277.9;3655738362;1.9349
9288.64;3661191893;1.94561
9298.79;3665325245;1.93902
9308.38;3671013937;1.93351
9319.14;3675831874;1.94604
9329.32;3680540023;1.93992
9340.57;3686140505;1.95111
9351.24;3690617860;1.96257
9361.33;3695429463;1.9548
9372.66;3701041851;1.96577
9383.41;3705609438;1.97694
9393.58;3710537704;1.98822
9404.92;3716057726;2.01669
9415.68;3720453358;2.00806
9425.87;3725468580;2.00023
9435.51;3730482303;1.99309
9446.09;3736036259;1.98556
9456.11;3740466325;1.9787
9465.6;3745300221;1.97241
9476.15;3750831389;1.98256
9486.16;3756209349;1.97521
9497.29;3760816734;1.98504
9507.87;3765225528;1.99485
9517.89;3770384713;1.98748
9528.81;3776002790;1.9949
9539.17;3780439816;1.98596
9548.99;3785396756;1.97752
9558.29;3790355408;1.96952
9568.74;3796224813;1.96078
9578.66;3801235882;1.95251
9589.59;3805895445;1.9601
9599.97;3810564062;1.95049
9609.81;3815276723;1.94134
9619.13;3821002913;1.93259
9629.34;3825418618;1.93832
9639.03;3830637044;1.92942
9648.2;3835734288;1.92089
9658.44;3840410037;1.92848
9668.16;3845862208;1.92003
9678.95;3850474669;1.92791
9689.2;3855914720;1.91903
9698.92;3860102026;1.91051
9709.57;3865572580;1.91683
9719.68;3871057272;1.90875
9729.27;3875241292;1.90098
9740.01;3880755615;1.91021
9750.21;3885249938;1.91928
9759.89;3890341362;1.91146
9769.05;3895693496;1.90391
9779.15;3901089758;1.8956
9788.73;3905479229;1.88759
9799.22;3911038517;1.89412
9809.18;3915654066;1.90054
9818.62;3921119630;1.89274
9829.17;3925649758;1.90144
9839.2;3931214622;1.90997
9848.7;3935889706;1.90254
9859.18;3940357210;1.91024
9869.13;3945843706;1.90179
9878.56;3950302261;1.89361
9889.03;3955933477;1.90119
9898.98;3960486007;1.8941
9908.4;3965940729;1.88724
9917.33;3970101445;1.88059
9927.28;3975447542;1.87273
9936.72;3980415347;1.86511
9945.66;3986260793;1.85775
9955.53;3991091756;1.86486
9964.89;3995906684;1.85742
9975.32;4000474233;1.86594
9985.22;4005865434;1.86003
9994.61;4010594793;1.85434
10005;4015258898;1.8635
10014.8;4020735583;1.85624
10024.1;4026195768;1.84921
10034.4;4030673429;1.85654
10044.1;4035422086;1.84883
10053.3;4040506884;1.84138
10062;4045399608;1.83417
10071.7;4050826518;1.82636
10080.9;4055771018;1.81882
10089.6;4060640326;1.81153
10099.4;4066071799;1.82117
10108.8;4071314834;1.81535
10119.1;4076134006;1.82369
10128.8;4080624862;1.83188
10138.1;4085950194;1.82567
10148.3;4090436233;1.83423
10158;4096145601;1.82689
10167.2;4100553821;1.81978
10175.9;4105323433;1.81291
10185.6;4110743443;1.80674
10194.9;4115475829;1.80078
10203.6;4120369563;1.79504
10213.2;4125841528;1.78823
10222.2;4130372793;1.78166
10230.8;4135752577;1.77532
10238.9;4141082256;1.76922
10246.5;4146004328;1.74869
10256.8;4150522615;1.7591
10266.5;4155929937;1.76932
10275.7;4160397242;1.76267
10285.9;4166010163;1.77036
10295.5;4170482011;1.76397
10304.6;4175528522;1.75781
10313.3;4180944998;1.75187
10321.5;4185442613;1.7316
10329.2;4190561198;1.71194
10336.5;4195417862;1.69287
10346.4;4200967114;1.70449
10355.7;4205923234;1.70078
10364.6;4211063751;1.69725
10374.5;4215577725;1.70867
10383.9;4221095983;1.70704
10394.1;4225599526;1.71873
10403.8;4231198354;1.73019
10413;4235116362;1.74141
10423.2;4240596837;1.76684
10432.9;4246183767;1.76132
10442.1;4250464458;1.75597
10450.8;4255594688;1.75081
10460.5;4261188890;1.74608
10469.6;4265417786;1.74153
10478.3;4270791841;1.73713
10486.6;4276233793;1.7329
10494.4;4280425314;1.72883
10501.7;4285444823;1.72491
10511.4;4290891075;1.74884
10520.6;4295257682;1.74209
10530.7;4300733427;1.74942
10540.3;4306303781;1.75661
10549.4;4310890755;1.74886
10559.4;4315322239;1.75549
10569;4320719270;1.7488
10578;4325565015;1.7423
10588.1;4331258957;1.75056
10597.6;4335994173;1.74419
10606.7;4340424853;1.73802
10615.3;4346148853;1.73204
10624.8;4350564345;1.73971
10633.7;4355454437;1.73284
10642.3;4360830506;1.72618
10651.7;4365219289;1.73403
10660.7;4370525264;1.74171
10670.7;4375971998;1.76358
10680.2;4380448643;1.78489
10689.2;4385771141;1.77795
10699;4391245724;1.78485
10708.4;4396029549;1.77768
10717.3;4400355864;1.7707
10725.8;4405932287;1.7639
10733.7;4410644418;1.74313
10741.3;4415535829;1.72291
10751.1;4420997935;1.73106
10760.5;4425822958;1.72446
10769.4;4432567820;1.71807
10779.2;4436137073;1.72548
10788.6;4440673369;1.73273
10797.4;4445516559;1.72635
10807.2;4451108908;1.73413
10816.4;4458088010;1.74173
10825.2;4460436515;1.73485
10834.9;4465842598;1.74181
10844.1;4470192710;1.73424
10852.9;4476041210;1.72688
10862.4;4480812514;1.73211
10871.4;4485401034;1.72358
10880;4490945278;1.7153
10889.7;4495431650;1.72342
10898.9;4500986548;1.73137
10907.6;4505392831;1.73912
10915.9;4510379491;1.74669
10925;4516009359;1.73879
10933.6;4520412698;1.7311
10941.8;4525263184;1.72363
10950.9;4530702842;1.71606
10959.4;4536141047;1.7087
10968.9;4540617368;1.71512
10977.9;4546171928;1.70743
10986.4;4551085943;1.69997
10995.9;4556286749;1.70704
11005;4560921668;1.70033
11013.5;4565357433;1.69383
11021.6;4570268535;1.68754
11030.5;4575901400;1.68148
11039;4580596939;1.67562
11047;4585893304;1.66996
11055.9;4590469267;1.66259
11064.4;4595719303;1.65546
11072.5;4600441422;1.64856
11081.5;4605892685;1.65552
11090;4610459756;1.64983
11099.3;4616069003;1.65701
11108.2;4620439272;1.66405
11116.6;4626029200;1.65768
11125.9;4630673593;1.66478
11134.7;4636155657;1.65819
11143.1;4640342016;1.65181
11152.3;4645356032;1.65867
11161;4650703257;1.65108
11169.3;4655507500;1.64374
11178.4;4660963676;1.64894
11187;4665237472;1.65405
11195.2;4670119623;1.64667
11204.3;4675389170;1.65334
11212.9;4680911432;1.65987
11221.1;4686133160;1.65201
11230.1;4690408387;1.65672
11238.6;4695751719;1.66135
11246.7;4700697645;1.65226
11255.7;4706045147;1.65734
11264.3;4710637535;1.64968
11272.4;4715179468;1.64224
11281.5;4720687895;1.64857
11290.1;4726052247;1.64151
11298.2;4730257991;1.63466
11307.1;4736091322;1.64036
11315.6;4740360681;1.63293
11323.6;4745435635;1.62573
11332.4;4750714042;1.63087
11340.8;4756084047;1.6236
11348.7;4760961885;1.61656
11357.6;4765688083;1.62423
11366.1;4771031453;1.61791
11374.1;4775103153;1.6118
11383;4780710082;1.61891
11391.5;4786178908;1.61356
11399.5;4790785008;1.60838
11408.3;4796331493;1.61574
11416.6;4801083060;1.60904
11424.6;4806234540;1.60255
11432.1;4810777024;1.59628
11439.1;4816203452;1.57667
11445.8;4820477140;1.55764
11452.1;4825834370;1.53916
11458;4831240479;1.5089
11463.5;4835571696;1.47952
11472.5;4841038987;1.48878
11481;4845607063;1.4858
11489.1;4851072756;1.48301
11497.9;4855568483;1.4924
11506.3;4861076028;1.48717
11514.3;4866044662;1.48218
11521.9;4870735152;1.47741
11530.4;4875265170;1.4736
11538.5;4880461057;1.46998
11546.1;4885389628;1.46656
11554.6;4890853551;1.46286
11562.6;4895149833;1.45936
11571.5;4900786831;1.46894
11579.9;4906372247;1.47838
11587.9;4911076475;1.48765
11596.7;4915488707;1.50895
11605.1;4920805359;1.52976
11613;4926112375;1.55007
11621.8;4930610689;1.58282
11630.2;4936046069;1.57696
11638.1;4940346080;1.57125
11645.6;4946108427;1.5657
11653.9;4950543836;1.56002
11661.8;4955270860;1.55452
11670.4;4960248199;1.56059
11678.5;4965648566;1.56652
11686.2;4970366180;1.55857
11693.5;4975876935;1.55083
11700.5;4980410834;1.54331
11707;4986140535;1.52412
11715.8;4990801971;1.53186
11724.1;4995279997;1.52655
11732;5000560938;1.5214
11740.7;5006225370;1.52785
11748.9;5011076678;1.52197
11756.7;5015941810;1.51628
11765.2;5020379699;1.52221
11773.3;5025742030;1.5151
11781;5031007193;1.50821
11789.6;5035501700;1.51472
11797.8;5041197180;1.52111
11805.5;5045246805;1.51564
11814;5050893846;1.52213
11822.1;5055522571;1.51706
11829.7;5060191328;1.51215
11838.2;5065730331;1.5197
11846.3;5070344545;1.52708
11853.9;5075774969;1.5343
11861.1;5081166592;1.54134
11867.9;5085566270;1.52181
11874.4;5090182274;1.5028
11882.9;5095635717;1.50844
11890.9;5101127772;1.50253
11898.6;5105641388;1.49682
11905.8;5110870499;1.49129
11913.8;5115421267;1.48614
11921.4;5120302039;1.48117
11928.6;5125918110;1.47637
11936.7;5130376935;1.47064
11944.3;5135989072;1.4651
11952.7;5140435433;1.47217
11960.7;5145845139;1.46733
11968.3;5151044010;1.46265
11976.7;5155374930;1.46969
11984.6;5160823560;1.46428
11992.2;5165472664;1.45906
12000.4;5170951328;1.46556
12008.3;5175334881;1.47194
12015.8;5180854471;1.47819
12024;5185362249;1.49574
12031.8;5190932879;1.48873
12039.1;5195612790;1.48193
12047.3;5200442998;1.48681
12055;5205295106;1.4916
12062.3;5210720128;1.48464
12069.2;5215643963;1.47788
12073.8;5221197664;1.45215
12073.8;5225395905;1.37198
12073.8;5230206311;1.29594
12079.5;5235668370;1.26791
12083.1;5240352679;1.22424
12089.7;5245843125;1.2136
12094.9;5250309501;1.1823
12099.3;5255961009;1.14704
12107.1;5260671017;1.14988
12114.1;5266270572;1.13637
12120.2;5270364678;1.1193
12129.5;5275915628;1.13719
12137.7;5280294958;1.13732
12144.9;5285211705;1.13165
12155.1;5291082957;1.16
12164.1;5295511604;1.16809
12171.8;5300817033;1.16853
12178.5;5305770944;1.1623
12187.8;5310621032;1.18611
12195.9;5315513533;1.22081
12205.9;5320918825;1.32062
12214.6;5325385409;1.40754
12222.1;5330790321;1.42664
12231.6;5335192843;1.48421
12239.8;5340584270;1.50113
12247;5346352164;1.52088
12256.1;5350755581;1.5679
12264.2;5356274201;1.57015
12271.3;5360644580;1.57172
12280.2;5366104130;1.59916
12288.1;5370567617;1.58583
12295.1;5376208941;1.57408
12303.7;5380804313;1.58811
12311.5;5385356324;1.56321
12318.4;5390328851;1.543
12327;5395843758;1.55152
12334.8;5400323078;1.56233
12341.8;5405291460;1.53948
12348.1;5410427923;1.52215
12355.8;5415903793;1.49859
12362.7;5421142328;1.48096
12370.9;5425536996;1.48783
12378.5;5430922565;1.46896
12385.3;5436107892;1.45533
12393.5;5440604220;1.46514
12401;5446160386;1.44912
12407.9;5450874302;1.43771
12415.8;5455624533;1.44518
12423;5460438767;1.42837
12429.6;5465651959;1.41577
12437.6;5470306447;1.42515
12445;5475749739;1.41275
12451.8;5480769365;1.40383
12458.2;5485551895;1.39783
12465.7;5490969790;1.38678
12472.7;5495458875;1.37882
12480.6;5500945150;1.38805
12488;5505423283;1.39863
12494.9;5510819936;1.39128
12501.3;5515622258;1.38618
12508.8;5521009085;1.37872
12515.8;5525143127;1.37349
12522.3;5530672085;1.37016
12529.7;5536175561;1.36228
12536.7;5540831023;1.35643
12543.2;5545724983;1.35229
12550.5;5550384054;1.34766
12557.4;5556638802;1.34463
12565.1;5560792263;1.35449
12572.3;5566140127;1.34654
12579;5570405898;1.34018
12595.1;5575463187;1.43228
12595.1;5580831337;1.36902
12595.1;5585291144;1.29387
12599.8;5590170377;1.27163
12602.9;5595662490;1.223
12605.2;5601153117;1.17169
12610.9;5605638474;1.1601
12615.7;5610517030;1.14435
12620;5615555299;1.11158
12627.1;5621004420;1.11316
12633.5;5625476490;1.11177
12639.2;5630441109;1.09467
12644.2;5635229650;1.07547
12678.2;5640667933;1.35025
12678.2;5645914549;1.27649
12684.4;5650390441;1.2694
12687.7;5655798144;1.22607
12689.8;5660273913;1.17579
12691.4;5665949563;1.12425
12696.3;5670435504;1.0129
12700.5;5675903292;1.05429
12704.1;5680614250;1.09034
12710.4;5686216942;1.10629
12716.1;5691290888;1.13228
12724.7;5696260730;1.1953
12732.3;5700849527;1.2144
12739.1;5705521760;1.23343
12748.4;5710395836;1.2845
12756.6;5715922870;1.29471
12763.7;5720771191;1.30192
12769.9;5725280653;1.3066
12778;5730708768;1.33806
12785.1;5735949537;1.069
12794;5741218709;1.15799
12801.7;5745612005;1.17345
12808.5;5750610901;1.20777
12814.3;5755323242;1.24475
12822.4;5760836386;1.30918
12829.4;5765327252;1.33064
12838.2;5770726936;1.37733
12846;5776158709;1.4191
12852.9;5780339141;1.42435
12859;5786068189;1.42837
12866.4;5790595318;1.41749
12873.1;5796016449;1.40768
12879;5800622028;1.39962
12886.5;5806141776;1.38093
12893.2;5810424166;1.36609
12899.2;5815971759;1.3551
12906.3;5820489081;1.36512
12912.8;5825401986;1.34826
12918.6;5830753327;1.33601
12923.9;5836114315;1.29974
12928.7;5841205961;1.26993
12936.7;5845365784;1.2823
12944;5851016350;1.29672
12950.6;5855460256;1.28314
12956.8;5860313538;1.27376
12964.1;5865759547;1.25898
12970.8;5871066836;1.24856
12978.5;5876175449;1.25592
12985.5;5880808348;1.26535
12992;5885103636;1.25535
12999.4;5890456575;1.26299
13006.3;5895888168;1.27238
13012.7;5901160895;1.26154
13020;5905770572;1.26858
13026.9;5910434421;1.2772
13033.3;5915723992;1.26964
13040.6;5920449185;1.27775
13047.3;5925932417;1.2871
13053.7;5930536799;1.2974
13070.9;5936076440;1.42242
13070.9;5940483600;1.34259
13070.9;5946162129;1.26961
13089.2;5950796860;1.38554
13089.2;5956271820;1.32443
13089.2;5960384035;1.25103
13089.2;5965258042;1.18355
13093.3;5970776801;1.14839
13096.3;5975808738;1.10819
13098.7;5980510266;1.06739
13104.1;5985925763;1.04751
13108.9;5990627207;1.02632
13145.2;5995439332;1.32578
13145.2;6001054883;1.25181
13145.2;6005313747;1.18307
13145.2;6010384810;1.11921
13148.8;6016011176;1.08266
13151.5;6020468306;1.04144
13153.6;6026084128;0.99955
13159;6030464069;0.881176
13163.7;6035430199;0.928243
13167.9;6041041461;0.969978
13174.3;6045565592;0.850915
13180;6050943704;0.908073
13188.1;6055434451;0.988947
13195.2;6061085087;1.06067
13201.5;6065289279;1.08254
13207;6071136715;1.10714
13214.9;6076069539;1.16167
13221.7;6080419173;1.17557
13227.6;6085359383;1.18718
13235.1;6091025418;0.898908
13241.6;6095467788;0.96398
13250;6101099040;1.04804
13257.4;6105465304;1.12148
13263.8;6110972786;1.14946
13269.4;6116120144;1.17887
13276.6;6120655448;1.22979
13282.9;6126068399;1.23934
13290.5;6130478101;1.26822
13297.2;6135932764;1.2937
13303.2;6140265345;1.28924
13310.9;6146128806;1.30934
13317.8;6150867415;1.29741
13324;6155428817;1.28727
13329.5;6160540552;1.27936
13336.3;6166326934;1.29268
13342.4;6170160400;1.27528
13359.8;6175631320;1.38058
13359.8;6181184039;1.32134
13359.8;6186451503;1.24643
13364.7;6190857730;1.23065
13367.9;6195251497;1.17853
13370.2;6200828100;1.1286
13375.3;6206222448;1.11566
13379.7;6210921970;1.10298
13383.4;6215155295;1.0685
13389.7;6220337505;1.06737
13395.2;6225651033;1.04702
13400.1;6231118068;1.02915
13407.2;6235721228;1.03976
13413.4;6240284874;1.02444
13418.8;6245731692;1.00963
13426.2;6250545290;1.02189
13432.6;6256341597;1.03123
13438.2;6260722101;1.01893
13443;6265686813;1.00569
13449.8;6270257292;0.900147
13455.7;6275964643;0.959254
13481.6;6280796853;1.21875
13481.6;6285184430;1.16936
13481.6;6290593274;1.13736
13481.6;6296212508;1.11381
13502.1;6300737281;1.26717
13502.1;6305716771;1.22401
13506.7;6310716837;1.23249
13509.1;6316184981;1.1948
13510.7;6320350475;1.15522
13515.3;6325950208;1.15161
13519;6330625711;1.11803
13522;6335646069;1.08693
13527.3;6340335575;1.08551
13532;6346028806;1.05846
13536.2;6350340026;1.03563
13539.8;6355476978;1.01657
13545.9;6361249311;1.02963
13551.3;6365260065;1.0155
13558.4;6371173101;1.0272
13564.6;6375598782;0.829848
13570;6381119616;0.883817
13577.6;6385519491;0.959629
13584.2;6390863228;1.02569
13589.9;6395472092;0.878631
13594.9;6400241709;0.928092
13615.8;6405930457;1.09109
13615.7;6410455413;1.06645
13615.7;6415731559;1.0504
13620.4;6421255816;1.05093
13623.4;6425570369;1.04434
13625.6;6430400712;1.03558
13630.2;6435791176;1.02908
13634.1;6440943940;1.02136
13637.5;6445984662;1.01383
13643.1;6450464074;1.03325
13648.1;6455703159;1.02229
13652.6;6460898750;1.01278
13659.1;6465344893;1.00706
13664.8;6470904218;1.0025
13669.9;6475179336;0.998827
13676.7;6480625086;0.990899
13682.6;6485969718;0.984052
13690.4;6490892546;1.00496
13697.2;6495305234;1.02362
13703.1;6500912132;0.873897
13710.8;6505486836;0.95025
13717.4;6511135533;1.0168
13723.2;6515752057;1.02831
13728.2;6521058490;1.04857
13734.3;6525466200;1.08699
13739.6;6530781171;1.0937
13744.2;6535445572;1.10101
13760.1;6540918319;1.22573
13760.1;6546012060;1.16963
13760.1;6550678055;1.11956
13760.1;6555368019;1.07512
13760.1;6560601001;1.0101
13766.3;6566125221;1.01424
13771.2;6570721250;1.01319
13775.3;6575585538;0.986785
13781.4;6581025625;0.988762
13786.9;6585349029;0.964866
13791.7;6590652030;0.944982
13796;6595305781;0.928484
13802;6600776384;0.912316
13807.3;6605892197;0.898752
13811.9;6611088144;0.886999
13818.5;6615570064;0.902763
13824.3;6620644892;0.899751
13831.6;6625841037;0.920251
13838;6630329446;0.937852
13843.6;6635283423;0.834618
13848.3;6641069962;0.882484
13854.9;6645486434;0.948244
13860.6;6650744137;1.00554
13867.5;6655184819;1.07384
13873.5;6660611400;1.07204
13878.7;6665416181;1.07525
13883.3;6671026891;1.07957
13889;6675643678;1.07545
13894;6680910877;1.0715
13898.5;6685372865;1.06768
13902.4;6690823100;1.06431
13905.9;6695511514;1.0388
13912.2;6700872145;1.04934
13917.9;6705326353;1.0602
13923;6710663344;1.04532
13929;6716210814;1.04698
13934.3;6720824541;1.0269
13939.1;6726015587;1.01118
13945;6730530094;1.01474
13950.4;6736111165;1.02049
13955.3;6741493507;1.00344
13959.7;6745605776;0.990453
13965.1;6750355902;0.976168
13970;6755318982;0.965732
13975.8;6760926410;0.971151
13981.1;6765300557;0.978367
13986;6770560034;0.97002
13991.6;6776023108;0.975661
13996.8;6780449456;0.982844
14001.5;6785224102;0.991212
14007;6791133017;1.01096
14012;6796022172;0.997797
14016.7;6800350152;0.987405
14022;6806082864;0.989762
14027;6810701851;0.980264
14031.6;6815525321;0.972969
14036.8;6820522623;0.977136
14041.7;6826108879;0.966948
14046.3;6830361952;0.958786
14050.5;6835799632;0.952365
14054.4;6840239129;0.947409
14058.1;6845540524;0.93001
14063.3;6851028644;0.93294
14068.2;6855556225;0.924088
14072.8;6861045663;0.916835
14077.1;6866232520;0.910949
14082;6870916314;0.904189
14086.6;6875588011;0.898743
14091;6880559335;0.894436
14097.3;6886147489;0.903777
14097.3;6890936129;0.85343
14111.4;6895526807;0.948227
14111.4;6901000883;0.894715
14111.4;6905182626;0.84503
14111.4;6910698446;0.798911
14114.3;6916140438;0.775269
14116.5;6920320317;0.747576
14120.4;6925791188;0.741579
14123.8;6931363422;0.732621
14126.7;6935680865;0.722338
14131.2;6941083068;0.730973
14135.2;6945520441;0.719086
14138.8;6950674408;0.706007
14142;6956225544;0.69173
14147.1;6960801341;0.700094
14151.6;6965260093;0.695854
14155.5;6970895681;0.68885
14161.2;6975473075;0.702098
14166.1;6981163017;0.689189
14172.2;6985775042;0.749544
14177.4;6991132694;0.660453
14182;6995385713;0.706171
14186;7000385087;0.745778
14205.3;7005813326;0.938431
14205.3;7010415217;0.909487
14209.3;7015912131;0.928313
14211.4;7020283960;0.910099
14212.8;7025337826;0.890582
14213.8;7030817186;0.871748
14216.9;7035444169;0.857384
14219.5;7040116842;0.843085
14224.1;7045705868;0.852805
14228.1;7051224333;0.861845
14231.7;7056298109;0.846776
14237.1;7060915422;0.855472
14241.9;7065330808;0.864057
14246.1;7070661271;0.849497
14251.7;7076092467;0.856085
14256.6;7080482211;0.844325
14260.8;7085480655;0.83393
14264.5;7091022730;0.824638
14269.5;7095554231;0.834743
14273.8;7100924758;0.685189
14279.2;7105467067;0.738871
14283.8;7111000811;0.745477
14287.9;7115928470;0.764681
14293.2;7120817851;0.803766
14297.8;7125297696;0.839902
14301.9;7130310485;0.849636
14305.4;7136200576;0.8591
14310.3;7140600624;0.862589
14314.7;7146124420;0.865456
14319.8;7150504410;0.88108
14324.4;7155949119;0.873367
14328.5;7160929618;0.866538
14333.7;7165382830;0.87587
14338.3;7170735327;0.865934
14342.4;7176203274;0.858281
14354.6;7180624110;0.937774
14354.6;7186079455;0.901177
14354.6;7190327355;0.851369
14354.6;7195297190;0.808214
14367.4;7200868587;0.882674
14367.4;7205411817;0.835979
14371.2;7211178685;0.833087
14373.2;7215883626;0.800152
14374.5;7220839334;0.766802
14375.5;7225232634;0.735847
14376.2;7230800920;0.708049
14376.9;7235335935;0.665556
14381.5;7240894536;0.668089
14385.6;7245423489;0.657402
14389.3;7250577597;0.648131
14392.5;7255953839;0.639888
14395.4;7260475699;0.617391
14397.9;7266147350;0.596537
14404;7271190626;0.616089
14409.4;7275639040;0.547806
14414.1;7280432467;0.594885
14419.9;7285931233;0.653017
14425;7290318726;0.703744
14429.4;7295382864;0.619548
14433.2;7301250606;0.657655
14438.1;7305754819;0.669526
14442.5;7310985798;0.692616
14446.2;7315902792;0.717106
14451.1;7320262098;0.75623
14455.4;7325304410;0.791296
14459.1;7330227496;0.822343
14463.9;7335651372;0.824523
14468.2;7340961841;0.826056
14484.5;7346031709;0.952222
14484.5;7350538391;0.919514
14484.5;7355178971;0.890659
14495.1;7360756377;0.971975
14495.1;7366315887;0.911092
14495.1;7370250159;0.857335
14498.2;7375770555;0.841106
14500.2;7380259628;0.80296
14501.7;7386166150;0.76696
14502.8;7390805596;0.734701
14517;7395327648;0.838278
14517;7400523334;0.788771
14517;7406102916;0.745634
14528.3;7410698738;0.82045
