Distance;Time;Velocity Kalman
0;533599;9.76562e-06
0;4996212;9.76562e-06
0;9664994;9.76562e-06
0;14867971;9.76562e-06
0;19218076;9.76562e-06
0;24828953;9.76562e-06
0;30114754;9.76562e-06
0;34297748;9.76562e-06
0;39958175;4.88281e-06
0;44940532;4.88281e-06
0.000488281;49081878;9.76562e-06
0.000488281;54690095;9.76562e-06
0.000488281;59875245;9.76562e-06
0.000488281;64258631;9.76562e-06
0.000488281;69701732;9.76562e-06
0.000488281;75041313;9.76562e-06
0.000488281;80051017;9.76562e-06
0.000488281;84784986;4.88281e-06
0.000488281;89122035;4.88281e-06
0.000488281;94278261;4.88281e-06
0.000488281;99608650;4.88281e-06
0.000488281;105033004;4.88281e-06
0.000488281;109965124;4.88281e-06
0.000488281;114175941;4.88281e-06
0.000488281;119512837;4.88281e-06
0.000488281;125015074;4.88281e-06
0.000976563;129691633;9.76562e-06
0.000976563;134223257;9.76562e-06
0.000976563;139562025;9.76562e-06
0.000976563;144128338;4.88281e-06
0.000976563;149757943;4.88281e-06
0.000976563;154173981;4.88281e-06
0.000976563;159656296;4.88281e-06
0.000976563;164187179;4.88281e-06
0.000976563;169596828;4.88281e-06
0.000976563;174928843;4.88281e-06
0.000976563;179100089;4.88281e-06
0.000976563;184647477;4.88281e-06
0.000976563;189152775;4.88281e-06
0.000976563;194468867;4.88281e-06
0.000976563;199972469;4.88281e-06
0.000976563;204445466;4.88281e-06
0.000976563;209414796;4.88281e-06
0.000976563;214945560;4.88281e-06
0.000976563;219296231;4.88281e-06
0.000976563;224768066;0
0.000976563;229135915;0
85.9381;234526393;0.859377
85.9381;239908764;0.859377
85.9381;244305794;0.859377
106.928;249788260;1.06927
120.526;254158848;1.20525
130.538;259754887;1.30537
138.555;264513106;1.38555
158.772;269472297;1.58772
176.429;274987931;1.76428
192.054;279296744;1.92054
218.403;284739864;2.18402
241.958;289120403;2.41958
262.819;294835839;2.62819
293.063;299231824;2.93063
319.704;304713993;3.19703
342.939;309272462;3.42939
363.035;314981900;3.63035
391.336;319343173;3.91336
415.917;324735862;4.15917
437.17;329136372;3.5128
465.514;334507948;3.79625
490.183;339832398;4.04295
511.612;344788241;4.0474
539.208;349796881;4.1874
563.368;354547990;4.32889
584.51;359685912;4.46015
603.005;364106300;4.4429
627.026;369852589;4.50651
648.238;374566432;4.56235
666.977;379238159;4.48614
690.61;385055572;4.48682
711.657;389445015;4.48861
730.411;394248779;4.37361
753.692;399668392;4.33994
774.587;404174485;4.31649
793.351;409121768;4.30316
816.324;414522519;4.24989
837.087;419847775;4.21174
855.861;424664497;4.18702
872.847;430047911;4.07351
893.821;434618269;4.03667
912.913;439951358;4.01339
930.296;444157260;3.91137
951.397;449800974;3.88091
970.713;454121020;3.86278
988.399;459571673;3.85482
1009.57;464935201;3.82641
1029.04;469299204;3.80913
1046.96;474670333;3.80101
1063.45;479771152;3.7296
1083.25;484164835;3.71725
1101.56;489477085;3.71282
1118.48;494405659;3.6492
1138.53;499783705;3.64077
1157.13;504184993;3.63917
1174.38;509793394;3.58199
1190.39;514434017;3.53443
1209.4;519775770;3.53675
1227.09;524264966;3.54383
1243.56;529809675;3.49875
1262.88;534129433;3.50103
1280.92;539419202;3.50759
1297.76;545136450;3.46496
1317.32;549557068;3.46741
1335.64;554874491;3.47369
1352.78;559024037;3.43338
1372.53;564357244;3.43616
1391.07;569670081;3.44233
1408.45;574116859;3.4513
1424.75;579738596;3.41618
1443.59;584323781;3.4215
1461.29;589950528;3.42937
1477.93;594987303;3.39517
1497.01;599362730;3.40001
1514.99;604853020;3.40715
1531.9;610003093;3.41618
1551.19;614357166;3.41902
1569.38;619666476;3.424
1586.53;625152943;3.43074
1602.67;629702018;3.39895
1621.15;635039588;3.40334
1638.59;639332517;3.40934
1655.04;644407084;3.37815
1673.76;649950899;3.38223
1691.46;654281182;3.38775
1708.16;659721905;3.35726
1727.1;664356451;3.36124
1745.01;669233454;3.3665
1761.94;674640743;3.3728
1777.92;679066795;3.34419
1796.11;684560963;3.34901
1813.32;689867537;3.35477
1829.58;694654874;3.3265
1848.02;699063355;3.33109
1865.47;704539348;3.33652
1881.98;709697956;3.30869
1900.63;715070719;3.3132
1918.3;719380777;3.31845
1935.02;724849994;3.32427
1950.84;729220893;3.29756
1968.78;734602786;3.30255
1985.78;739919294;3.30805
2001.86;744679764;3.28159
2020.04;749867040;3.28648
2037.28;754538496;3.29181
2053.61;759257734;3.26566
2069.04;764676467;3.24085
2086.57;770016584;3.24691
2103.19;774560135;3.25327
2118.92;779607169;3.22859
2136.72;785040145;3.23454
2153.6;789374285;3.24074
2169.59;794614558;3.21625
2187.64;800069763;3.22217
2204.76;804567372;3.22829
2220.98;810001474;3.20404
2239.25;814468428;3.20999
2256.59;819734297;3.2161
2273.02;824496729;3.2223
2288.58;829620481;3.19841
2306.18;834380137;3.20448
2322.88;839851965;3.21063
2338.69;845106969;3.1869
2356.54;849592655;3.19298
2373.48;855120719;3.19911
2389.53;859652384;3.20526
2404.71;864031228;3.18175
2421.94;869479530;3.18785
2438.28;874952151;3.19397
2453.74;879715530;3.17057
2471.24;884164352;3.17669
2487.84;889522568;3.18279
2503.56;894631321;3.15955
2521.3;900045320;3.16569
2538.13;904773813;3.17181
2554.09;909744259;3.14871
2569.19;915031111;3.12635
2586.32;919585221;3.13325
2602.56;924410313;3.14011
2617.94;929256166;3.11786
2635.33;934834827;3.12475
2651.83;939237183;3.1316
2667.46;944623717;3.10945
2685.09;949148644;3.11634
2701.82;954601992;3.12318
2717.68;959392165;3.12995
2732.7;964291885;3.10782
2749.72;969789293;3.11462
2765.86;974627834;3.12136
2781.15;979993591;3.0993
2798.42;984703892;3.10607
2814.82;989638255;3.11277
2830.36;994872070;3.09077
2847.86;999360004;3.0975
2864.49;1004872259;3.10416
2880.25;1009488648;3.11074
2897.97;1014931289;3.11668
2914.8;1019516158;3.12255
2930.76;1024253412;3.12833
2945.87;1029876395;3.10561
2962.95;1034358342;3.11142
2979.16;1039719008;3.11716
2994.52;1044729215;3.09449
3011.83;1049124988;3.10026
3028.26;1054579392;3.10596
3043.84;1059176791;3.11158
3058.59;1064412073;3.08888
3075.3;1069878539;3.09452
3091.14;1074473475;3.1001
3106.15;1079881707;3.07745
3123.11;1084289723;3.08306
3139.2;1089624538;3.0886
3154.45;1094919663;3.06601
3171.63;1099408442;3.07158
3187.95;1105068115;3.07709
3203.41;1109318769;3.05456
3220.79;1114734201;3.0601
3237.3;1119095908;3.06558
3252.96;1124469925;3.07099
3267.79;1130011221;3.04846
3284.54;1134452753;3.0539
3300.44;1139812811;3.05928
3315.5;1144724603;3.03681
3332.48;1149098729;3.04222
3348.59;1154622797;3.04757
3363.87;1159261893;3.05286
3378.33;1164516368;3.03039
3394.7;1169829670;3.03571
3410.24;1174390624;3.04096
3424.96;1179601729;3.01855
3441.58;1185050566;3.02384
3457.35;1189412589;3.02907
3472.3;1194136222;3.00673
3489.14;1199542318;3.01199
3505.12;1205018566;3.0172
3520.28;1209815906;2.99494
3537.31;1214223910;3.00019
3553.49;1219518781;3.00538
3568.83;1225177659;3.01051
3583.36;1229363812;2.98827
3599.77;1234949777;2.99343
3615.35;1239317675;2.99855
3630.11;1244176677;2.97638
3646.74;1249795895;2.98153
3662.52;1254104190;2.98662
3677.48;1259421065;2.99166
3694.31;1264855204;2.99607
3710.28;1269207421;3.00044
3725.43;1274594610;3.00475
3739.77;1279351405;2.98198
3755.98;1284861598;2.98633
3771.35;1289193406;2.99063
3785.93;1294279645;2.96795
3802.35;1299617692;2.9723
3817.93;1304957046;2.9766
3832.71;1309428402;2.95401
3846.69;1315037881;2.93208
3862.53;1319409020;2.9371
3877.56;1325130327;2.94207
3891.79;1329118870;2.92023
3907.87;1334507870;2.92525
3923.12;1339926509;2.93022
3937.58;1344289246;2.90849
3953.86;1349666663;2.9135
3969.33;1355011148;2.91848
3983.98;1359533868;2.89684
4000.46;1364951053;2.90186
4016.1;1369319249;2.90684
4030.94;1374763478;2.91177
4044.99;1379825207;2.89018
4060.87;1384397370;2.89516
4075.93;1389190196;2.90008
4090.2;1394016371;2.87858
4106.28;1399565313;2.88355
4121.55;1404917107;2.88847
4136.02;1409784062;2.89335
4152.29;1414195776;2.89761
4167.74;1419542397;2.90184
4182.39;1425162405;2.90602
4196.26;1430063812;2.88396
4211.94;1434518292;2.88818
4226.81;1439883327;2.89235
4240.9;1444636448;2.87038
4256.78;1450119064;2.87461
4271.86;1454586547;2.87879
4286.15;1459173110;2.85692
4302.21;1465130871;2.86115
4317.47;1469319132;2.86535
4331.94;1475051860;2.86951
4345.63;1479272372;2.84771
4361.11;1484649389;2.85192
4375.8;1489975439;2.85609
4389.72;1494948890;2.83439
4405.41;1499282518;2.83861
4420.29;1504778549;2.84279
4434.41;1509601988;2.8212
4450.28;1515146711;2.82544
4465.35;1519459086;2.82965
4479.64;1524957145;2.83382
4493.16;1529481549;2.81231
4508.46;1534888787;2.81653
4522.97;1539209404;2.82071
4536.71;1544884718;2.79931
4552.21;1549502005;2.80354
4566.92;1554923385;2.80775
4580.86;1559289940;2.78646
4594.05;1564975880;2.76581
4609;1569327229;2.77069
4623.18;1574718640;2.77554
4639.09;1579221442;2.7798
4654.2;1584669913;2.78403
4668.54;1589992359;2.78823
4682.11;1594962025;2.76712
4697.43;1599364032;2.77136
4711.96;1604855090;2.77557
4725.73;1609241252;2.75457
4738.76;1614822700;2.73419
4753.54;1619175589;2.73906
4767.55;1624834739;2.7439
4780.81;1629337889;2.72362
4795.81;1634982638;2.72848
4810.04;1639411355;2.73332
4823.52;1644014207;2.71312
4838.71;1649450156;2.71799
4853.13;1654819908;2.72282
4866.81;1659261523;2.72761
4879.74;1664786323;2.70746
4894.4;1669188470;2.71227
4908.31;1674650723;2.69223
4921.48;1679494617;2.6728
4936.36;1685019750;2.67824
4950.47;1689413768;2.68364
4963.85;1694166639;2.66428
4978.93;1699566238;2.66969
4993.23;1705015489;2.67506
5006.8;1709655275;2.68039
5019.64;1714149946;2.66104
5034.18;1719553978;2.66636
5047.97;1724918740;2.67163
5061.04;1729866297;2.65233
5075.79;1734314501;2.65759
5089.79;1739762558;2.66281
5103.06;1744584297;2.64354
5118.01;1749948755;2.64876
5132.19;1754404494;2.65392
5145.64;1759392774;2.65904
5160.76;1765117802;2.66355
5175.11;1769482935;2.66802
5188.72;1774923069;2.67244
5201.61;1779359279;2.65255
5216.17;1784760262;2.65696
5229.98;1789162481;2.66132
5243.07;1794365906;2.64147
5257.81;1799746430;2.64582
5271.81;1804208711;2.65013
5285.07;1809870638;2.65439
5299.98;1814213627;2.65806
5314.14;1819578608;2.66169
5327.56;1825062670;2.66528
5340.27;1829538786;2.64484
5354.63;1834886046;2.64843
5368.26;1839175064;2.65198
5381.16;1844987012;2.6316
5395.71;1849515801;2.63516
5409.51;1854874990;2.63868
5422.59;1859065153;2.61838
5437.3;1864695844;2.62191
5451.26;1869364828;2.62542
5464.5;1874985794;2.6289
5477.03;1879701904;2.60865
5491.19;1884277207;2.61214
5504.63;1889633211;2.61561
5517.35;1894871025;2.59544
5531.7;1899216549;2.59892
5545.31;1904677744;2.60238
5558.21;1909492274;2.5823
5572.72;1915000688;2.58578
5586.49;1919405607;2.58925
5599.54;1924953850;2.5927
5611.9;1929739925;2.57269
5625.87;1934098545;2.57615
5639.12;1939422691;2.57959
5651.67;1944256549;2.55968
5665.82;1949765973;2.56315
5679.25;1954353663;2.5666
5691.97;1959556826;2.54678
5706.28;1965009622;2.55026
5719.87;1969377963;2.55372
5732.74;1974855394;2.55717
5747.19;1979180596;2.56004
5760.92;1984675460;2.56291
5773.93;1989998032;2.56576
5786.25;1994513205;2.54554
5800.15;1999955841;2.54842
5813.34;2004469921;2.55129
5825.83;2009708171;2.53118
5839.89;2015180477;2.53408
5853.24;2019544611;2.53698
5865.89;2024423668;2.53987
5877.85;2029457362;2.51987
5891.4;2035156591;2.52278
5904.24;2039625365;2.52569
5916.4;2044352789;2.50581
5930.12;2049784132;2.50876
5943.14;2054251903;2.5117
5955.47;2059872230;2.49194
5967.14;2064754745;2.47278
5980.38;2069143869;2.47634
5992.92;2074645706;2.4573
6004.8;2079168837;2.43885
6018.23;2084743201;2.44303
6030.97;2089057811;2.44721
6043.03;2094878680;2.42886
6056.64;2099279836;2.43306
6069.55;2104673261;2.43724
6081.79;2109146085;2.419
6093.37;2114649338;2.40134
6106.49;2120089265;2.40611
6118.94;2124637785;2.41086
6130.72;2129416588;2.39327
6144.04;2134912478;2.39802
6156.67;2139346343;2.40275
6168.64;2144854631;2.38523
6182.13;2149266989;2.38995
6194.94;2154632468;2.39465
6207.07;2159202924;2.39933
6220.72;2164603104;2.40342
6233.67;2170045427;2.4075
6245.95;2174748229;2.41155
6257.58;2179158066;2.39353
6270.72;2184590623;2.39755
6283.19;2190079477;2.40155
6295;2194175041;2.38357
6308.31;2199576751;2.38754
6320.94;2204915219;2.39149
6332.91;2209417969;2.39542
6346.37;2214897465;2.39877
6359.15;2219225195;2.40209
6371.26;2224718209;2.4054
6382.73;2229177257;2.38691
6395.69;2234517098;2.39019
6407.99;2239887383;2.39345
6419.63;2244329665;2.375
6432.76;2249772410;2.37824
6445.22;2254210616;2.38146
6457.02;2259256499;2.36307
6477.68;2265196541;2.44016
6477.68;2269961469;2.31731
6477.68;2274451473;2.201
6477.68;2279630694;2.06956
6486.38;2284147995;2.03197
6492.77;2289532938;1.97771
6497.87;2294722744;1.89564
6509.07;2300055577;1.88135
6518.86;2304517362;1.85954
6527.53;2309131009;1.81166
6541.89;2314625317;1.82745
6554.73;2320027199;1.83469
6566.1;2324564597;1.83374
6576.07;2329870496;1.80377
6591.27;2334189485;1.83284
6604.58;2339471408;1.84952
6616.15;2344711518;1.83387
6632.4;2349520580;1.87181
6646.54;2354933843;1.89525
6658.81;2359612336;1.81126
6675.29;2365008073;1.97607
6689.65;2369337873;2.11976
6702.15;2374641797;2.24481
6718.48;2380027875;2.32097
6732.79;2384490693;2.40026
6745.33;2389912849;2.47466
6756.32;2394417255;2.47253
6770.87;2399823282;2.5201
6783.73;2404325305;2.56203
6795.12;2409401700;2.53227
6809.73;2414881441;2.55006
6822.77;2419234798;2.5667
6834.4;2424854413;2.58338
6844.79;2429757784;2.53523
6858.19;2434214259;2.53604
6870.24;2439635144;2.54095
6881.09;2445236374;2.48694
6894.7;2449842518;2.48153
6907.03;2454305086;2.48221
6918.21;2459516649;2.42924
6931.93;2464952283;2.42283
6944.45;2469409673;2.42296
6955.87;2474552736;2.37389
6969.65;2480046884;2.36859
6982.28;2484529293;2.3695
6993.87;2489950180;2.37545
7004.49;2494494020;2.33626
7017.36;2499840197;2.33627
7029.21;2504313912;2.34101
7040.14;2509889065;2.30412
7050.22;2514692956;2.27449
7062.41;2520164600;2.28005
7073.69;2524719038;2.28903
7084.14;2529173813;2.25957
7096.58;2534518087;2.26341
7108.13;2539883477;2.27047
7118.87;2544311334;2.24179
7131.49;2549743592;2.24465
7143.25;2554189248;2.25048
7154.22;2559813140;2.22288
7166.97;2564198529;2.22523
7178.89;2569673931;2.23027
7190.04;2574362618;2.20389
7200.45;2579834189;2.18168
7212.58;2584436918;2.18714
7223.95;2589281330;2.19456
7234.6;2594224856;2.17242
7246.9;2599787658;2.17682
7258.44;2604316337;2.18302
7269.29;2609978630;2.19071
7281.71;2614463345;2.19303
7293.4;2619821493;2.19708
7304.39;2624397887;2.20255
7314.73;2629621289;2.18154
7326.6;2635122968;2.18472
7337.79;2639553852;2.18921
7348.33;2644425247;2.16839
7360.35;2649906721;2.17099
7371.7;2654328400;2.1748
7382.4;2659800365;2.15429
7394.54;2664193197;2.15653
7406.02;2669523309;2.15986
7416.85;2675057335;2.16407
7427.07;2679908605;2.14494
7438.71;2684434727;2.14766
7449.72;2689794325;2.15119
7460.11;2694141369;2.13215
7471.89;2699585277;2.13446
7483.04;2704976929;2.1375
7493.57;2709692048;2.11864
7505.47;2714204784;2.12068
7516.73;2719503441;2.12338
7527.39;2724791059;2.12661
7537.46;2729279273;2.10858
7548.88;2734802313;2.11087
7559.69;2739120121;2.11364
7569.92;2744417684;2.09566
7581.47;2750140022;2.09767
7592.41;2754561826;2.10012
7602.77;2759280276;2.08226
7614.43;2764760471;2.0841
7625.48;2769085365;2.08631
7635.95;2774137814;2.08883
7647.71;2779639363;2.08994
7658.86;2785120491;2.0914
7669.42;2789452308;2.09313
7679.42;2794891672;2.07531
7690.69;2799221012;2.07661
7701.39;2804548685;2.07815
7711.51;2809204224;2.06044
7722.9;2814578420;2.06165
7733.7;2819966678;2.06308
7743.93;2824762281;2.06467
7753.61;2829392035;2.04729
7764.55;2834909024;2.04859
7774.92;2839362731;2.05005
7784.74;2844651161;2.03274
7795.81;2849276452;2.03398
7806.3;2854671054;2.03536
7816.24;2859069301;2.01817
7827.42;2864515577;2.01939
7838.03;2870051226;2.02073
7848.07;2874644743;2.00368
7857.58;2879288841;1.98724
7868.32;2884891353;1.98904
7878.51;2889232266;1.99093
7888.15;2894187844;1.97459
7899.02;2899530016;1.97637
7909.33;2904951898;1.97823
7919.09;2909339781;1.962
7928.33;2915053677;1.94632
7938.79;2919380524;1.94864
7948.71;2924841137;1.95101
7958.09;2929210107;1.93542
7968.69;2934682922;1.93772
7978.74;2940053409;1.94006
7988.26;2944226423;1.92457
7998.99;2949632472;1.92686
8009.16;2954960656;1.92919
8018.8;2959202004;1.91379
8029.63;2964692299;1.91608
8039.91;2970183648;1.91841
8049.66;2974437676;1.92077
8060.58;2979812467;1.92259
8070.95;2984280148;1.92444
8080.78;2989865017;1.92633
8090.09;2994872032;1.9107
8100.58;2999256261;1.91254
8110.54;3004633496;1.91442
8119.96;3009902667;1.91633
8130.56;3014399370;1.91771
8140.62;3019731958;1.91912
8150.15;3024262599;1.92057
8159.16;3029248084;1.90468
8169.35;3034745607;1.90608
8179.01;3039159423;1.90752
8188.16;3044979163;1.89172
8198.47;3049404808;1.89312
8208.26;3054757774;1.89456
8217.52;3060042553;1.87886
8227.94;3064770171;1.88027
8237.83;3069659965;1.88172
8247.19;3074200588;1.86612
8256.05;3079724693;1.85101
8266.08;3084278179;1.85291
8275.57;3089672823;1.85485
8284.57;3094556304;1.83983
8294.71;3100005803;1.84172
8304.33;3104461692;1.84366
8313.43;3109383858;1.82873
8323.68;3114838717;1.83063
8333.4;3119126930;1.83256
8342.61;3124582837;1.83453
8351.32;3130076201;1.81973
8361.18;3134412582;1.82165
8370.52;3139696784;1.8236
8379.36;3144506071;1.80888
8389.33;3149434395;1.81078
8398.79;3154848850;1.81272
8407.75;3160096378;1.79808
8417.82;3164587025;1.79996
8427.38;3170051564;1.80189
8436.44;3174639646;1.80385
8446.6;3179060679;1.80528
8456.25;3184567482;1.80676
8465.39;3189964615;1.80827
8474.04;3194069161;1.79338
8483.81;3199533399;1.79483
8493.06;3204903287;1.79632
8501.83;3209423977;1.78151
8511.69;3214959592;1.78294
8521.05;3219428104;1.78442
8529.92;3225009496;1.78593
8538.3;3229670190;1.77123
8547.79;3235182685;1.77268
8556.78;3239551218;1.77416
8565.29;3244595973;1.75953
8574.89;3249342924;1.76096
8583.99;3254650469;1.76243
8592.61;3259740133;1.74788
8602.31;3264317384;1.74929
8611.51;3269776020;1.75075
8620.23;3274332382;1.73628
8630.02;3279779915;1.73768
8639.3;3284149549;1.73912
8648.11;3289520875;1.74061
8656.43;3295004772;1.72626
8665.83;3299415355;1.72768
8674.74;3304794892;1.72915
8683.18;3309148278;1.71487
8692.68;3314829815;1.71628
8701.69;3319111236;1.71773
8710.22;3324575254;1.71922
8718.29;3329073574;1.70505
8727.42;3334401554;1.70648
8736.08;3339817109;1.70794
8744.27;3344229330;1.69385
8753.51;3349694290;1.69525
8762.28;3355008687;1.69669
8770.58;3359991536;1.68267
8779.92;3364554396;1.68404
8788.78;3370026242;1.68546
8797.17;3374183106;1.67151
8806.59;3379616653;1.67287
8815.53;3384950248;1.67428
8824;3389593497;1.67573
8832.02;3394402742;1.6619
8841.07;3399814435;1.66327
8849.65;3404267228;1.66469
8857.77;3409241844;1.65093
8866.92;3414692361;1.65228
8875.59;3420085405;1.65367
8883.8;3424727063;1.65511
8891.57;3429905024;1.64146
8900.36;3434365362;1.64282
8908.69;3439673442;1.64422
8916.57;3444887760;1.63062
8925.47;3449584260;1.63195
8933.91;3454866710;1.63332
8941.89;3459840594;1.61979
8950.88;3464546097;1.62109
8959.41;3469328359;1.62243
8967.49;3474788689;1.60896
8975.12;3479483191;1.59592
8983.77;3484996982;1.59762
8991.96;3489470710;1.59936
8999.71;3494757754;1.58638
9008.45;3499094030;1.58803
9016.74;3504462531;1.58974
9024.59;3509610311;1.57681
9033.43;3515118964;1.57842
9041.81;3519412438;1.58008
9049.75;3524903720;1.58178
9057.25;3529860023;1.56894
9065.75;3534310837;1.57054
9073.79;3539617120;1.57219
9081.41;3544496299;1.55939
9090;3549394020;1.56094
9098.15;3554729100;1.56253
9105.86;3559642413;1.54977
9114.54;3564180713;1.55127
9122.77;3569691763;1.55281
9130.56;3574243969;1.55439
9139.31;3579640017;1.55546
9147.61;3585067096;1.55658
9155.48;3589607264;1.55773
9162.92;3594827762;1.54472
9171.32;3599146045;1.54577
9179.28;3604503865;1.54688
9186.82;3609523070;1.5339
9195.3;3614922607;1.53491
9203.34;3619305036;1.53596
9210.96;3624873194;1.53706
9218.16;3629577584;1.52417
9226.31;3635053792;1.52517
9234.03;3639587676;1.52621
9241.34;3644877992;1.51336
9249.58;3649340662;1.51431
9257.39;3654690676;1.5153
9264.79;3659910798;1.5025
9273.1;3664481812;1.50339
9281;3669927602;1.50435
9288.47;3674346084;1.4916
9296.86;3679820394;1.49245
9304.82;3684273972;1.49337
9312.36;3689581748;1.49433
9319.49;3694376767;1.48169
9327.54;3699783509;1.48255
9335.17;3704228133;1.48347
9342.39;3709433623;1.47087
9349.21;3714708280;1.45868
9356.95;3719054243;1.45991
9364.28;3724414613;1.46118
9371.21;3729688908;1.44902
9379.05;3734181027;1.4502
9386.48;3739632706;1.45142
9393.51;3744765393;1.43931
9401.43;3749198520;1.44043
9408.94;3754576584;1.4416
9416.06;3759372193;1.42953
9424.06;3764913741;1.4306
9431.64;3769506684;1.43172
9438.83;3774130299;1.4197
9445.62;3779731762;1.40807
9453.3;3784342377;1.40948
9460.58;3790004030;1.41094
9467.47;3794195772;1.39935
9475.23;3799605916;1.4007
9482.59;3804975424;1.4021
9489.56;3809466056;1.40355
9497.4;3814957445;1.40449
9504.83;3819353182;1.40548
9511.86;3824860233;1.40653
9518.52;3829244859;1.3947
9526.04;3834717304;1.39562
9533.17;3839111143;1.3966
9539.91;3844637378;1.38479
9547.51;3850057887;1.38564
9554.71;3854381129;1.38655
9561.53;3859591585;1.37478
9569.2;3864257488;1.37557
9576.47;3869222224;1.37642
9583.35;3874761741;1.37732
9589.87;3879356192;1.36563
9597.22;3884858424;1.36641
9604.2;3889398979;1.36724
9610.79;3894486409;1.35558
9618.22;3899897455;1.35629
9625.27;3904397886;1.35706
9631.94;3909793157;1.34543
9639.43;3914161965;1.34608
9646.54;3919497456;1.3468
9653.28;3924957210;1.34757
9659.64;3929172864;1.33602
9666.83;3934565789;1.33667
9673.65;3939895253;1.33737
9680.09;3944848697;1.32586
9687.36;3949734307;1.32644
9694.24;3954219449;1.32709
9700.76;3959458618;1.31561
9708.08;3964949852;1.31614
9715.03;3969462087;1.31673
9721.6;3973990496;1.31738
9728.98;3979432842;1.31754
9735.97;3984836143;1.31776
9742.6;3989384234;1.31804
9748.86;3994993046;1.30639
9755.92;3999347279;1.30655
9762.62;4004636146;1.30678
9768.95;4009491772;1.29517
9776.07;4015028731;1.29529
9782.82;4019408109;1.29547
9789.21;4024910910;1.29572
9795.25;4029934938;1.28422
9802.08;4034473182;1.28435
9808.55;4039816192;1.28455
9814.67;4044352830;1.2731
9821.56;4050085034;1.27318
9828.09;4054442516;1.27334
9834.28;4059824750;1.26193
9841.22;4064613593;1.26198
9847.81;4069210687;1.26209
9854.05;4074862503;1.25075
9861.04;4079289055;1.25076
9867.68;4084734210;1.25084
9873.96;4089131390;1.251
9879.9;4094327520;1.23979
9886.6;4099634965;1.23983
9892.95;4105129342;1.23995
9898.95;4109688258;1.22879
9904.62;4114182447;1.218
9911.05;4119563241;1.21837
9917.13;4124955577;1.21881
9923.96;4129690324;1.21877
9930.43;4135027884;1.21881
9936.56;4139537671;1.21893
9942.35;4144241587;1.20794
9948.89;4149635821;1.20794
9955.08;4154994188;1.20802
9960.93;4159790063;1.19709
9967.52;4164193510;1.19704
9973.76;4169700928;1.19708
9979.67;4173976864;1.18621
9986.29;4179362026;1.18613
9992.58;4184807583;1.18614
9998.52;4189516042;1.18622
10004.1;4194406625;1.17549
10010.5;4199792369;1.17544
10016.5;4204283961;1.17549
10022.2;4209425020;1.1756
10028.6;4214907082;1.17524
10034.6;4219309329;1.17496
10040.4;4224760235;1.16405
10045.8;4229580592;1.15349
10051.9;4235001912;1.15345
10057.7;4239516944;1.15348
10063.2;4244185211;1.14298
10069.4;4249614184;1.14289
10075.2;4254995887;1.14289
10080.8;4259909546;1.13243
10087;4264339391;1.13231
10092.9;4270052567;1.13227
10098.5;4274653580;1.12188
10103.8;4280032991;1.11183
10109.7;4284679414;1.11202
10115.4;4289234419;1.11229
10120.7;4294088875;1.10229
10126.7;4299471822;1.10243
10132.4;4304820232;1.10265
10137.8;4309474814;1.0927
10143.9;4314912619;1.09278
10149.7;4319239988;1.09295
10155.1;4324721995;1.09321
10160.2;4329998089;1.08338
10166;4334456787;1.08348
10171.6;4339720251;1.08368
10177.7;4344497619;1.08339
10183.5;4349466969;1.08319
10189.1;4354863104;1.08308
10194.3;4359763945;1.07307
10200.2;4364149285;1.07281
10205.7;4369610955;1.07264
10211;4374896607;1.07255
10216.9;4379270726;1.07199
10222.5;4384697862;1.07151
10227.8;4389108871;1.07112
10232.8;4394462461;1.06101
10238.5;4399826906;1.06047
10243.8;4404281326;1.06003
10248.9;4409153905;1.04997
10254.6;4414614635;1.04938
10260;4420087209;1.04889
10265.1;4424671984;1.04848
10269.9;4429551854;1.03855
10275.4;4435038210;1.038
10280.5;4439649643;1.02803
10285.4;4444631118;1.0184
10290.9;4450026130;1.01805
10296.1;4454352186;1.0178
10301;4459576267;1.00821
10306.5;4465032253;1.00782
10311.8;4469466671;1.00751
10316.7;4473968667;0.997981
10322.3;4479345405;0.997545
10327.5;4484653177;0.997203
10332.5;4489147606;0.996953
10337.2;4494818636;0.987554
10342.6;4499141239;0.987161
10347.6;4504689241;0.986856
10352.3;4509201229;0.977495
10356.8;4514953672;0.968465
10361.9;4519388802;0.968342
10366.7;4524822845;0.968304
10371.3;4529548723;0.959297
10376.4;4534900488;0.959116
10381.3;4539432198;0.959013
10385.9;4545107917;0.950044
10391.1;4549612464;0.949796
10396;4554932485;0.94964
10400.6;4559774638;0.940701
10405.8;4564359068;0.940394
10410.7;4569886315;0.940172
10415.4;4574749503;0.931271
10420.6;4579072744;0.930904
10425.6;4584524767;0.930629
10430.3;4589357163;0.930444
10434.7;4594330349;0.921661
10439.7;4599829910;0.921315
10444.5;4604306180;0.921064
10448.9;4609201213;0.920895
10453.9;4614697346;0.920256
10458.7;4619152936;0.91971
10463.2;4624507207;0.919252
10467.5;4629322414;0.910378
10472.3;4634655979;0.909762
10476.8;4639162116;0.90923
10481.1;4644729062;0.900382
10485.9;4649212427;0.89969
10490.5;4654605024;0.899095
10494.8;4659316527;0.890276
10499.7;4664850446;0.889522
10504.3;4669808104;0.888864
10508.6;4674526497;0.880075
10512.8;4679099466;0.871594
10509.7;4684941911;0.793959
10509.7;4689636887;0.749606
10509.7;4694971723;0.699641
10513.4;4699355069;0.689792
10515.9;4704806229;0.669335
10517.6;4709204698;0.636952
10521.7;4714724630;0.629463
10525;4719094027;0.618314
10528;4724548315;0.605296
10530.6;4729595960;0.583266
10535.2;4734939514;0.584467
10539.4;4739495170;0.583156
10543.1;4745264557;0.571603
10548.6;4749157918;0.581337
10553.5;4754601232;0.586953
10557.8;4759083389;0.580994
10563.7;4764859793;0.594195
10568.9;4769355818;0.602299
10573.4;4774088447;0.605953
10577.2;4779622385;0.675281
10582.6;4784993643;0.728951
10587.2;4789519899;0.775646
10591.3;4794455523;0.778738
10596.7;4799804097;0.808439
10601.4;4804234352;0.837845
10605.6;4809866913;0.839122
10610.9;4814237855;0.858695
10615.6;4819602238;0.87638
10619.8;4824456570;0.892053
10625;4830064926;0.897971
10629.7;4834562136;0.903114
10633.9;4840118069;0.907951
10637.6;4844716236;0.889525
10642.3;4849139462;0.887808
10646.5;4854452130;0.887513
10650.3;4859081432;0.86631
10655.1;4864857852;0.861866
10659.3;4869480148;0.859771
10663.2;4874655000;0.859747
10667.9;4880097970;0.853058
10672.2;4884520838;0.849103
10676;4889112910;0.847448
10679.6;4894330243;0.828901
10683.9;4899626304;0.824859
10687.9;4905129293;0.823045
10691.5;4909608785;0.805841
10694.8;4914465501;0.791859
10698.9;4919860697;0.790658
10702.6;4924334818;0.775346
10706;4929130878;0.76286
10710.1;4934463143;0.76222
10713.9;4939839305;0.763026
10717.4;4944835596;0.750889
10721.5;4949185552;0.749801
10725.3;4954504836;0.750062
10728.9;4959664568;0.738389
10733;4964615946;0.737065
10736.9;4970059513;0.736953
10740.5;4974560788;0.72581
10744.6;4980034438;0.724352
10748.4;4984570318;0.723996
10752;4989490484;0.724547
10755.4;4995011263;0.714883
10759.3;4999358299;0.714072
10762.9;5004744007;0.714101
10766.3;5009341948;0.714832
10770.2;5014709347;0.713197
10773.8;5020088774;0.712363
10777.2;5024510492;0.712212
10780.4;5029112043;0.703183
10784.1;5034423561;0.701954
10787.5;5039886745;0.70135
10790.8;5044491093;0.692403
10794.4;5050027588;0.690884
10797.9;5054359612;0.689958
10801.1;5059868768;0.681134
10804.8;5064212721;0.679422
10808.3;5069679494;0.678244
10811.6;5074383640;0.669571
10814.6;5079191948;0.661699
10818.1;5084901157;0.660517
10821.4;5089563805;0.659736
10824.5;5094693940;0.651844
10827.9;5100102438;0.650393
10831.2;5104524567;0.649323
10834.3;5109173354;0.641457
10837.8;5114682990;0.639798
10841.1;5120050497;0.638488
10844.2;5124638495;0.637477
10847.1;5129449998;0.629974
10850.4;5134798032;0.628401
10853.5;5139352038;0.627107
10856.9;5144945647;0.62488
10860.2;5149535122;0.622953
10863.3;5154965026;0.621284
10866.2;5159160033;0.613616
10869.4;5164671132;0.611525
10872.5;5169999478;0.609693
10875.4;5174401258;0.608063
10878.7;5179844137;0.605661
10881.7;5184294838;0.603503
10884.6;5189715664;0.60154
10887.3;5194283311;0.593978
10890.4;5199653397;0.591667
10893.3;5204999084;0.589564
10896;5209719053;0.582019
10899;5214234336;0.579601
10901.9;5219614474;0.577379
10904.6;5224505828;0.575315
10907.6;5230111581;0.572659
10910.5;5234606374;0.570182
10913.2;5240042195;0.562573
10915.7;5244986594;0.555291
10918.6;5249607901;0.552877
10921.2;5254934696;0.550619
10923.8;5259853150;0.543374
10926.6;5264670444;0.54088
10929.3;5269203259;0.538553
10931.8;5274577060;0.531356
10934.6;5280089302;0.528809
10937.3;5284584630;0.526427
10939.8;5289905751;0.52419
10942.5;5294325226;0.521472
10945.2;5299628813;0.518905
10947.6;5305174392;0.516496
10950;5310073750;0.509454
10952.6;5314664654;0.506844
10955.1;5320071926;0.504397
10957.4;5324547820;0.49741
10960;5329078269;0.494781
10962.4;5334403751;0.492294
10964.7;5339938190;0.489955
10966.9;5344555772;0.483187
10969.3;5349899662;0.480667
10971.6;5354190871;0.478291
10973.8;5360182884;0.471597
10976.2;5364766223;0.469054
10978.5;5369297507;0.466656
10980.6;5374691131;0.460033
10983;5379065922;0.457465
10985.3;5384581305;0.455051
10987.4;5389515210;0.448512
10989.4;5394143902;0.442225
10991.6;5399564947;0.439896
10993.8;5404862044;0.437704
10995.7;5409764886;0.431491
10998;5414309211;0.429136
11000.1;5419659457;0.426931
11002;5424770212;0.420779
11004.3;5429467238;0.418408
11006.3;5434779099;0.416177
11008.3;5439271916;0.414095
11010.1;5444480511;0.40817
11012.2;5450005424;0.405907
11014.1;5454317526;0.403789
11016;5459402877;0.397919
11018;5465165270;0.395629
11020;5469800835;0.393478
11021.8;5474239493;0.387677
11023.5;5479906691;0.382102
11025.4;5484360689;0.38001
11027.2;5489936313;0.378067
11029.2;5494377703;0.375697
11031.1;5499690721;0.373481
11032.9;5505053045;0.371405
11034.6;5509427037;0.365851
11036.4;5514911914;0.363588
11038.2;5519318634;0.361473
11039.8;5524504223;0.355972
11041.7;5529119387;0.353666
11043.4;5534431485;0.351505
11045.1;5540006371;0.349483
11046.6;5545129092;0.344169
11048.3;5549535308;0.341958
11050;5554856343;0.339882
11051.5;5560109857;0.334607
11053.2;5564942909;0.332338
11054.8;5569540778;0.330213
11056.3;5574240148;0.328228
11058;5579628372;0.32582
11059.5;5585060327;0.323552
11061;5589768166;0.31828
11062.7;5594115943;0.315819
11064.2;5599473109;0.313502
11065.7;5604813238;0.311335
11067.1;5609394086;0.306241
11068.6;5614853311;0.303865
11070;5619182882;0.301634
11071.4;5624840704;0.296567
11072.6;5629262959;0.291728
11074;5634830159;0.289503
11075.4;5639493955;0.287416
11076.6;5644920148;0.282585
11078;5649471524;0.280294
11079.3;5654820827;0.278138
11080.5;5659929843;0.273343
11081.9;5664542050;0.270978
11083.2;5669873068;0.268757
11084.4;5674409497;0.263985
11085.7;5679845416;0.26156
11087;5684176459;0.25927
11088.1;5689522763;0.254529
11089.4;5694192977;0.25204
11090.7;5699512474;0.249687
11091.8;5705109914;0.247487
11092.9;5709695458;0.242917
11094.1;5714138007;0.240489
11095.2;5719508796;0.238219
11096.2;5724895493;0.236074
11097.4;5729403493;0.233517
11098.5;5734753794;0.231108
11099.5;5739364189;0.228844
11100.4;5744336482;0.224387
11101.5;5749692028;0.221899
11102.5;5754977216;0.219554
11103.4;5759992586;0.215109
11104.4;5764756645;0.212541
11105.4;5769544188;0.210121
11106.3;5774609941;0.205697
11107.3;5780055314;0.203063
11108.2;5784527617;0.200569
11109.1;5790094839;0.196171
11109.9;5794825184;0.191971
11110.7;5799173037;0.189445
11111.6;5804515570;0.187069
11112.4;5809475525;0.182884
11113.2;5814885446;0.180279
11114;5819158093;0.177828
11114.7;5824644846;0.173655
11115.4;5829347193;0.169673
11116.2;5834759750;0.167179
11116.9;5839334567;0.16483
11117.6;5844686577;0.160855
11118.3;5849183612;0.158271
11119;5854561609;0.155841
11119.6;5859885351;0.151881
11120.3;5864419111;0.149217
11120.9;5869884389;0.146707
11121.5;5874419794;0.142753
11122.2;5879895719;0.140013
11122.8;5884268561;0.137419
11123.4;5889774441;0.134979
11124;5894179859;0.132126
11124.5;5899514016;0.129424
11125;5904884912;0.126872
11125.5;5909517791;0.123067
11126;5915024491;0.120279
11126.5;5919388192;0.117651
11127;5924909414;0.115158
11127.4;5929489194;0.112258
11127.9;5934890365;0.109512
11128.3;5939681860;0.106912
11128.6;5944811294;0.103242
11129;5949580534;0.10041
11129.4;5954965315;0.0977245
11129.7;5959870607;0.0940601
11130.1;5964359091;0.0911479
11130.4;5969693870;0.088377
11130.7;5974978062;0.084728
11131;5979368073;0.0817402
11131.2;5984808307;0.0788986
11131.5;5989660674;0.0752613
11131.7;5995029686;0.0721853
11132;5999402304;0.0692738
11132.2;6004836299;0.0665123
11132.3;6009300732;0.0630553
11132.5;6014784341;0.0600495
11132.7;6019346048;0.057208
11132.8;6024136510;0.0537619
11132.9;6029155603;0.0504912
11133;6034565102;0.0475751
11133.1;6040029563;0.044814
11133.2;6044413319;0.041544
11133.2;6049954662;0.0385376
11133.3;6054267170;0.0356954
11133.3;6059835712;0.0324269
11133.3;6064265289;0.0293283
11133.3;6069648870;0.0263854
11133.3;6074958858;0.0231163
11133.2;6079314671;0.0200129
11133.2;6084707839;0.0170697
11133.1;6089308457;0.0139007
11133.1;6094908280;0.0108787
11133;6099216020;0.00802118
11132.9;6104547111;0.00531374
11132.8;6109429687;0.00246636
11132.7;6114997600;0.000235494
11132.5;6119362527;0.0027833
11132.4;6124326409;0.00520032
11132.3;6129930566;0.00767214
11132.1;6134225251;0.00999573
11132;6139798255;0.0121986
11131.8;6144281506;0.014366
11131.6;6149627544;0.0164003
11131.5;6154910556;0.0183154
11131.3;6159490642;0.0201026
11131.1;6164286720;0.0217676
11130.9;6169785400;0.0233196
11130.8;6174759661;0.0247638
11130.6;6179117862;0.0260966
11130.4;6184441754;0.0273271
11130.2;6189956545;0.0284519
11130;6194561814;0.0294889
11129.8;6200013778;0.0304304
11129.6;6204544135;0.0312766
11129.4;6209478490;0.0320416
11129.3;6215062907;0.0327259
11129.1;6219527773;0.0333301
11128.9;6224591581;0.0338502
11128.7;6229247149;0.0343091
11128.5;6234661002;0.0346805
11128.3;6239265308;0.0350006
11128.1;6244735806;0.0352521
11127.9;6249036229;0.0354399
11127.7;6254442183;0.0355737
11127.6;6259962872;0.0356537
11127.4;6264498283;0.0356801
11127.2;6269944739;0.0356583
11127;6274626052;0.0355839
11126.8;6280073864;0.035471
11126.7;6284519731;0.0353152
11126.5;6289026310;0.0351128
11126.3;6294987959;0.0348773
11126.2;6299336874;0.0346092
11126;6304664468;0.0342998
11125.9;6309137933;0.0339677
11125.7;6314612157;0.0335992
11125.6;6320078408;0.0332086
11125.4;6324380253;0.0327916
11125.3;6329975288;0.0323571
11125.1;6334303501;0.0318926
11125;6339817522;0.0314158
11124.8;6344454443;0.0309181
11124.7;6349529836;0.0304043
11124.6;6355062247;0.0298745
11124.4;6359621505;0.0293382
11124.3;6364112854;0.0287778
11124.2;6369454470;0.0282153
11124.1;6374896683;0.027638
11124;6379357291;0.0270549
11123.9;6384756510;0.0264662
11123.8;6389323036;0.0258721
11123.6;6394806458;0.0252729
11123.5;6399191295;0.0246686
11123.5;6404578024;0.0240637
11123.4;6409143063;0.0234588
11123.3;6414627806;0.0228536
11123.2;6420042261;0.0222485
11123.1;6424693604;0.0216392
11123;6429427512;0.0210345
11122.9;6434115657;0.0204347
11122.9;6439753645;0.0198355
11122.8;6444196233;0.0192415
11122.7;6449711152;0.0186526
11122.6;6455150665;0.01806
11122.6;6459573241;0.0174862
11122.5;6464220268;0.0169091
11122.5;6469552356;0.0163421
11122.4;6474895168;0.0157848
11122.3;6479357231;0.0152289
11122.3;6484753934;0.0146832
11122.2;6489348614;0.0141479
11122.2;6494954078;0.0136228
11122.1;6499272647;0.0130992
11122.1;6504629228;0.0125858
11122.1;6509064325;0.0120832
11122;6514746548;0.0115908
11122;6519094872;0.0111135
11121.9;6524645345;0.0106379
11121.9;6529212381;0.0101729
11121.9;6534568458;0.00972256
11121.8;6539852570;0.00927872
11121.8;6544417514;0.00884541
11121.8;6549804625;0.00842263
11121.8;6554134095;0.00801052
11121.7;6560086130;0.00760906
11121.7;6564733821;0.00722272
11121.7;6569216816;0.00683367
11121.7;6574145002;0.00646877
11121.7;6579553458;0.00610549
11121.7;6584897007;0.00575721
11121.6;6589395595;0.00541487
11121.6;6594940369;0.00508357
11121.6;6599339752;0.00476726
11121.6;6604740529;0.00445678
11121.6;6609359169;0.00415276
11121.6;6614884188;0.00386359
11121.6;6619218092;0.00358484
11121.6;6624326754;0.00331229
11121.6;6629863211;0.00305027
11121.6;6634172301;0.00279854
11121.6;6638996330;0.00255734
11121.6;6644509724;0.00232234
11121.6;6649856860;0.00209305
11121.6;6654131825;0.00187863
11121.6;6659086991;0.00167003
11121.6;6664805773;0.00147184
11121.6;6669373924;0.00127936
11121.6;6674508037;0.00109716
11121.6;6679844912;0.000920785
11121.6;6684225723;0.000754823
11121.6;6689832381;0.000598772
11121.6;6694480862;0.000443967
11121.6;6699762551;0.000299573
11121.6;6704219952;0.000160508
11121.6;6709642610;3.16222e-05
11121.6;6714983741;9.60567e-05
11121.6;6719345930;0.000214052
11121.6;6724238243;0.00032622
11121.6;6729695481;0.000428605
11121.6;6735007431;0.000534321
11121.6;6739858702;0.000625668
11121.6;6744405050;0.000707235
11121.6;6750046944;0.000792379
11121.6;6754568150;0.000872071
11121.7;6759284067;0.000942103
11121.7;6764659708;0.00100656
11121.7;6770008449;0.00107051
11121.7;6774744443;0.00112901
11121.7;6779129463;0.00118268
11121.7;6784501790;0.00123522
11121.7;6789050621;0.0012739
11121.7;6794696035;0.00131641
11121.7;6800237975;0.00135359
11121.7;6804860867;0.0013904
11121.7;6810021944;0.00141322
