Distance;Time;Velocity Kalman
0;393833;0.0250863
0.101566;5442077;0.0230736
0.176546;9471455;0.0210462
10.5978;15036934;0.121786
10.5978;20272994;0.121315
10.5978;25015772;0.120845
8.09307;29603673;0.0956186
6.47599;34561541;0.0786357
5.29124;39996171;0.0662248
4.34918;44738571;0.0565183
3.59763;49802505;0.0496013
2.95935;55177545;0.0440882
2.41744;60162301;0.0398055
1.84307;65230744;0.0692613
1.38988;70524711;0.0747955
0.701394;75017285;0.0800031
0.129881;80266312;0.00269996
0.446655;84748264;0.00301932
0.960422;90244499;0.00841366
1.42526;95322937;0.0142526
1.82486;100278360;0.0189771
2.10826;104736699;0.0224243
2.34743;110293746;0.129427
2.54686;114702311;0.131381
2.71201;120230777;0.132986
2.76202;125564396;0.108551
2.80803;129594436;0.0927471
2.54116;135097710;0.0781225
2.2947;140007302;0.0660827
2.06782;145601791;0.0560843
1.89204;150123219;0.0480426
1.73772;154595163;0.0411252
1.60452;159992168;0.0339729
1.33293;164678388;0.0261483
1.08385;170168543;0.0168941
0.855884;174953731;0.00885959
0.797288;179824323;0.003855
0.753166;185146362;0.00261276
0.722797;189544190;0.00813188
0.689219;194963768;0.0119514
0.665568;200177745;0.0145513
0.651151;204538070;0.0169631
0.643799;210155124;0.0191022
0.606446;214933939;0.0211132
0.614255;220153110;0.0222835
0.642043;225644094;0.0225441
0.668772;229609900;0.0195809
0.693495;234934858;0.0168805
0.757062;240305433;0.0150384
0.827084;245033455;0.0132284
0.899646;250429432;0.0115698
0.934042;254837204;0.00953551
0.965267;260025604;0.00740808
0.993508;265098090;0.00617383
0.971512;270349658;0.00757837
0.990011;275263157;0.00814614
1.04061;280057944;0.00875976
1.11365;285510158;0.0093909
1.20082;290288158;0.0116705
1.2968;295167012;0.0137979
1.26526;300457353;0.0135991
1.24512;305390454;0.0134961
1.23522;310051588;0.0111445
1.22429;315543636;0.00886256
1.22424;319827566;0.00854351
1.23387;325520186;0.0082906
1.30745;329944473;0.0090101
1.37735;334742108;0.00833353
1.44348;340528748;0.00772812
1.38782;344834476;0.00602866
1.33467;349636977;0.00521485
1.28377;355540804;0.00446013
1.27982;360073415;0.00409286
1.27632;364896967;0.00306153
1.27285;370372710;0.00358014
1.18139;374606732;0.00411659
1.09361;380334128;0.0051904
1.00936;384661069;0.00646567
1.01958;390262344;0.00737741
1.03256;394539124;0.00563065
1.04795;400166888;0.00400254
1.02805;404593521;0.00353544
1.00978;409823432;0.00302205
0.992975;415432693;0.00273971
0.997442;419890079;0.00247766
1.01326;424916792;0.00364612
1.03834;430460569;0.00490076
1.07128;435247778;0.00615814
1.00752;439495901;0.0070436
0.953845;444899948;0.00791288
0.910154;449613753;0.00875199
0.889152;454588701;0.00828375
0.873296;459814033;0.00782358
0.830325;465263355;0.00857459
0.7925;470240916;0.0082987
0.75845;474843333;0.0080287
0.846231;480432611;0.0069371
0.931881;484665126;0.00622332
1.01623;489626840;0.0055728
0.937048;495055698;0.00454521
0.86266;500369299;0.00436146
0.792729;505198831;0.00421593
0.807337;509678272;0.00459909
0.821949;514802194;0.00394677
0.836656;520345901;0.00338272
0.851493;525296187;0.00294984
14.8641;530439673;0.138539
14.8641;534892885;0.138878
14.8641;539619898;0.139213
22.1719;545564814;0.212638
26.9085;550199290;0.260295
30.3963;554798010;0.295464
38.6444;560135590;0.378277
45.6129;564675556;0.448263
51.6833;570444673;0.50926
61.8618;575568666;0.610205
70.9545;580136431;0.70033
83.9502;584608935;0.829509
95.5256;589610665;0.946131
105.724;595074607;1.04896
114.615;599910504;1.13868
126.364;605022714;1.25595
136.582;610419454;1.35792
149.207;614866264;1.48397
160.173;619814352;1.59343
169.654;625106475;1.54813
181.999;630611114;1.67158
192.738;635130533;1.77896
202.062;640291088;1.79904
213.292;644988991;1.86395
223.105;650085522;1.92718
231.677;654738501;1.93035
241.874;660270599;1.96262
250.847;665404899;1.99164
258.742;669812603;1.96881
265.691;674821318;1.94737
274.623;680331913;1.90673
282.558;685003674;1.87034
289.611;689643677;1.83888
298.343;694579504;1.83729
306.164;699948757;1.79801
314.979;705352996;1.78399
322.916;710345289;1.7371
330.066;715139985;1.69894
336.51;719932423;1.66856
344.446;725332278;1.62447
351.645;729607067;1.58908
359.97;735111465;1.57911
367.559;740439794;1.5427
374.478;745561983;1.51377
382.347;750095145;1.50676
389.553;755225651;1.47681
396.151;760080397;1.45306
404.028;764745553;1.45287
411.276;769744461;1.45585
417.944;775121208;1.43322
424.081;779966112;1.41522
431.149;784999855;1.41538
437.678;790403705;1.39335
445.181;795207251;1.39017
452.134;800588023;1.37156
458.578;804537773;1.35663
465.938;810058351;1.35872
472.78;815415761;1.36271
479.139;819640614;1.34693
486.425;825129672;1.3478
493.218;830448019;1.33247
499.547;834976034;1.31988
505.442;839775272;1.30964
512.128;844970079;1.29781
518.373;849585310;1.28821
525.56;854983861;1.29409
532.29;860043712;1.28262
538.59;865064587;1.27314
545.54;870608379;1.27596
552.058;875357300;1.27978
558.167;879910419;1.27018
563.888;884674269;1.2621
570.546;889802619;1.25366
576.8;894491207;1.24666
583.8;899965730;1.25223
590.388;905106086;1.2445
596.582;910364760;1.23803
603.463;914789610;1.24325
609.946;919981666;1.23521
616.047;925573057;1.2283
621.784;930007010;1.22238
627.172;935070448;1.21731
632.226;940331398;1.20099
639.067;944709942;1.20695
645.526;949767799;1.19968
651.619;955018733;1.19331
658.413;960581102;1.19826
664.835;965110454;1.19296
670.895;970561156;1.18839
677.64;974982715;1.19474
684.017;980584666;1.2013
690.04;985202866;1.19494
696.902;989599285;1.20102
703.396;994609689;1.19597
709.537;1000052235;1.19149
715.335;1005068131;1.18753
721.623;1010392192;1.1816
727.568;1014813378;1.17622
733.179;1019661694;1.17132
739.481;1024725347;1.17697
745.442;1029995216;1.1827
752.037;1035413814;1.19811
758.283;1039575786;1.19217
764.192;1044712776;1.18667
770.705;1050412945;1.19087
776.874;1055588734;1.18461
782.71;1059606765;1.17876
789.24;1065224660;1.18345
795.428;1070301696;1.17788
801.284;1074701111;1.17267
806.817;1080625246;1.16777
812.96;1084847197;1.16059
818.775;1090018112;1.15379
825.27;1095402305;1.15734
831.428;1100415755;1.16093
837.257;1104534110;1.15634
843.702;1110067127;1.16135
849.812;1114588735;1.16633
855.596;1119984141;1.16115
861.952;1125524423;1.16511
867.977;1130555906;1.15941
873.68;1134745733;1.15397
880.025;1140275335;1.15833
886.04;1145355806;1.15335
891.733;1149776953;1.14859
897.115;1154648649;1.14406
903.227;1159831309;1.13987
909.017;1164514785;1.13589
915.409;1169949428;1.14126
921.472;1174828667;1.14656
927.216;1180063384;1.14256
933.471;1185472578;1.14696
939.402;1190663515;1.14132
945.018;1195337859;1.1359
950.326;1200035542;1.13069
956.392;1205108243;1.1269
962.14;1209684119;1.12328
969.391;1215125840;1.138
969.389;1220227224;1.07442
969.388;1225463626;1.01415
985.507;1229897996;1.11836
985.507;1235040122;1.05492
985.507;1240769188;0.994777
1004.88;1245292400;1.13157
1004.88;1250405176;1.07775
1004.88;1254813171;1.01666
1004.88;1260535248;0.958792
1020.45;1264571683;1.0504
1020.45;1270095506;0.989767
1026.14;1275561994;0.989259
1029.18;1279826952;0.957049
1031.15;1284555801;0.917508
1035.86;1290014772;0.908452
1039.63;1295176489;0.893016
1042.8;1300558530;0.864116
1048.76;1305099241;0.866169
1054.04;1310212895;0.846521
1058.74;1314656712;0.893513
1062.89;1320410289;0.935017
1069.19;1325548758;0.836912
1074.75;1329984922;0.89244
1079.6;1335476844;0.940918
1086.77;1340542502;0.819385
1093.04;1344921484;0.882003
1100.98;1350498639;0.96136
1107.9;1355221637;1.03052
1113.9;1360101120;0.934554
1121.63;1364991469;1.01183
1128.37;1370241491;1.02226
1134.22;1375366995;1.05053
1141.58;1379882916;1.10439
1148.03;1384973137;1.12177
1153.68;1390373901;1.14057
1158.62;1395295221;1.15822
1165.06;1400557258;1.16306
1170.74;1404974602;1.16707
1177.84;1410417332;1.19108
1184.16;1415351809;1.21276
1189.79;1419508546;1.206
1196.71;1424919572;1.21969
1202.92;1429871668;1.23328
1208.5;1435422156;1.21723
1224.73;1439977013;1.31692
1224.72;1445371346;1.23749
1224.72;1449792300;1.16828
1241.69;1455258119;1.27817
1241.69;1460480708;1.2009
1241.69;1464593255;1.13357
1256.57;1469996957;1.22347
1256.57;1474941138;1.14987
1256.57;1479632774;1.0854
1273.56;1485079057;1.19889
1273.56;1490037846;1.14949
1273.56;1495580998;1.0851
1278.1;1500047743;1.07353
1281.03;1505019386;1.03188
1283.19;1510277640;0.990307
1287.67;1514647562;0.978784
1291.44;1519886885;0.947298
1294.73;1525143612;0.918107
1300.17;1529786603;0.916861
1305.03;1534772305;0.803094
1309.34;1539635363;0.846218
1315.93;1545082041;0.912113
1321.76;1550056710;0.801435
1326.86;1555503425;0.852352
1333.83;1560102178;0.92197
1339.91;1565391655;0.833429
1345.18;1569534491;0.886114
1351.92;1574919618;0.953562
1357.78;1579833134;0.842219
1362.85;1585196254;0.892938
1369.37;1589629314;0.958163
1375.06;1594883802;0.969659
1380;1600510647;0.989745
1386.66;1605046408;1.03477
1392.52;1610102012;1.04854
1397.66;1614794502;1.06214
1404.05;1620327695;1.09323
1409.71;1625366861;1.09541
1414.72;1629801852;1.09692
1419.16;1634706474;1.09816
1424.98;1639999715;1.09049
1430.18;1645147036;1.08419
1436.3;1649632486;1.09443
1441.81;1654702466;1.07981
1446.76;1660190876;1.0685
1452.61;1664556500;1.07432
1457.9;1670752147;1.05975
1462.68;1674655407;1.04901
1467.01;1680597212;1.04162
1472.58;1684886475;1.0321
1477.66;1689896590;1.02603
1483.44;1695394653;1.03443
1488.73;1699529180;1.02068
1493.57;1705135356;1.01056
1499.37;1710527506;1.0172
1504.71;1715626835;1.00657
1509.61;1719573657;0.999024
1515.26;1725168885;1.00541
1520.47;1730200807;1.01319
1525.29;1734579403;1.00313
1529.73;1740485309;0.995587
1534.87;1745434904;0.985723
1539.63;1749727483;0.978306
1545.28;1755577509;0.985298
1550.53;1759836966;0.979298
1555.41;1765071198;0.975231
1560.89;1770553088;0.98207
1565.99;1775611779;0.989755
1570.74;1780479963;0.981592
1576.19;1785000105;0.985304
1581.28;1790028750;0.978389
1586.03;1794813124;0.973069
1591.45;1800430792;0.978847
1596.53;1804503834;0.971582
1601.28;1810038803;0.965773
1606.64;1815532330;0.970277
1611.67;1820566166;0.964095
1616.39;1824765390;0.959156
1621.55;1830165206;0.962643
1626.39;1834468098;0.966717
1630.95;1839488447;0.960871
1636.22;1845135866;0.965964
1641.19;1850312751;0.959142
1645.86;1854488083;0.953355
1651.03;1860080844;0.956264
1655.91;1865191942;0.950318
1660.5;1869690126;0.945241
1664.83;1875512448;0.940926
1669.7;1879911285;0.935147
1674.29;1885394536;0.930153
1680.84;1889879647;0.948067
1680.84;1894985480;0.893878
1680.84;1899605124;0.843112
1684.7;1905010204;0.834211
1687.2;1910032573;0.805676
1689.05;1915171448;0.773825
1692.83;1919740887;0.764434
1696.02;1925070498;0.744749
1698.79;1929725414;0.724043
1701.24;1935606377;0.702967
1705.34;1940169903;0.691275
1708.99;1944687792;0.678185
1715.08;1950147495;0.692277
1720.49;1955384390;0.694582
1725.24;1960059465;0.693332
1729.38;1965095261;0.688768
1751.77;1970180740;0.869416
1751.77;1975185026;0.820744
1755.19;1980565819;0.809161
1757.02;1985572170;0.76177
1758.2;1990213525;0.773669
1778.65;1995159610;0.978388
1778.65;2000494922;0.939715
1778.65;2004790684;0.914663
1782.23;2010230400;0.93207
1784.56;2015398654;0.917525
1786.27;2019678080;0.902738
1789.67;2025173073;0.909074
1792.55;2030228049;0.913421
1795.06;2034635472;0.897503
1797.27;2040548552;0.883063
1801.47;2044755214;0.864022
1805.22;2050040467;0.847367
1833.26;2055476862;1.08019
1833.26;2060518671;1.0388
1833.26;2064912624;0.814947
1833.26;2069829571;0.81495
1835.87;2075101624;0.806848
1837.78;2080625155;0.807767
1839.3;2085449916;0.811191
1842.38;2090527768;0.637358
1845.07;2095276394;0.664262
1849.62;2099861413;0.709789
1853.7;2105002423;0.714766
1857.33;2110420521;0.727907
1860.53;2115111767;0.742888
1865.5;2120420266;0.75841
1869.87;2125123865;0.773307
1875.85;2130554614;0.808017
1881.08;2135584311;0.838302
1885.63;2139851661;0.841716
1891.63;2145297978;0.864134
1896.86;2150256954;0.636028
1901.4;2154760291;0.681404
1905.33;2160122948;0.720689
1910.38;2164546629;0.771217
1914.79;2170416218;0.78924
1920.32;2174950259;0.825432
1925.18;2180219083;0.858748
1929.44;2185244382;0.870657
1934.62;2189646617;0.895516
1939.19;2194713541;0.895758
1943.24;2200144027;0.895482
1946.83;2205163213;0.895009
1958.3;2210291604;0.977612
1958.29;2214649612;0.927946
1958.29;2220421901;0.884225
1961.45;2225416191;0.856059
1963.5;2229715308;0.824209
1967.17;2235301593;0.815423
1970.1;2239483797;0.784739
1972.57;2244880181;0.757209
1976.54;2250403809;0.751467
1980.05;2255576000;0.747311
1983.17;2259682602;0.727948
1988.63;2265335809;0.738414
1993.49;2270327227;0.731699
1997.77;2274721081;0.725928
2001.5;2279767672;0.720575
2006.21;2284948784;0.7159
2010.29;2290236465;0.711009
2015.65;2294593686;0.724102
2020.31;2300520987;0.734835
2024.34;2304959973;0.660436
2027.81;2310543935;0.695177
2032.73;2315290841;0.744403
2037.01;2319732888;0.755645
2040.74;2324592460;0.772449
2045.5;2329905089;0.783362
2049.68;2334569592;0.795799
2054.87;2340088785;0.822987
2059.46;2345210501;0.829213
2063.51;2349684341;0.834604
2067.09;2355612955;0.83925
2071.48;2359987167;0.828522
2075.38;2364687684;0.818976
2080.33;2370137582;0.825655
2084.77;2375086336;0.83273
2088.75;2380184991;0.825512
2093.38;2384529637;0.830883
2097.55;2390668095;0.819021
2101.32;2395461174;0.810128
2110.44;2400142646;0.861125
2110.44;2405407551;0.826382
2110.44;2409815655;0.777151
2110.44;2415562449;0.734273
2122.03;2419966685;0.812936
2122.03;2424565843;0.765333
2125.99;2430250648;0.763278
2128.11;2435446397;0.732491
2129.48;2439878622;0.700399
2132.5;2445313990;0.689981
2134.91;2450448403;0.678233
2136.94;2454609604;0.654737
2140.75;2459985511;0.653761
2144.13;2465021158;0.638055
2147.13;2470802189;0.62369
2151.34;2475473553;0.625896
2155.07;2479700515;0.616913
2158.34;2484820215;0.607893
2163.28;2490363483;0.619589
2167.6;2495444557;0.571639
2171.36;2500262719;0.609238
2174.61;2504748095;0.641675
2177.39;2509866802;0.669494
2179.76;2515371973;0.577549
2181.78;2519835975;0.597727
2186.51;2525035614;0.6054
2190.65;2530026531;0.625649
2195.79;2535477488;0.663214
2200.3;2540372806;0.67814
2204.27;2544753365;0.693663
2207.75;2549719209;0.708155
2212.14;2554812188;0.713877
2216.02;2560233961;0.718872
2220.34;2564753386;0.732133
2224.2;2569844631;0.728605
2227.63;2574520616;0.725612
2232.04;2580284366;0.737066
2236;2585492996;0.727306
2239.56;2589923164;0.7196
2242.75;2594891680;0.713952
2246.49;2600281898;0.718883
2249.86;2604638435;0.724818
2254.04;2610130779;0.742843
2257.84;2615154988;0.760611
2261.29;2620521884;0.747786
2265.5;2624970920;0.748537
2269.35;2629970658;0.735679
2272.87;2634540763;0.72574
2282.04;2640126496;0.777913
2282.04;2645469469;0.743082
2282.03;2649853341;0.699305
2291.93;2655314306;0.759211
2291.93;2660693254;0.715921
2291.93;2664600804;0.6774
2301.09;2670015525;0.734663
2301.09;2675181436;0.690502
2301.09;2679538845;0.65089
2304.03;2685002694;0.644684
2305.93;2690138867;0.631762
2307.33;2694569570;0.608399
2308.45;2699743306;0.585863
2323.17;2704900332;0.691643
2323.17;2710283518;0.653677
2333.4;2714741004;0.721171
2333.4;2720092114;0.679031
2333.4;2724623451;0.640521
2333.4;2730520070;0.605308
2334.91;2734545164;0.529116
2336.01;2740182024;0.540203
2338.92;2744613287;0.569399
2341.38;2749776950;0.494431
2343.52;2754863293;0.515858
2360.63;2760500791;0.686987
2360.63;2765000503;0.595383
2360.63;2770015802;0.595383
2362.63;2775392259;0.615441
2363.93;2780434806;0.599104
2364.89;2784569760;0.589678
2365.65;2790097765;0.583358
2366.3;2794636606;0.578618
2366.85;2800259076;0.437139
2367.34;2805020232;0.441975
2370.59;2810092074;0.37186
2373.52;2815564046;0.401204
2378.38;2820311353;0.449774
2382.73;2825533676;0.493269
2386.58;2829991032;0.516731
2389.95;2834969532;0.539468
2393.9;2840254842;0.549866
2397.34;2844988908;0.559684
2401.72;2850526324;0.582004
2405.53;2855495765;0.4491
2408.84;2859628242;0.482205
2413.37;2865098008;0.527495
2417.33;2870055180;0.547107
2420.79;2875550924;0.56874
2424.7;2880270354;0.598307
2428.12;2884489617;0.62498
2431.13;2889854513;0.648643
2434.65;2895336746;0.678208
2437.76;2900471216;0.704379
2440.5;2905216246;0.699282
2442.92;2909649655;0.694127
2445.06;2914644933;0.666902
2446.96;2919908642;0.642306
2459.34;2925482057;0.727711
2459.34;2929601975;0.693912
2459.34;2934754579;0.654385
2466.73;2940118547;0.693967
2466.73;2945123698;0.650207
2466.73;2950439505;0.612082
2477.88;2955311517;0.690386
2477.88;2959496797;0.645105
2477.88;2965101184;0.605516
2483.97;2970508828;0.631942
2483.97;2974801879;0.592887
2483.97;2979894785;0.558626
2492.03;2985456067;0.608991
2492.03;2990517406;0.573805
2492.03;2995298903;0.542737
2492.03;3000593167;0.515297
2501.85;3004917079;0.589584
2501.85;3009861576;0.568143
2510;3015269792;0.630477
2510;3020247845;0.506987
2510;3024501838;0.506993
2511.96;3029946661;0.526712
2513.23;3034488671;0.465048
2514.17;3040330872;0.474421
2524.6;3044964173;0.578772
2524.6;3050282830;0.46728
2524.6;3054618994;0.46728
2526.95;3060194152;0.490751
2528.48;3064514809;0.445139
2529.6;3070006293;0.456364
2530.5;3074801456;0.465357
2532.36;3080248776;0.403356
2533.99;3084659073;0.419641
2535.43;3089783095;0.434029
2537.95;3094935976;0.459253
2540.21;3099937413;0.384082
2543.46;3105356194;0.41672
2546.35;3110317270;0.363928
2548.89;3114903120;0.389357
2551.1;3119864349;0.411467
2563.64;3125392838;0.516888
2563.64;3129882486;0.50419
2563.64;3135076624;0.494847
2570.18;3140295368;0.455773
2570.18;3144552201;0.455773
2572.6;3149972428;0.480014
2573.9;3154915019;0.469425
2574.74;3160336020;0.462624
2576.96;3165035508;0.473655
2578.74;3170071410;0.482448
2580.24;3175107543;0.478778
2582.64;3180581478;0.48651
2584.77;3184624660;0.493409
2586.66;3189842308;0.48707
2588.32;3195403909;0.481173
2589.77;3199646738;0.463114
2591.03;3204705655;0.446734
2594.51;3210315182;0.456225
2597.59;3215475556;0.46492
2600.28;3219977906;0.366429
2603.52;3225441172;0.398918
2606.35;3230525799;0.42723
2608.81;3235024820;0.386368
2610.93;3240114428;0.407593
2613.79;3245309885;0.411958
2616.28;3249855980;0.42397
2619.43;3255255246;0.446994
2622.19;3260217459;0.452306
2624.61;3264562773;0.458717
2626.73;3270636429;0.464933
2634.08;3275102023;0.514417
2634.08;3279802370;0.493122
2634.08;3284633610;0.47423
2640.85;3289889215;0.525275
2640.85;3294704439;0.510758
2643.46;3300258495;0.524347
2644.85;3305439393;0.5034
2645.76;3309871793;0.481722
2646.43;3315229145;0.461536
2653.45;3319625228;0.499929
2653.45;3325095589;0.471691
2660.49;3330580998;0.516818
2660.49;3334483765;0.495604
2660.49;3339918940;0.467007
2662.08;3345332787;0.458005
2663.11;3350499825;0.436839
2663.87;3355613951;0.41683
2664.48;3360451027;0.398715
2665;3364982788;0.382638
2665.44;3369489923;0.31363
2667.99;3374948666;0.339143
2670.29;3380254670;0.362136
2672.35;3384919626;0.315039
2675.01;3390320988;0.341597
2677.37;3394636219;0.339067
2679.43;3400222966;0.345849
2681.23;3405015209;0.354764
2684.03;3410247503;0.376001
2686.46;3414754460;0.330935
2688.58;3419842614;0.351952
2691.39;3424891907;0.309021
2693.83;3429960758;0.33348
2696.29;3435386101;0.358082
2698.44;3439525381;0.363563
2700.3;3444991646;0.371858
2701.91;3449752497;0.380426
2710.43;3454750663;0.459608
2710.43;3459972558;0.454488
2712.36;3464576705;0.46947
2713.39;3469763123;0.454338
2714.07;3475188800;0.438133
2714.56;3480106694;0.422556
2715.37;3485272978;0.403939
2716.05;3489570966;0.387093
2725.44;3494980239;0.46016
2725.44;3500135713;0.44219
2725.44;3505293512;0.414284
2732.17;3509681923;0.457016
2732.17;3515283313;0.435851
2732.17;3520570471;0.407769
2733.39;3525312236;0.395546
2734.18;3530453397;0.378868
2734.76;3534637045;0.363288
2736.36;3540193401;0.36065
2737.71;3545312491;0.357982
2738.89;3549833817;0.284857
2739.92;3554786197;0.295239
2741.7;3560024834;0.29368
2743.28;3564635480;0.299204
2745.83;3570087740;0.318004
2748.1;3574982936;0.335708
2750.09;3580165775;0.347416
2752.47;3585694847;0.364413
2754.55;3589801382;0.291247
2756.35;3594597664;0.309198
2757.9;3599930753;0.324663
2759.82;3604981398;0.276583
2761.47;3609646699;0.293127
2769.09;3615102030;0.369731
2769.09;3620267184;0.357518
2769.09;3624772145;0.34961
2769.08;3630465364;0.343785
2773;3634505107;0.366708
2773;3639552469;0.353264
2779.35;3644978400;0.404695
2779.35;3650066080;0.394339
2779.35;3655254010;0.376581
2780.25;3659639986;0.369684
2780.83;3664585776;0.349989
2781.26;3670006512;0.331609
2788.59;3674887116;0.38514
2788.59;3680220919;0.361353
2788.59;3684640329;0.340629
2789.53;3690068037;0.331974
2790.14;3695192807;0.322547
2790.58;3699674196;0.30777
2791.66;3705146045;0.301947
2792.56;3710190307;0.236176
2793.35;3714608647;0.244178
2794.05;3720484800;0.25123
2795.13;3724816227;0.261755
2796.08;3730109472;0.230984
2804.43;3735494930;0.314785
2804.43;3740486128;0.25089
2804.43;3744845296;0.25089
2804.43;3749748130;0.250889
2805.37;3755382250;0.251259
2806.06;3759774541;0.252347
2813.71;3765268992;0.32463
2813.71;3770259809;0.251588
2813.71;3774756358;0.251588
2814.75;3780270803;0.26197
2815.43;3785436491;0.259243
2815.93;3789961403;0.258083
2816.32;3795471647;0.257554
2816.66;3799798673;0.250226
2816.95;3804571970;0.244117
2818.62;3810038075;0.252961
2820.12;3815190145;0.26109
2821.47;3819616635;0.263755
2822.66;3825292121;0.266108
2824.35;3830314608;0.199256
2825.84;3834697572;0.214135
2827.14;3840117431;0.227135
2828.65;3845509648;0.242288
2829.96;3849724951;0.245983
2838.9;3855172318;0.328615
2838.9;3860554854;0.252594
2838.9;3864640069;0.252592
2839.91;3870035260;0.262577
2840.56;3875232217;0.258643
2841.04;3879703728;0.256669
2841.42;3884703664;0.255521
2841.76;3889797133;0.254927
2842.06;3894470041;0.254504
2842.86;3899993105;0.259499
2843.59;3905046767;0.249948
2844.23;3910296418;0.241277
2844.8;3914743557;0.233422
2845.29;3919970926;0.226363
2845.72;3924466821;0.213706
2854.29;3930030170;0.284883
2854.29;3935261912;0.271837
2854.29;3939598504;0.256601
2854.66;3945094315;0.24708
2854.9;3950244412;0.160015
2855.08;3954639825;0.161776
2855.22;3959720177;0.163188
2861.27;3965169701;0.213867
2861.27;3969619742;0.207334
2861.41;3975027341;0.203901
2861.48;3980038268;0.200785
2861.53;3984838537;0.197882
2868.57;3990237085;0.265402
2868.57;3995274993;0.25722
2868.57;3999920867;0.249918
2868.57;4004672681;0.243441
2868.42;4010099098;0.236195
2868.3;4014734101;0.23013
2868.21;4020321233;0.224998
2868.55;4024694577;0.142843
2868.86;4030092079;0.14587
2869.13;4035143235;0.148577
2870.07;4040580967;0.154523
2870.93;4045328719;0.160886
2871.7;4050062437;0.167001
2872.96;4055066451;0.177999
2874.08;4060075522;0.128183
2875.45;4065483868;0.141863
2876.66;4070445082;0.152508
2877.71;4074581168;0.162299
2878.92;4079992837;0.173927
2879.98;4085275629;0.114243
2880.89;4089756087;0.123442
2881.68;4095287394;0.131407
2882.53;4100461552;0.139734
2883.27;4105004533;0.148542
2884.46;4110425205;0.161543
2885.5;4115475491;0.172905
2886.42;4119956097;0.178683
2887.23;4125129969;0.183766
2888.24;4130284340;0.19118
2889.14;4135265106;0.190698
2890.35;4139700705;0.1943
2891.44;4144686041;0.197511
2892.41;4150087417;0.194544
2893.28;4155012301;0.191978
2893.99;4160512568;0.185427
2894.64;4164829032;0.179777
2895.46;4170338826;0.177517
2896.21;4174719473;0.172902
2896.88;4179952581;0.169141
2897.66;4185400658;0.167802
2898.36;4190533197;0.166975
2899;4195278139;0.164786
2899.58;4199689035;0.163162
2900.33;4204879773;0.158692
2901;4210289471;0.15502
2901.63;4215137196;0.152034
2902.28;4220294337;0.150557
2902.89;4224524022;0.146544
2903.62;4229907150;0.144882
2904.29;4234831100;0.13948
2904.91;4240367390;0.134829
2905.53;4244841610;0.131341
2906.11;4250174249;0.128395
2906.64;4254550868;0.126488
2907.13;4260036672;0.124992
2907.68;4265406595;0.122114
2908.18;4269791590;0.119649
2908.64;4274718914;0.117542
2909.25;4280031826;0.1159
2909.82;4285527140;0.114549
2910.49;4289908954;0.114882
2911.12;4295005311;0.115359
2911.7;4300223752;0.113819
2912.31;4304587028;0.113114
2912.87;4310523080;0.112598
2913.4;4314766299;0.111381
2913.92;4320199723;0.110617
2914.4;4324517930;0.108129
2914.86;4330039623;0.105892
2915.28;4334756595;0.103881
2915.83;4339973576;0.103066
2916.35;4345355004;0.102422
2916.83;4349826013;0.101912
2917.29;4354894891;0.10152
2917.71;4360312719;0.100326
2918.1;4365463385;0.0992625
2918.5;4370495384;0.0985812
2918.86;4374919588;0.0961261
2919.2;4379606748;0.0938717
2919.59;4384541156;0.0910495
2919.95;4389995107;0.0884377
2920.38;4395448125;0.0868715
2920.77;4400003026;0.0848097
2921.15;4405665932;0.0828908
2921.56;4410253015;0.08183
2921.95;4415485550;0.0805009
2922.32;4419951728;0.0792694
2922.66;4425375578;0.0781318
2922.95;4430412165;0.0767851
2923.22;4434820110;0.0739209
2923.47;4440029358;0.071216
2923.76;4445330654;0.0692242
2924.02;4449739116;0.0673414
2924.26;4455539469;0.065557
2924.47;4460530012;0.0636813
2924.66;4464728847;0.0616167
2924.8;4470116703;0.0594255
2924.93;4475076142;0.057372
2925.05;4480442168;0.0547285
2925.21;4484925445;0.0527639
2925.35;4490320164;0.0499175
2925.49;4494986339;0.0471955
2925.6;4499784887;0.0445975
2925.74;4504856723;0.0417976
2925.86;4510215393;0.0391167
2925.97;4514852675;0.0365526
2926.17;4520240593;0.0351394
2926.36;4524640601;0.0340717
2926.53;4530534391;0.0331326
2926.66;4534531442;0.0319546
2926.77;4539890202;0.0302773
2926.87;4545283601;0.0284937
2926.95;4550501873;0.0268532
2927.02;4555383394;0.0255674
2927.03;4560097226;0.0237593
2927.02;4565345874;0.0222241
2927.01;4569496248;0.0207825
2927.07;4574987041;0.0202663
2927.13;4580343443;0.0191895
2927.17;4585083497;0.0181736
2927.21;4590622199;0.0172202
2927.23;4594873567;0.0163236
2927.25;4599877530;0.0151485
2927.18;4605359466;0.0132478
2927.11;4610452518;0.0114342
2927.03;4614827834;0.00873078
2927.02;4620245909;0.00702715
2927;4625213507;0.00573028
2926.97;4630552954;0.004711
2926.96;4635449935;0.00387765
2926.93;4640694891;0.0017569
2926.91;4645321747;0.000442927
2926.81;4649947209;0.00274784
2926.71;4655010558;0.00364471
2926.61;4659740972;0.00454383
2926.56;4665430985;0.00501183
2926.5;4670397933;0.00626192
2926.44;4674584304;0.00745267
2926.37;4680165330;0.00857991
2926.31;4685308740;0.0096446
2926.24;4689485952;0.0106481
2926.11;4694877126;0.0119663
2925.98;4699974922;0.0124673
2925.85;4705396978;0.012939
2925.7;4709748607;0.0135697
2925.55;4714901557;0.0148661
2925.4;4720400969;0.0161102
2925.25;4724934623;0.0172977
2925.11;4730049359;0.0185411
2924.96;4735069645;0.0197359
2924.85;4740677925;0.0206122
2924.73;4744817149;0.020817
2924.62;4750282437;0.0209846
2924.5;4755462334;0.0211167
2924.35;4759904319;0.0220556
2924.21;4765498204;0.02298
2924.17;4769901668;0.0227022
2924.14;4774872229;0.0224025
2924.1;4779941963;0.0220812
2924.01;4785338064;0.0223027
2923.93;4790500837;0.0218885
2923.84;4795145658;0.0214595
2923.75;4799839582;0.0210141
2923.66;4804942827;0.0204225
2923.56;4809619929;0.0198616
2923.49;4815046668;0.0191327
2923.41;4820236001;0.0184037
2923.34;4825011309;0.0176743
2923.27;4830460760;0.0169425
2923.2;4834550327;0.0165089
2923.13;4839646520;0.016085
2923.07;4845230827;0.0156283
2923.01;4850273604;0.0152219
2922.96;4854606304;0.0143156
2922.9;4860484356;0.0134212
2922.89;4864495454;0.0132864
2922.88;4869829214;0.0131532
2922.77;4875250178;0.0139513
2922.66;4880645355;0.0140563
2922.56;4885387280;0.0141546
2922.44;4889823150;0.0145269
2922.33;4894943492;0.0148825
2922.22;4899587718;0.0154153
2922.25;4905040449;0.0143971
2922.27;4910106702;0.0131526
2922.3;4914734858;0.0119401
2922.25;4920252500;0.0115027
2922.2;4924469415;0.0111011
2922.15;4929892291;0.0107335
2922.1;4935280712;0.0104676
2922.06;4940284413;0.0102181
2922.02;4944629323;0.00998635
2921.99;4950685081;0.00976789
2921.95;4955218684;0.00950329
2921.92;4959940383;0.00972158
2921.87;4965456289;0.0101563
2921.82;4970487379;0.00960783
2921.78;4975256910;0.00910516
2921.81;4979942407;0.00766988
2921.84;4985023555;0.0063268
2921.87;4990149518;0.00509339
2921.83;4994786134;0.00439224
2921.78;5000130057;0.0047074
2921.74;5005415225;0.00540309
2921.77;5009855654;0.00534165
2921.8;5014854333;0.00451976
2921.82;5019636901;0.00372172
2921.78;5025037624;0.00371957
2921.73;5030173677;0.00382092
2921.68;5034904886;0.00404395
2921.64;5039793328;0.00436162
2921.65;5045453885;0.0038095
2921.67;5049843288;0.00302835
2921.63;5055289104;0.00295235
2921.6;5059549950;0.00269366
2921.57;5064453744;0.00251245
2921.53;5069973487;0.00251425
2921.49;5075163049;0.00319614
2921.45;5079678297;0.00397301
2921.38;5085092234;0.00519017
2921.31;5090245378;0.00599021
2921.25;5095555777;0.00697553
2921.25;5100011680;0.00712094
2921.26;5105049567;0.00682049
2921.26;5110107287;0.00658575
2921.24;5114643668;0.00690421
2921.21;5120147954;0.00662249
2921.19;5124721291;0.0063435
2921.16;5130383848;0.00607303
2921.19;5135589755;0.00504729
2921.21;5139488592;0.0049646
2921.21;5144964714;0.00521511
2921.2;5150016292;0.00479625
2921.2;5155440494;0.00439987
2921.19;5159912503;0.00403199
2921.12;5165476332;0.00449611
2921.05;5169850500;0.00497716
2921.13;5175234275;0.00437014
2921.22;5180266664;0.00373554
2921.3;5185554711;0.0036924
2921.27;5190116009;0.00280697
2921.25;5194549102;0.00255907
2921.23;5200055918;0.00234336
2921.3;5204613789;0.00192277
2921.37;5209850129;0.00167819
2921.43;5215363211;0.00222023
2921.43;5220022151;0.00250111
2921.43;5225426163;0.00293247
2921.44;5229920728;0.00270132
2921.44;5234984347;0.00247396
2921.41;5240504228;0.00234747
2921.39;5245035319;0.00223155
2921.37;5249865118;0.0021219
2921.42;5254884481;0.00267629
2921.47;5260127593;0.00438497
2921.49;5265536861;0.00548224
2921.51;5270749374;0.00553496
2921.53;5275033886;0.0057502
2921.59;5280586245;0.0065989
2921.64;5284800806;0.00684688
2921.69;5289624687;0.00715448
2921.66;5295160347;0.00634656
2921.63;5300517005;0.00482274
2921.6;5305194171;0.00333657
2921.6;5309608044;0.00275367
2921.6;5314664019;0.00265991
2921.6;5320203788;0.00256733
2921.41;5324623412;0.000720137
2921.23;5329799650;0.00216107
2921.05;5335205626;0.00403371
2920.88;5339787208;0.00590655
2920.81;5344839701;0.00648319
2920.75;5350079860;0.00771963
2920.81;5355574281;0.00805484
2920.87;5360347695;0.00785399
2920.93;5365138338;0.00767583
2920.99;5370063663;0.00751911
2921.01;5375398623;0.00779049
2921.02;5379939919;0.008063
2920.98;5385397729;0.00902248
2920.94;5390522035;0.00882108
2920.89;5395052381;0.00864488
2920.85;5399796005;0.00849443
2920.8;5404993051;0.00920375
2920.75;5409937702;0.00989341
2920.77;5415374053;0.00983421
2920.79;5420331128;0.0075695
2920.81;5424633233;0.00538518
2920.85;5430250737;0.00348164
2920.89;5434882083;0.00233574
2920.93;5440138268;0.00278973
2920.97;5444612293;0.00367345
2921.02;5449640416;0.00357337
2921.06;5454904406;0.00348297
2921.08;5460577158;0.00324745
2921.09;5464830262;0.00306504
2921.1;5470307001;0.00361582
2921.12;5475078922;0.00415835
2921.24;5480438535;0.00429014
2921.37;5484844635;0.00509529
2921.34;5490429470;0.0049651
2921.3;5494482193;0.00486762
2921.27;5499837448;0.00491888
2921.28;5505251231;0.00533285
2921.28;5510240524;0.00514943
2921.29;5514514886;0.00499956
2921.21;5519985922;0.00401805
2921.13;5524489243;0.00295682
2921.06;5529613496;0.00215919
2921.08;5535060010;0.00197983
2921.11;5540634229;0.00187224
2921.13;5544639285;0.00178388
2921.16;5550118592;0.00205811
2921.19;5555227084;0.00245775
2921.22;5559905974;0.00284598
2921.25;5564545562;0.00322035
2921.28;5570510824;0.00358348
2921.31;5574928312;0.00272236
2921.33;5579801863;0.00213737
2921.37;5584741777;0.00222719
2921.31;5590398013;0.00334068
2921.33;5595249123;0.00336312
2921.35;5600492070;0.00310542
2921.37;5605069066;0.00286329
2921.39;5610507481;0.00263757
2921.4;5615553544;0.00311459
2921.4;5620451771;0.00359219
2921.45;5624934123;0.00459163
2921.5;5629832476;0.00509951
2921.55;5635442337;0.00560727
2921.59;5640142568;0.00611231
2921.62;5645316219;0.00632819
2921.65;5649609611;0.00654486
2921.72;5655008259;0.0070338
2921.8;5659928154;0.00750857
2921.87;5665117987;0.00797259
2921.83;5670662063;0.00801802
2921.79;5675227401;0.00817851
2921.75;5680272499;0.00806345
2921.69;5684740233;0.00666835
2921.63;5690301063;0.00590382
2921.58;5694776139;0.00513853
2921.53;5700296648;0.00442353
2921.48;5704475266;0.00377363
2921.53;5709871714;0.00277511
2921.58;5715440627;0.00226319
2921.63;5719556509;0.00182385
2921.68;5724918432;0.0019631
2921.68;5730445569;0.00172021
2921.69;5735460479;0.00189175
2921.69;5740052116;0.00219955
2921.66;5745480032;0.00266559
2921.63;5750660697;0.00329469
2921.61;5754965243;0.00411683
2921.58;5760681619;0.00514816
2921.56;5765032478;0.00604044
2921.58;5770530980;0.00560181
2921.6;5775069912;0.0052067
2921.62;5780469334;0.00400614
2921.63;5785309610;0.00290367
2921.65;5789896166;0.00195495
2921.66;5795247770;0.00156828
2921.68;5800203625;0.00202556
2921.59;5804658853;0.00165559
2921.5;5809688306;0.00295428
2921.42;5815351303;0.00463521
2921.41;5819818584;0.00549828
2921.4;5824738407;0.00548499
2921.39;5830458184;0.00547036
2921.41;5834936173;0.00549604
2921.42;5840196621;0.00548456
2921.43;5845171797;0.0055003
2921.43;5849881201;0.00505394
2921.44;5854993493;0.00479939
2921.44;5860037334;0.00455867
2921.36;5864749561;0.00422328
2921.27;5869647862;0.00428219
2921.19;5874573844;0.004689
2921.28;5880005034;0.00359489
2921.36;5885503453;0.00295748
2921.43;5889956418;0.00299913
2921.49;5895569014;0.00346067
2921.55;5900546723;0.00353005
2921.5;5904981858;0.00278003
2921.45;5910589676;0.00208618
2921.39;5915149586;0.000833086
2921.34;5920138471;0.000688313
2921.39;5924669113;0.000459661
2921.43;5929727040;0.000407813
2921.47;5935371795;0.000554688
2921.53;5939880210;0.000999687
2921.58;5945450320;0.00164501
2921.5;5949860542;0.0011162
2921.43;5955265000;0.00114524
2921.35;5959925228;0.000690712
2921.33;5964538345;0.00189008
2921.32;5970053710;0.00312371
2921.3;5975501694;0.00455277
2921.31;5979904442;0.00506967
2921.33;5985339046;0.00539747
2921.34;5989472521;0.00575043
2921.4;5994872939;0.00570338
2921.45;6000367565;0.00412364
2921.51;6005587495;0.00281265
2921.5;6010033115;0.0020678
2921.49;6015510534;0.00166725
2921.48;6020246796;0.00142799
2921.52;6024640733;0.00107356
2921.57;6030049685;0.00107495
2921.62;6035150941;0.00126634
2921.66;6039960486;0.001706
2921.77;6044589797;0.00276288
2921.87;6049742319;0.00442978
2921.97;6055378498;0.00618769
2922.04;6059765879;0.00707467
2922.1;6064768147;0.00810064
2922.17;6070379823;0.00919987
2922.21;6075312126;0.00957759
2922.26;6079528374;0.0099421
2922.39;6085077374;0.0111956
2922.52;6090503688;0.0118912
2922.64;6094703983;0.0125615
2919.28;6100311119;0.0223226
2919.28;6104892605;0.0222162
2919.28;6110044805;0.0221115
2919.28;6114747444;0.0220092
2919.63;6120266414;0.0191129
2919.89;6124682042;0.0172368
2920.1;6130102735;0.0159571
2920.27;6135512735;0.0150755
2920.42;6140068740;0.014607
2920.73;6145475257;0.011935
2921.01;6149903386;0.00977001
2921.25;6155165144;0.00787211
2921.46;6160037869;0.0065169
2921.34;6164619401;0.00876088
2921.21;6170002114;0.0107434
2921.41;6175487615;0.00850632
2921.58;6180008585;0.00956137
2921.73;6184736308;0.0120334
2921.82;6190290932;0.0126056
2921.9;6194807056;0.026528
2921.97;6199975417;0.0271852
2922.02;6204575999;0.0277345
2921.98;6210055348;0.0269897
2921.93;6214969183;0.0230562
2921.9;6220382210;0.0201447
2921.86;6224773376;0.0177716
2921.83;6229648131;0.0157451
2921.8;6235076506;0.0139735
2921.77;6240275036;0.0104151
2921.74;6244686969;0.00748357
2921.72;6250114937;0.00544028
2921.58;6255625296;0.0051089
2921.45;6260200750;0.00735073
2921.38;6264852148;0.00763724
2921.31;6270248827;0.0022214
2921.25;6275134917;0.00443953
2921.4;6279702664;0.00847538
2921.53;6285136948;0.00948773
2921.65;6290192423;0.0104362
2921.76;6294863948;0.0113205
2921.74;6300297815;0.0122914
2921.71;6305482708;0.010129
2921.54;6309906776;0.00778574
2921.38;6315545095;0.00817496
2921.23;6320436266;0.00869492
2921.12;6324955193;0.00959978
2921.02;6330376136;0.010443
2920.93;6335501824;0.011223
2921.05;6340142766;0.00981745
2921.17;6344751842;0.00855499
2921.28;6349788286;0.00761261
2921.38;6355306617;0.00742179
2921.3;6359981665;0.00615854
2921.24;6364516548;0.00500638
