Distance;Time;Velocity Kalman
0;132687;2.25913e-05
0.000136479;5495878;2.31934e-05
0.000251654;9920263;2.31934e-05
0.000371262;15159661;2.31934e-05
0.000492081;20612430;2.31934e-05
0.000674155;25023098;2.44141e-05
0.000795801;30087823;2.44141e-05
0.00091756;35522834;2.44141e-05
0.00103939;40037866;2.44141e-05
0.00116127;45139104;2.44141e-05
0.00128319;51018091;2.44217e-05
0.00140513;55118373;2.44217e-05
0.0015271;60780145;2.44217e-05
0.00164908;65351920;2.38115e-05
0.00177107;70814167;2.38115e-05
0.00189307;75299915;2.38115e-05
0.00201508;80679558;2.38115e-05
0.0021371;85219558;2.38115e-05
0.00225913;90605632;2.32014e-05
0.00232014;95728419;2.32014e-05
0.00244217;100177044;2.31934e-05
0.00250319;105484262;2.2583e-05
0.00262522;110034855;2.2583e-05
0.00268624;115339986;2.19727e-05
0.00280828;120767665;2.13623e-05
0.0028693;125139085;2.0752e-05
0.00299135;129769454;2.0752e-05
0.00305237;135352519;2.01416e-05
0.00317441;140716428;2.01416e-05
0.00323717;145176938;1.95408e-05
0.00335915;150655219;1.95408e-05
0.00342015;155096239;1.89307e-05
0.00348114;159946844;1.83207e-05
0.00360314;165628617;1.83207e-05
0.00366414;170327887;1.77107e-05
0.00372515;175821218;1.71007e-05
0.00378615;180722174;1.64908e-05
0.00384715;185309176;1.58809e-05
0.00396916;189871791;1.64908e-05
0.00403017;195178869;1.58809e-05
0.00409118;200635392;1.58809e-05
0.00415219;205032664;1.5271e-05
0.00421319;210721145;1.5271e-05
0.0042742;215219430;1.46611e-05
0.0042742;220778619;1.40513e-05
0.00433521;225292049;1.34416e-05
0.00439623;230816347;1.34416e-05
0.00445724;235422602;1.28319e-05
0.00451825;240741662;1.28174e-05
0.00451825;245408929;1.15967e-05
0.00457926;250048714;1.15967e-05
0.00464028;255529876;1.15967e-05
0.00464028;260214342;1.0376e-05
0.00470129;265066075;1.0376e-05
0.00476231;270497107;1.0376e-05
0.00476231;274824896;9.76562e-06
0.00482525;279918410;9.78468e-06
0.00482525;285308454;8.56669e-06
0.00488624;290860122;8.56669e-06
0.00488624;295417604;7.95801e-06
0.00494724;300036352;7.95801e-06
0.00494724;305334335;7.34961e-06
0.00494724;310830351;6.74155e-06
0.00500823;314969478;7.34961e-06
0.00500823;320273013;6.74155e-06
0.00500823;325584746;6.13396e-06
0.00500823;330612455;5.52697e-06
0.00500823;335194097;4.92081e-06
0.00500823;340571949;4.92081e-06
0.00506923;344976809;4.92081e-06
0.00506923;350357082;4.31584e-06
0.00506923;355896298;4.31584e-06
0.00506923;360233997;3.71262e-06
0.00506923;365616238;3.11219e-06
0.00513022;370054396;3.71262e-06
0.00513022;375557191;3.05176e-06
0.00513022;380637221;3.05176e-06
0.00513022;385332763;2.44141e-06
0.00513022;390748063;2.44141e-06
0.00513022;394914923;1.83105e-06
0.00513022;400300515;1.83105e-06
0.00513022;405697992;1.83105e-06
0.00513022;410227778;1.2207e-06
0.00513022;415241582;1.2207e-06
1.14799;420619867;0.0115299
2.27071;425047753;0.0227571
3.36297;430778571;0.0336797
5.44258;435345651;0.0544758
7.46499;440637339;0.0747006
9.43058;444838421;0.0943565
12.227;450354372;0.122321
14.9438;455004234;0.149488
17.5811;460404418;0.175862
20.1398;465729276;0.201449
23.4688;470426176;0.234739
26.6978;475857870;0.26703
29.8276;480204215;0.298327
33.6985;485586100;0.337037
37.4498;490083311;0.37455
41.0827;495453700;0.410878
45.4283;500848912;0.454334
49.6359;505192173;0.496411
53.7069;510689862;0.537121
57.6428;515816444;0.564948
62.2662;520171248;0.599955
66.736;525569840;0.63373
71.0542;530080700;0.656117
76.0345;535520883;0.685695
80.8456;539965543;0.71415
85.4898;545878094;0.732627
90.7719;550425810;0.758281
95.8705;555933781;0.782894
100.788;559972994;0.806484
106.321;565484677;0.82852
111.657;569971263;0.849591
116.799;575333883;0.869718
121.751;580422105;0.880526
127.3;585791981;0.898497
132.643;590291952;0.9156
137.784;594916858;0.923557
143.502;600381745;0.938659
149.004;605789200;0.952974
154.295;610393733;0.966522
160.143;615344606;0.978771
165.767;620815527;0.99031
171.17;625245211;1.00116
176.357;630096268;1.00322
182.087;635790432;1.01242
187.59;640111714;1.021
192.868;644877828;1.02096
198.674;650299890;1.02804
204.245;655792076;1.03457
209.586;660123386;1.03265
215.439;665578646;1.03782
221.051;670102734;1.04252
226.427;675491640;1.04676
231.573;680670257;1.04273
237.22;685054003;1.04578
242.628;690616980;1.04844
247.8;695057316;1.04298
252.742;700530402;1.03738
258.178;704846102;1.03883
263.375;710335822;1.03232
268.339;715494087;1.02572
273.784;719939829;1.02614
278.987;725258865;1.0263
283.954;730285284;1.01867
289.391;735845679;1.01801
294.584;740196763;1.01716
299.538;745575548;1.00864
304.951;750100688;1.00705
310.118;755665398;1.00532
315.045;759975445;0.996061
320.42;765366303;0.99369
325.548;770775304;0.99121
330.435;775499222;0.988629
335.087;780210208;0.978668
340.183;785689490;0.975552
345.037;790135914;0.972373
349.656;795789212;0.969141
354.709;800333757;0.96531
359.521;805689857;0.961453
364.096;810230507;0.957579
368.443;815248795;0.946587
373.22;820712227;0.942327
377.762;825138687;0.938081
382.075;830175008;0.926843
386.811;835643617;0.92227
391.312;839993315;0.91774
395.584;845800955;0.906337
400.271;850535263;0.901533
404.724;855558633;0.896797
408.95;860165422;0.885303
412.955;865495489;0.874063
417.371;870183569;0.869354
421.561;875609119;0.864737
425.531;880802612;0.853477
429.905;885222572;0.848673
434.054;890591185;0.843979
437.984;894923159;0.832752
442.311;900478488;0.827903
446.414;904794831;0.82318
450.301;910337689;0.818583
453.976;915468696;0.807561
458.046;919914096;0.802836
461.9;925481186;0.798249
466.136;930222820;0.793248
470.152;935227566;0.788399
473.955;940717874;0.783701
477.55;945190009;0.772785
481.524;950793205;0.767999
485.288;955395429;0.763373
488.845;960067268;0.758906
492.775;965586992;0.754042
496.496;970096463;0.749347
500.013;975546616;0.744819
503.332;980705926;0.734272
507.022;985083091;0.72968
510.51;990441270;0.725261
513.803;995553885;0.714922
517.459;1000093703;0.710449
520.916;1005522689;0.706154
524.18;1010206651;0.702035
527.799;1015108657;0.697535
531.222;1020511278;0.693218
534.453;1025050348;0.683175
537.498;1030390476;0.673464
540.898;1034996053;0.669433
544.108;1040277938;0.665585
547.134;1045564176;0.656102
550.508;1050014804;0.652207
553.695;1055499885;0.648496
556.699;1060759762;0.639244
560.044;1065224917;0.635486
563.204;1070672725;0.631914
566.184;1075172934;0.628523
568.99;1080452557;0.619678
572.133;1085778460;0.61623
575.099;1090392591;0.612962
577.893;1095012488;0.604334
580.519;1100785439;0.596023
583.481;1105210675;0.593009
586.272;1110666992;0.584725
588.898;1115333182;0.576756
591.852;1120600208;0.573987
594.637;1125041965;0.571392
597.259;1130032153;0.563614
600.202;1135423778;0.56094
602.978;1140723414;0.558438
605.593;1145701817;0.550843
608.52;1150246188;0.548255
611.283;1155726087;0.545838
613.886;1159879974;0.538419
616.795;1165274230;0.53591
619.541;1170851018;0.533571
622.129;1175756146;0.531394
624.563;1180092402;0.5243
627.301;1185571264;0.522014
629.882;1190035387;0.51989
632.311;1195519735;0.517923
635.036;1199961441;0.515553
637.606;1205816799;0.513343
640.026;1210844592;0.511288
642.301;1214997201;0.504491
644.434;1220774764;0.497968
646.431;1225329737;0.491713
648.728;1230709187;0.485261
650.886;1235419393;0.479078
652.909;1239944037;0.47316
654.8;1245434078;0.462794
656.988;1250058049;0.457051
659.043;1255528922;0.451568
660.968;1260072825;0.441724
663.182;1265869910;0.436403
665.263;1270759319;0.431336
667.215;1274925275;0.426516
669.448;1280448512;0.421477
671.55;1285792960;0.416685
673.524;1290296114;0.412134
675.375;1295010412;0.403388
677.502;1300462866;0.398957
679.502;1304822041;0.39476
681.38;1310262840;0.390791
683.526;1315341864;0.390922
685.547;1320050264;0.391166
687.825;1325383164;0.390963
689.974;1330900151;0.390877
691.998;1335422710;0.3909
693.902;1340167916;0.391027
696.058;1345290623;0.390699
698.091;1350736315;0.390479
700.004;1355940054;0.390362
702.16;1360793296;0.389789
704.195;1365374187;0.389324
706.111;1370849108;0.38896
708.262;1375069355;0.38814
710.293;1379876099;0.387428
712.206;1385343644;0.386819
714.005;1390738311;0.386308
716.036;1395143502;0.385338
717.95;1400376744;0.384472
720.083;1404874731;0.387031
722.098;1410560257;0.38572
723.999;1415381252;0.384516
725.788;1420443742;0.37963
727.791;1425195707;0.378175
729.681;1430612145;0.37683
731.461;1434809369;0.37559
733.448;1440217926;0.3739
735.323;1445579188;0.372323
737.089;1450771958;0.370855
739.054;1455339943;0.36894
740.909;1459901786;0.367141
742.656;1465303301;0.365456
744.595;1470882692;0.363327
746.425;1475467149;0.361319
748.149;1479849729;0.359429
749.771;1485866444;0.357652
751.579;1490373950;0.355432
753.283;1495419926;0.353334
754.886;1500658905;0.34803
756.668;1505066651;0.3457
758.348;1510476621;0.343495
759.929;1515092546;0.341413
761.681;1520444792;0.338897
763.333;1525805966;0.336511
764.887;1530301388;0.334252
766.346;1535059366;0.328975
767.972;1540417714;0.326488
769.502;1545890978;0.324132
770.94;1550463179;0.318856
772.537;1555988115;0.316278
774.04;1560344278;0.313835
775.452;1565144050;0.308568
777.016;1570580166;0.305909
778.488;1575152692;0.303388
779.871;1579979193;0.301002
781.398;1585362040;0.298194
782.836;1590751545;0.295527
784.186;1595687470;0.293
785.674;1600192226;0.290053
787.074;1605549462;0.287252
788.388;1610082356;0.284593
789.62;1615030379;0.279393
790.985;1620403313;0.276524
792.267;1625740894;0.273801
793.468;1630259051;0.271219
794.794;1635644098;0.268222
796.04;1639984216;0.265373
797.207;1645116339;0.262669
798.492;1650837263;0.259553
799.699;1655696776;0.256589
800.829;1660381502;0.253773
801.886;1665094610;0.248699
803.056;1670569813;0.245678
804.152;1675054371;0.242808
805.176;1680421297;0.237776
806.306;1685805817;0.234705
807.365;1690299568;0.231788
808.354;1694953856;0.226803
809.442;1700440183;0.223688
810.461;1705778501;0.22073
811.413;1710279825;0.217924
812.299;1715032215;0.213141
813.28;1720404745;0.210131
814.195;1724905367;0.207277
815.048;1730206722;0.20254
815.988;1735821620;0.199484
816.865;1740354517;0.196585
817.682;1745576882;0.191898
818.579;1749973486;0.1888
819.416;1755441317;0.185862
820.194;1759990890;0.183078
821.045;1765567232;0.179893
821.839;1770023187;0.176869
822.576;1775415614;0.174002
823.259;1780453459;0.16953
824.011;1785836779;0.166459
824.709;1790330708;0.163546
825.355;1795031536;0.159124
826.062;1800559554;0.156007
826.718;1804986396;0.153053
827.325;1810278164;0.150255
827.985;1814897461;0.147056
828.597;1820300334;0.14402
829.162;1825718395;0.141143
829.682;1830015477;0.13694
830.251;1835786037;0.133853
830.775;1840154212;0.130927
831.256;1845431095;0.126768
831.779;1850471967;0.123634
832.26;1855234084;0.120661
832.7;1859840517;0.11655
833.176;1865334475;0.113371
833.611;1870694411;0.110355
834.009;1875286823;0.107498
834.37;1880643725;0.103593
834.761;1884973824;0.100521
835.116;1890435745;0.0976103
835.436;1894853231;0.0937444
835.78;1900554753;0.0906192
836.09;1904918132;0.0876569
836.369;1910433611;0.0838331
836.617;1915589748;0.0801904
836.882;1919954213;0.0771909
837.117;1925277624;0.074351
837.325;1930379496;0.0707395
837.543;1934910590;0.067678
837.734;1940266748;0.064778
837.899;1945434440;0.0611995
838.068;1950360966;0.0580781
838.212;1955060278;0.0551197
838.333;1960773917;0.0515767
838.451;1965277565;0.0483973
838.547;1970710517;0.0453829
838.623;1975294124;0.042528
838.679;1979911181;0.0391782
838.724;1985333917;0.0360823
838.751;1990734622;0.0331486
838.761;1994873755;0.0298138
838.755;2000389545;0.0266468
838.733;2005733872;0.0236435
838.696;2010201962;0.0207993
838.646;2014956996;0.0176437
838.582;2020295071;0.0146511
838.506;2025856194;0.011817
838.419;2030030013;0.00876272
838.32;2035794405;0.00586842
838.212;2040129413;0.00312976
838.094;2044928027;0.000260028
837.967;2050733394;0.00245513
837.831;2055391104;0.00501998
837.688;2060757457;0.00762877
837.538;2065320919;0.0100911
837.382;2070670842;0.0124104
837.219;2075191152;0.0145916
837.052;2080033342;0.016724
836.879;2085412393;0.0187241
836.702;2090746918;0.020596
836.521;2095409050;0.0223435
836.336;2099980396;0.0239708
836.148;2105289743;0.0254819
835.958;2110630563;0.0268807
835.765;2115306566;0.0281709
835.571;2120639245;0.0293564
835.375;2125307094;0.0304413
835.178;2130148449;0.0314289
834.979;2135673584;0.0323231
834.781;2140031365;0.033127
834.582;2144882259;0.0338449
834.383;2150394025;0.03448
834.185;2155139428;0.0350355
833.987;2159727747;0.0355148
833.79;2165221868;0.0359213
833.594;2170579597;0.0362577
833.399;2175100773;0.036528
833.205;2180041015;0.0367347
833.014;2185366432;0.0368808
832.824;2190672113;0.0369692
832.636;2195394974;0.0370031
832.45;2200920737;0.0369848
832.266;2205552471;0.036917
832.085;2210447883;0.0368029
831.906;2215032863;0.0366446
831.73;2220493560;0.0364447
831.557;2225368016;0.0362056
831.387;2230633007;0.0359294
831.219;2235200168;0.035619
831.054;2240502490;0.035276
830.893;2245639352;0.0349026
830.735;2250072269;0.0345011
830.58;2255633457;0.0340734
830.428;2259950552;0.0336212
830.279;2265413474;0.0331471
830.134;2270893279;0.0326518
829.992;2275791104;0.032138
829.853;2280408621;0.0316068
829.718;2285713778;0.0310602
829.586;2290356033;0.0304994
829.457;2295388989;0.0299259
829.332;2300860055;0.0293417
829.21;2305189207;0.0287473
829.092;2310650506;0.0281445
828.977;2315227233;0.0275344
828.865;2320618438;0.0269183
828.757;2325135486;0.0262975
828.652;2330063700;0.0256729
828.55;2335454329;0.0250454
828.451;2340860235;0.0244163
828.356;2345662148;0.0237864
828.264;2350573921;0.0231564
828.175;2355117883;0.0225276
828.089;2360322856;0.0219003
828.006;2365722423;0.0212758
827.926;2370166741;0.0206543
827.849;2375769835;0.0200369
827.775;2380660862;0.0194239
827.704;2385008492;0.0188161
827.636;2390352901;0.0182141
827.57;2394958112;0.0176182
827.507;2400472053;0.0170291
827.447;2405762394;0.0164471
827.39;2410352629;0.0158728
827.335;2414907917;0.0153065
827.282;2420232387;0.0147483
827.232;2425405813;0.0141988
827.184;2429865918;0.0136585
827.139;2435254994;0.0131275
827.095;2440583250;0.0126057
827.054;2445676204;0.0120939
827.016;2450713637;0.0115919
826.979;2455514239;0.0111001
826.944;2460125933;0.0106183
826.911;2465691885;0.0101471
826.881;2470094107;0.00968594
826.852;2475494553;0.00923578
826.824;2479933755;0.00879599
826.799;2485284529;0.00836705
826.775;2490668295;0.00794862
826.753;2495274413;0.00754104
826.733;2500687900;0.00714413
826.714;2505045651;0.0067579
826.696;2510406231;0.00638236
826.68;2514989586;0.00601766
826.665;2520289422;0.00566348
826.652;2525966610;0.00531969
826.64;2529966189;0.00498641
826.629;2535507604;0.00466367
826.619;2539964664;0.00435069
826.611;2545189309;0.00404855
826.603;2550651191;0.00375601
826.597;2555272973;0.00347357
826.591;2560309856;0.00320088
826.587;2565304043;0.0029381
826.583;2570390472;0.00268449
826.58;2575037360;0.00244049
826.578;2580635542;0.00220563
826.577;2585279065;0.00197994
826.577;2589976047;0.0017631
826.577;2594850118;0.00155511
826.578;2600437744;0.00135568
826.58;2605776662;0.00116478
826.582;2610189024;0.000981965
826.585;2615751895;0.000807242
