Distance;Time;Velocity Kalman
0;706564;0.0018776
0.0562054;5910947;0.00473367
0.213868;10326981;0.00961529
0.4231;15713946;0.0138753
0.607283;19972633;0.0175358
1.1331;25406827;0.00413772
2.65097;29860996;0.011936
4.00509;35135582;0.0247082
3.58531;40740056;0.0209813
3.21018;45216407;0.0212665
2.8776;50448376;0.0206337
2.77404;55708876;0.0214996
2.68396;60481858;0.0218136
2.6041;64887416;0.0220588
2.53401;70218115;0.0222762
3.26045;75571609;0.0306705
3.92526;80173105;0.0387567
3.77932;85653655;0.03877
3.64729;90800143;0.0369765
3.52789;95544770;0.0352789
2.323;101079590;0.0227319
2.323;105406214;0.023068
2.323;110541278;0.0235732
2.29586;115765815;0.0233307
2.28965;120149326;0.0225957
2.29093;125062899;0.0323805
1.99702;130481077;0.0531132
1.99702;135903175;0.0486088
1.99702;139952927;0.0445183
1.9387;145587499;0.0392975
1.90856;150001227;0.0367966
1.88957;155912494;0.0346892
1.93854;160460151;0.0332065
1.98251;165560852;0.0318754
2.0216;170591234;0.0389862
1.83562;175062304;0.0249712
1.83562;180692228;0.0231694
1.83562;184877374;0.0215215
1.605;190316444;0.0214374
1.45696;195570257;0.0135495
1.34774;200202159;0.0141794
1.10832;205773002;0.0135366
0.963851;210295350;0.0137021
0.904097;215890354;0.0138559
0.932746;220483526;0.0177985
0.932746;225897955;0.0108241
0.932746;230281666;0.0108241
0.943629;235755552;0.0115641
0.970881;240753669;0.0122813
1.00026;245482491;0.0131392
0.838005;250963615;0.0147206
0.838005;255362107;0.0154479
0.838005;260404411;0.0160784
0.725463;265875710;0.0168084
0.652333;270357772;0.022093
0.598579;275253499;0.0216869
0.221034;280604578;0.0177389
0.366902;285033237;0.0124467
0.6856;290281694;0.00881977
2.17686;295724882;0.0118072
3.52491;301477248;0.027941
4.7357;304902007;0.0427956
4.75924;310442833;0.0456133
4.75255;315372106;0.0529609
4.72225;320418258;0.0526401
7.88015;325205806;0.0850446
5.01629;330448036;0.057581
3.98541;335564783;0.0480466
3.63129;340086729;0.0451537
3.3979;344924941;0.0416752
3.22377;350892592;0.0399279
1.86788;355469356;0.0253016
1.86788;360475207;0.0242887
1.86788;365708585;0.0236371
1.5543;370474736;0.0198379
1.35719;374862967;0.0133295
1.21665;380078073;0.00852282
1.1025;385516306;0.00417026
1.1025;390830931;0.0107964
1.1025;395616237;0.0242788
0.748725;399988667;0.04041
0.574239;405042537;0.0432709
0.508355;410000613;0.0451337
0.520875;415427665;0.0458006
0.548487;420893366;0.0788954
0.583006;425054448;0.0508571
1.48933;430502446;0.0262748
2.72753;435833912;0.0101299
3.87911;440835109;0.00554206
2.01056;445402712;0.0179974
2.01056;450931285;0.0161783
2.01056;455584995;0.0161783
0.829007;460094447;0.0185606
0.829007;465520094;0.0163576
0.829007;470559904;0.0151614
0.666909;475185033;0.0157678
0.63781;480063781;0.0142271
0.66212;485136277;0.0154774
0.705381;490629625;0.0160741
0.743853;495150924;0.0141025
0.777491;499945877;0.0133667
0.929078;505393038;0.0140093
1.16099;510492916;0.0153
1.4092;515354385;0.0166943
1.64678;520858206;0.0180722
1.86406;524964599;0.0332564
2.05797;530925511;0.0477765
14.0439;535700202;0.160119
26.023;540926597;0.256009
36.7086;545741385;0.362198
55.0113;550212553;0.545019
71.2072;555851484;0.70645
85.4868;560734358;0.84924
106.547;565124398;1.05986
125.149;569970580;1.24544
141.561;575063812;1.40927
164.016;580578252;1.63361
183.919;586067247;1.83227
201.558;589939448;2.00836
225.317;595657333;2.24569
246.499;600631725;2.45784
265.395;605165578;2.6471
289.301;610638894;2.88646
310.748;615051442;3.1012
330.004;619864235;3.294
353.484;625914797;3.529
374.677;630842554;3.60674
393.822;635065052;3.678
416.998;640534434;3.80294
438.04;645787311;3.83039
457.159;650733531;3.85968
479.584;655472632;3.94118
500.051;660331234;3.93522
518.743;665003508;3.9361
540.511;670426226;3.98967
560.474;675497194;3.96472
578.792;680225980;3.94885
600.147;685680324;3.98599
619.817;689904389;3.9451
637.943;694999482;3.91454
658.87;700775205;3.93485
678.221;705401233;3.88932
696.121;710702993;3.85388
716.342;715136200;3.86357
735.101;720385051;3.81638
752.508;725487227;3.77853
772.451;730862662;3.78651
791.011;734990912;3.74036
808.284;740269918;3.70268
827.987;745811915;3.7085
846.374;750992265;3.66814
863.533;755644256;3.63508
882.718;760060403;3.64005
900.662;765291466;3.60183
917.443;770864334;3.57004
933.132;775281645;3.54378
947.794;780802941;3.47685
961.488;785901509;3.41709
980.033;790513310;3.42126
997.449;795812203;3.38614
1013.8;800709525;3.35613
1031.91;805405090;3.35821
1048.94;810391240;3.32629
1064.95;815028345;3.29877
1082.77;820454973;3.3029
1099.56;825560830;3.27131
1115.35;830628841;3.24366
1130.21;835164204;3.21948
1144.17;840423002;3.16207
1157.28;845201608;3.10926
1174.47;850756269;3.10961
1190.7;855025268;3.08002
1206;860742455;3.05358
1222.95;865386425;3.05522
1238.96;870729035;3.05838
1254.06;875720956;3.0628
1270.45;880222599;3.08969
1285.93;885585291;3.05904
1300.54;890711294;3.03097
1316.62;895087574;3.02832
1331.83;900086507;2.99928
1346.18;904980395;2.97251
1361.88;910479413;2.96943
1376.73;915610909;2.93964
1390.74;920224977;2.91195
1406.13;925635977;2.9079
1420.69;930183451;2.90486
1434.43;935294789;2.90267
1449.47;940773157;2.922
1463.69;945921493;2.89224
1477.11;950232052;2.86421
1492.02;955811562;2.8603
1506.12;960008692;2.83184
1519.44;965901534;2.80496
1534.09;970357335;2.80039
1547.94;975780557;2.77508
1561.03;980899674;2.75113
1575.37;985316330;2.74843
1588.93;990598838;2.72316
1601.73;995332075;2.69915
1616;1000865638;2.69825
1629.49;1005145538;2.67615
1642.23;1009984931;2.65516
1656.55;1015642252;2.65813
1670.09;1020715966;2.63966
1682.89;1025921227;2.62213
1696.98;1030572064;2.62556
1710.31;1035758617;2.60846
1722.9;1040576466;2.59221
1736.69;1045052898;2.59591
1749.74;1050075707;2.5773
1762.07;1055804230;2.55955
1775.84;1060347871;2.5641
1788.88;1065341242;2.54796
1801.19;1070039033;2.53257
1814.96;1075716518;2.53939
1827.99;1080999925;2.52632
1840.31;1085153529;2.5139
1853.96;1090508118;2.5224
1866.89;1095293382;2.50901
1879.1;1100279273;2.49625
1892.7;1104958203;2.50478
1905.58;1110305344;2.49039
1917.75;1115540765;2.47664
1931.32;1121025123;2.48435
1944.17;1125686310;2.47202
1956.32;1130239613;2.46026
1969.81;1135519659;2.46918
1982.58;1140513515;2.45894
1994.65;1145936092;2.44919
2008.12;1150508042;2.46057
2020.87;1155834819;2.45038
2032.93;1160760507;2.44066
2046.28;1165139209;2.45091
2058.91;1170022167;2.43959
2070.86;1175100391;2.42878
2084.14;1180756419;2.43842
2096.72;1185841984;2.4277
2108.62;1190016734;2.41743
2121.97;1195472337;2.42868
2134.61;1200324760;2.41912
2146.57;1205670669;2.40999
2159.9;1210039817;2.42163
2172.54;1215533970;2.41231
2184.5;1220562146;2.4034
2197.8;1225252158;2.4148
2210.39;1230591853;2.40593
2222.32;1235793399;2.39746
2233.59;1240132162;2.38938
2244.22;1244925955;2.36102
2254.23;1250882674;2.33358
2267.79;1255555238;2.34858
2280.66;1260729022;2.34387
2292.86;1265109324;2.33948
2306.4;1270425635;2.3554
2319.25;1275123027;2.3511
2331.43;1280645590;2.34707
2344.97;1284996194;2.36346
2357.82;1289990158;2.35853
2369.99;1295437771;2.35388
2383.45;1300896258;2.36881
2396.22;1305765902;2.36313
2408.31;1310505050;2.35773
2421.62;1315922799;2.3712
2434.25;1320721645;2.36452
2446.21;1325412747;2.35814
2459.57;1330655574;2.37256
2472.26;1335732108;2.38672
2484.28;1340334706;2.40061
2497.63;1345702450;2.43407
2510.31;1350015312;2.42519
2522.32;1355518466;2.41661
2535.68;1360740585;2.42826
2548.36;1365363537;2.41963
2560.38;1370333456;2.41129
2573.77;1375675465;2.42338
2586.47;1380285442;2.41506
2598.52;1385391622;2.40702
2611.86;1390157113;2.41869
2624.53;1395876065;2.4108
2636.53;1400520683;2.40316
2649.96;1405331228;2.41652
2662.72;1410325683;2.41099
2674.81;1415777565;2.40565
2688.08;1420120855;2.41878
2700.68;1424973271;2.4111
2712.62;1430638236;2.40366
2725.98;1435953322;2.41706
2738.66;1440048210;2.41031
2750.68;1445026886;2.40378
2763.93;1450359353;2.41617
2776.51;1455379618;2.40833
2788.43;1459974780;2.40074
2801.79;1465288362;2.41409
2814.46;1470183981;2.40699
2826.48;1475608485;2.40012
2837.86;1480384998;2.39347
2848.62;1485834723;2.36759
2858.77;1490078091;2.34243
2872.28;1495592013;2.35753
2885.12;1500929006;2.35156
2897.3;1505678473;2.34582
2910.76;1510171416;2.35952
2923.55;1515137317;2.35466
2935.68;1520517070;2.34998
2948.98;1524991886;2.36358
2961.61;1529881101;2.35628
2973.58;1535301864;2.34923
2986.97;1540775619;2.3629
2999.69;1545224254;2.35757
3011.75;1550211259;2.35242
3023.18;1555873156;2.34746
3033.98;1559889381;2.32197
3044.18;1565608710;2.29721
3057.66;1570267236;2.31182
3070.47;1575227291;2.32613
3082.63;1580919318;2.34014
3096.02;1585384433;2.37255
3108.74;1590111396;2.36464
3120.82;1595255146;2.35697
3132.25;1600827270;2.34953
3143.07;1604990205;2.3231
3153.29;1610790601;2.29741
3162.92;1615230854;2.27245
3171.99;1620316655;2.23014
3180.51;1625348495;2.18903
3194.22;1630106372;2.20636
3207.26;1635379254;2.20288
3219.65;1640312426;2.19962
3233.34;1645804192;2.21584
3246.35;1650868863;2.23176
3258.72;1655808794;2.24735
3272.33;1660323576;2.28147
3285.27;1665394754;2.27611
3297.57;1670532199;2.27095
3311.19;1675022747;2.28556
3324.13;1680917424;2.28112
3336.43;1685310947;2.27686
3350.03;1690724086;2.29214
3362.96;1695737946;2.30707
3375.23;1700781897;2.32165
3388.74;1705240816;2.3545
3401.57;1710309038;2.38651
3413.76;1715874718;2.41767
3427.19;1720576300;2.46678
3439.95;1725800827;2.4573
3452.06;1730719349;2.44799
3465.43;1735448418;2.45775
3478.13;1740100460;2.44791
3490.18;1745242421;2.43827
3503.38;1750984782;2.44667
3515.92;1755245395;2.43597
3527.82;1760641272;2.42549
3540.96;1765295113;2.43398
3553.44;1770343295;2.42263
3565.28;1775168769;2.41153
3578.38;1780653832;2.4195
3590.81;1785108072;2.40784
3602.6;1790001793;2.39647
3615.68;1795889624;2.40448
3628.1;1800300038;2.39363
3639.87;1805527467;2.38304
3652.99;1810073639;2.39237
3665.45;1815329629;2.38266
3677.26;1820836416;2.3732
3690.21;1825514087;2.38156
3702.51;1830741419;2.37083
3714.16;1835857782;2.36037
3727;1840454691;2.3682
3739.18;1845743830;2.358
3750.73;1850539934;2.34807
3763.56;1855336611;2.35737
3775.73;1860359789;2.34772
3787.28;1865056691;2.33834
3800.05;1870501888;2.34769
3812.17;1875495584;2.338
3823.67;1880332384;2.32859
3836.48;1885284346;2.33881
3848.65;1890104928;2.32968
3860.18;1895255790;2.32082
3872.83;1901044122;2.32954
3884.83;1905304911;2.31842
3896.21;1909875490;2.30762
3908.78;1915446248;2.31521
3920.72;1920566083;2.30505
3932.03;1925329645;2.2952
3944.61;1930733814;2.30453
3956.56;1935751699;2.29566
3967.89;1940979647;2.28706
3980.46;1945431774;2.29726
3992.39;1950537527;2.28828
4003.69;1955352946;2.27958
4016.17;1960976440;2.28896
4028.02;1964944155;2.27967
4039.24;1970450642;2.27067
4051.65;1975917337;2.27979
4063.42;1979978545;2.26935
4074.57;1985958739;2.25924
4087.01;1990514847;2.26837
4098.83;1994956918;2.26
4110.02;2000580472;2.2519
4122.48;2005616298;2.26267
4134.3;2009996209;2.25514
4145.5;2015729591;2.24785
4157.88;2020120336;2.25855
4169.63;2025212034;2.25014
4180.76;2029884104;2.242
4193.15;2035529288;2.25266
4204.91;2040928460;2.24454
4216.05;2045510781;2.23669
4228.26;2050855662;2.24572
4239.85;2055034667;2.23677
4250.83;2060136819;2.2281
4263.18;2065701067;2.23939
4274.91;2070810548;2.2326
4286.02;2075365225;2.22604
4298.27;2080655586;2.237
4309.89;2085773775;2.22879
4320.91;2090030447;2.22084
4332.91;2095468831;2.2289
4344.3;2100563296;2.2182
4355.08;2105450939;2.20782
4367.17;2110006634;2.21673
4378.65;2114873091;2.2077
4389.52;2120140552;2.19896
4401.53;2125628124;2.2077
4412.92;2130019560;2.19774
4423.72;2135464748;2.18809
4435.82;2140045318;2.19771
4447.31;2145145795;2.1905
4458.2;2150175951;2.18353
4470.26;2155008449;2.19436
4481.71;2160531081;2.18527
4492.55;2165230525;2.17647
4504.65;2170578969;2.18628
4516.13;2175635447;2.17859
4527.01;2180595039;2.17114
4538.85;2184978250;2.17937
4550.08;2189900859;2.17168
4560.72;2195230532;2.16425
4572.76;2201098074;2.17685
4584.19;2205757678;2.17022
4595.03;2210293953;2.16382
4606.92;2215975740;2.174
4618.21;2219958299;2.16676
4628.9;2224964141;2.15976
4640.78;2230647705;2.17066
4652.06;2235109396;2.16237
4662.75;2240618298;2.15435
4674.72;2245049484;2.1652
4686.08;2250548016;2.15826
4696.86;2255259373;2.15155
4708.73;2260797365;2.16176
4719.99;2265709926;2.15345
4730.66;2270415326;2.14539
4742.5;2275952838;2.15498
4753.74;2280464496;2.14896
4764.39;2285068599;2.14314
4776.29;2290793412;2.15576
4787.59;2295878285;2.14831
4798.3;2300121057;2.14109
4810.05;2305850712;2.15025
4821.21;2310004367;2.14285
4831.77;2315758874;2.13569
4843.62;2320360314;2.14719
4854.86;2325737000;2.14078
4865.52;2330703667;2.13458
4877.19;2335419493;2.14443
4888.27;2340634277;2.13547
4898.76;2345414753;2.12678
4910.45;2350958860;2.13592
4921.54;2354872146;2.12817
4932.05;2360710670;2.12066
4943.59;2365398150;2.12931
4954.54;2370772980;2.12039
4964.91;2375764398;2.11174
4974.73;2380259814;2.10337
4983.99;2385552157;2.07703
4992.73;2390029815;2.05144
5004.51;2395436966;2.06205
5015.69;2400585516;2.05633
5026.29;2405310129;2.05084
5038.1;2410843074;2.06326
5049.32;2415878251;2.057
5059.96;2420912985;2.05097
5071.62;2425549114;2.06109
5082.7;2429876267;2.05516
5093.21;2435367657;2.04945
5104.8;2440846951;2.06038
5115.8;2445936058;2.05351
5126.23;2450398924;2.04688
5137.96;2455279468;2.0591
5149.11;2460846906;2.05515
5159.68;2465069797;2.05137
5171.28;2470846288;2.06367
5182.3;2475358608;2.0757
5192.74;2480103194;2.08746
5204.35;2485495609;2.1162
5215.38;2490815099;2.10874
5225.83;2495572893;2.10149
5237.25;2500121694;2.10963
5248.09;2505255523;2.09988
5258.36;2510197673;2.09041
5269.91;2515611478;2.09953
5280.87;2519963137;2.09251
5291.27;2525772466;2.0857
5302.79;2530206187;2.0958
5313.72;2535781463;2.08925
5324.09;2540790659;2.08289
5335.46;2545174348;2.0923
5346.25;2550319572;2.08289
5356.48;2555739643;2.07374
5367.89;2560177959;2.08215
5378.72;2565358836;2.07444
5388.99;2570456166;2.06697
5400.26;2575950477;2.07521
5410.96;2580301825;2.06603
5421.09;2585154556;2.05712
5432.49;2590645109;2.06652
5443.3;2595061472;2.06053
5453.56;2600280593;2.05474
5464.85;2605954287;2.06502
5475.58;2610456637;2.05673
5485.74;2615934440;2.04869
5496.96;2620422807;2.05686
5507.6;2625924527;2.04814
5517.69;2630633373;2.03968
5529.04;2634998231;2.04951
5539.81;2640062127;2.04353
5550.03;2645111496;2.03775
5561.43;2650585407;2.04952
5572.27;2655885997;2.04373
5582.54;2660488812;2.03813
5593.74;2665835593;2.04748
5604.37;2669900660;2.04112
5614.45;2675837739;2.03496
5625.66;2680380558;2.04573
5636.31;2685732437;2.03822
5646.4;2690904479;2.03093
5657.55;2695783867;2.03993
5668.14;2700554278;2.03284
5678.17;2705676949;2.02597
5689.33;2710300855;2.03592
5699.93;2715542747;2.02969
5709.97;2720220547;2.02364
5719.47;2725226373;2.01779
5730.08;2730886820;2.01039
5740.13;2735253703;2.00323
5749.66;2740049057;1.9963
5760.28;2745526980;1.98851
5770.36;2750221791;1.98099
5781.48;2755257804;1.98949
5792.04;2760231673;1.98305
5802.06;2765712159;1.97683
5811.53;2770447125;1.97083
5822.08;2775893697;1.96414
5832.07;2780237333;1.95767
5843.14;2785930982;1.96741
5853.64;2789915255;1.96089
5863.6;2795877083;1.95459
5874.72;2800490593;1.96541
5885.27;2804920724;1.95938
5895.28;2810419320;1.95357
5904.76;2815017312;1.94797
5915.27;2819964671;1.95807
5925.24;2825394549;1.95168
5934.69;2830248688;1.94552
5945.17;2835659416;1.95515
5955.11;2840084036;1.9483
5964.53;2845924229;1.94169
5974.99;2850343328;1.93504
5984.91;2854939932;1.92863
5995.82;2860611326;1.93768
6006.19;2864880237;1.94656
6016.02;2870239625;1.93941
6025.32;2875980212;1.9325
6035.76;2880075800;1.92621
6045.65;2885220788;1.92013
6056.56;2890715849;1.92963
6066.92;2895726452;1.92204
6076.74;2900317700;1.91471
6086.04;2905470060;1.90762
6096.56;2910892740;1.91803
6106.54;2915448797;1.91272
6116;2920490954;1.9076
6126.47;2925235970;1.91784
6136.4;2930285076;1.91228
6145.81;2935067737;1.90691
6156.11;2940561326;1.9158
6165.89;2945718662;1.90897
6176.83;2950468729;1.91919
6187.22;2955224477;1.91395
6197.08;2960338392;1.90889
6207.94;2965912490;1.91925
6218.26;2970083569;1.92939
6228.05;2974941726;1.92294
6238.84;2980422528;1.93193
6249.09;2985363800;1.92537
6258.82;2990762783;1.919
6268.02;2995609021;1.91283
6278.19;2999987614;1.92147
6287.83;3005584304;1.91268
6298.67;3010373799;1.92126
6308.97;3015382371;1.92964
6318.73;3020904759;1.92266
6329.46;3025821283;1.93063
6339.65;3029903597;1.93842
6349.31;3035299802;1.93196
6358.45;3040479584;1.92568
6368.6;3045570536;1.91778
6378.23;3050822451;1.91011
6388.83;3055397410;1.91753
6398.89;3060348554;1.90953
6408.44;3065003466;1.90177
6419.09;3070455158;1.91038
6429.2;3075810904;1.90356
6438.79;3080874548;1.89695
6449.4;3085277235;1.90584
6459.47;3090725434;1.91452
6469.03;3094936579;1.90838
6478.07;3100617089;1.90242
6488.07;3104983140;1.89401
6497.55;3110827662;1.88584
6507.94;3115391125;1.8921
6517.81;3120447626;1.88348
6527.16;3125083436;1.87512
6537.65;3130877425;1.88342
6547.61;3135857702;1.89154
6557.05;3139858334;1.88446
6567.44;3145397624;1.89208
6577.3;3150349914;1.88468
6586.64;3155561494;1.8775
6597;3160140333;1.88559
6606.82;3165307470;1.87735
6616.13;3170639338;1.86937
6626.44;3175261955;1.87647
6636.21;3180369259;1.86814
6645.48;3185658918;1.86005
6655.8;3190681160;1.86774
6665.6;3195000008;1.87526
6674.89;3200734283;1.86815
6685.12;3205298526;1.8757
6694.83;3210294945;1.86891
6704.04;3215045111;1.86232
6714.26;3220497524;1.87103
6723.96;3225597095;1.86314
6733.16;3230773470;1.85549
6743.26;3235261862;1.86209
6752.84;3240684549;1.85408
6761.93;3245154895;1.84631
6772.01;3250762912;1.85369
6781.58;3255826248;1.84588
6790.65;3260781904;1.8383
6800.7;3265246843;1.8457
6810.25;3270558867;1.8381
6819.29;3275704666;1.83073
6829.37;3280147622;1.83887
6838.93;3285217707;1.83132
6848;3290264487;1.824
6856.58;3295714901;1.81692
6864.68;3300224739;1.79563
6872.33;3305089399;1.77495
6882.42;3310699542;1.78383
6892.01;3314929320;1.77748
6901.1;3320937125;1.77135
6911.1;3325390449;1.77941
6920.59;3330616514;1.77331
6929.59;3335057385;1.76744
6939.7;3340495091;1.77769
6949.3;3345902198;1.77284
6958.4;3350355366;1.76817
6968.41;3355098454;1.77759
6977.91;3359838161;1.77209
6986.92;3365443480;1.76678
6995.45;3370415507;1.76167
7004.96;3375366702;1.75595
7013.97;3379981729;1.75043
7023.98;3385453295;1.75986
7033.49;3390611586;1.76911
7042.5;3395037404;1.77818
7051.03;3400884672;1.78705
7060.5;3405446234;1.78076
7069.48;3410098911;1.77468
7079.41;3415464150;1.78314
7088.84;3420592340;1.77746
7097.79;3425342885;1.77197
7106.25;3430492102;1.76666
7115.69;3435646015;1.75993
7124.64;3440177121;1.75341
7134.42;3445578353;1.76024
7143.71;3449995182;1.75304
7152.52;3454956744;1.74606
7162.32;3460404482;1.75395
7171.62;3465323054;1.76167
7180.44;3470831902;1.75478
7190.22;3475501289;1.7625
7199.51;3479891716;1.75531
7208.32;3485447727;1.74834
7218.09;3490899671;1.7559
7227.36;3495352701;1.76331
7236.16;3500405423;1.75656
7244.48;3505280464;1.75003
7253.75;3510493095;1.7434
7262.54;3515717050;1.73698
7272.33;3520338669;1.74546
7281.63;3525340878;1.75376
7290.45;3530669977;1.74758
7298.79;3535296336;1.74159
7308.1;3540788967;1.73674
7316.92;3545301123;1.73205
7326.57;3550743016;1.74057
7335.74;3555784727;1.73427
7344.44;3560216371;1.72817
7354.09;3565923895;1.73652
7363.25;3570299988;1.7303
7371.94;3575369737;1.72429
7381.57;3580899618;1.73247
7390.71;3584921156;1.72617
7399.37;3590704746;1.72007
7408.89;3595232640;1.7273
7417.92;3600486044;1.73437
7426.47;3605613482;1.72724
7434.57;3610135474;1.72034
7442.23;3614982977;1.69896
7449.45;3620979496;1.67818
7458.98;3625415620;1.68532
7468.03;3631026976;1.69235
7476.61;3635843417;1.68515
7486.24;3640372948;1.69328
7495.4;3645578368;1.68821
7504.07;3650180794;1.68332
7512.29;3655103865;1.67861
7521.36;3660707278;1.67271
7529.96;3664926961;1.66702
7539.41;3670303998;1.67466
7548.38;3675283234;1.66816
7556.89;3680144935;1.66188
7566.33;3685570863;1.66957
7575.28;3690772641;1.66399
7583.78;3695150768;1.6586
7591.82;3700550803;1.65341
7600.71;3704955091;1.66139
7609.15;3710428404;1.66921
7618.55;3715105571;1.69105
7627.48;3720454712;1.68504
7635.95;3726165847;1.6792
7645.44;3730059652;1.68824
7654.44;3735604839;1.68199
7662.99;3739894875;1.67594
7672.33;3745349437;1.68252
7681.19;3750796314;1.68897
7689.6;3754938191;1.68238
7697.55;3760640678;1.67599
7706.3;3766014880;1.66898
7714.6;3770759475;1.66218
7723.79;3775225718;1.66898
7732.51;3780059738;1.66189
7740.78;3785355678;1.65501
7748.61;3790821165;1.64835
7756;3795776438;1.64191
7762.98;3800083497;1.6227
7772.38;3805588090;1.63235
7781.31;3810231355;1.62763
7789.79;3815994300;1.62307
7799.1;3820594548;1.63148
7807.94;3825712711;1.62505
7816.33;3829860244;1.61883
7825.5;3835449845;1.62516
7834.22;3840876473;1.61893
7842.48;3845165632;1.6129
7851.61;3850558123;1.62011
7860.27;3855744275;1.62718
7868.48;3860497538;1.6218
7876.26;3864989025;1.6166
7883.61;3870433836;1.5982
7890.55;3875537950;1.58033
7899.69;3880146194;1.58911
7908.38;3885445986;1.59773
7916.62;3890402710;1.60618
7932.57;3895084519;1.69588
7932.56;3900340781;1.60185
7932.56;3905592066;1.51252
7939.11;3909979974;1.49331
7943.36;3914906230;1.44269
7946.48;3920087187;1.38554
7953.43;3925656128;1.37108
7959.29;3930793351;1.33791
7964.4;3935083152;1.3018
7973.12;3940708965;1.30644
7980.92;3945735545;1.29314
7987.84;3950589437;1.27574
7998.57;3955089898;1.30085
8008.07;3960267935;1.31807
8016.39;3965348420;1.32778
8027.1;3970108134;1.36554
8036.44;3975665343;1.36746
8044.52;3980095942;1.36143
8055.38;3985515031;1.38762
8064.82;3990736159;1.32252
8072.99;3995835860;1.40426
8083.55;4000382387;1.50989
8092.76;4005634667;1.53645
8100.77;4010283633;1.57417
8111.46;4015962786;1.64981
8120.84;4020594202;1.6742
8129.08;4025385258;1.69796
8139.1;4030833128;1.74704
8147.96;4035934890;1.74835
8155.79;4040718759;1.74875
8165.43;4045316718;1.77591
8174.02;4050855054;1.75455
8181.68;4055893172;1.73617
8191.06;4060329258;1.74668
8199.47;4065703296;1.72371
8207.03;4070896023;1.70592
8216.26;4075582402;1.71741
8224.61;4080545830;1.69229
8232.16;4085647535;1.67344
8241.47;4090106736;1.68484
8249.94;4095193057;1.66394
8257.65;4100112848;1.64899
8278.36;4105577776;1.77588
8278.36;4110211903;1.66901
8278.36;4115881969;1.57514
8285.08;4120603676;1.55995
8289.43;4125575348;1.50334
8292.64;4130001549;1.44683
8299.17;4135553252;1.43382
8304.69;4140848259;1.3926
8309.49;4145689248;1.35472
8318.1;4150165891;1.36417
8325.79;4155331927;1.34735
8332.62;4160072158;1.33153
8342.32;4165490567;1.35294
8350.9;4169916798;1.34634
8358.4;4175108685;1.33785
8368.82;4180567482;1.36659
8377.92;4185509375;1.36444
8385.8;4190405695;1.35855
8396.12;4195808007;1.3847
8405.1;4200271979;1.26739
8412.87;4205654953;1.3451
8422.96;4210237697;1.44601
8431.75;4215559753;1.46675
8439.41;4220509989;1.49979
8449.36;4224982303;1.56721
8458.09;4229876969;1.58918
8465.76;4235202943;1.61065
8475.27;4240659813;1.65773
8483.68;4245685053;1.6558
8491.12;4250542633;1.65333
8516.91;4255082131;1.84291
8516.91;4260503235;1.74588
8516.91;4265726184;1.66012
8522.31;4270553375;1.63912
8525.8;4275694559;1.56983
8528.38;4280293640;1.5046
8535.44;4285760579;1.49641
8541.4;4289958055;1.4528
8546.6;4295394518;1.41505
8554.67;4300945579;1.41807
8561.88;4305035563;1.38923
8568.27;4310208945;1.36523
8577.73;4315706948;1.38317
8586.08;4319862665;1.36725
8593.39;4325804036;1.35301
8603.06;4330240907;1.37305
8611.49;4335276090;1.36221
8618.78;4340491238;1.35103
8628.83;4345873777;1.37713
8637.57;4350003946;1.20654
8645.13;4354974227;1.28224
8655.04;4360492826;1.38137
8663.69;4365981059;1.41384
8671.22;4370211224;1.45418
8680.71;4375871616;1.52333
8689.03;4380215783;1.53599
8696.34;4385017698;1.54943
8705.52;4390540521;1.58921
8713.63;4395750878;1.58965
8720.81;4399917871;1.5894
8730.07;4405926193;1.61808
8738.33;4410034169;1.60614
8745.7;4416019380;1.59628
8754.51;4420533032;1.61124
8762.42;4425057561;1.59366
8769.53;4430819571;1.58048
8778.17;4435361756;1.59389
8785.97;4440800755;1.57148
8793.04;4445197270;1.55476
8801.52;4450680489;1.56393
8809.24;4455175221;1.54201
8816.27;4459998072;1.52582
8824.83;4465512703;1.53611
8832.66;4470238833;1.51953
8839.83;4475263512;1.50792
8848.21;4480833390;1.51866
8855.91;4484873814;1.50393
8862.99;4490710195;1.4936
8871.42;4495126049;1.50615
8879.21;4500069511;1.49141
8886.4;4505086079;1.48073
8894.48;4510606926;1.48775
8901.96;4515201173;1.47445
8908.88;4520396391;1.46461
8917.05;4526111005;1.47524
8924.65;4530484615;1.46487
8931.71;4535931715;1.45743
8939.66;4540467684;1.46622
8947.06;4545485149;1.45536
8953.96;4550809536;1.44713
8961.86;4555392611;1.45593
8969.25;4560860057;1.44421
8976.15;4565628017;1.43493
8982.6;4570238988;1.42773
8988.62;4575743284;1.4041
8994.23;4580493116;1.38321
9002.2;4585878203;1.39208
9009.68;4590173997;1.38257
9016.71;4595155725;1.37494
9023.29;4600567232;1.36893
9029.47;4605627215;1.34997
9035.26;4610536694;1.33306
9043.18;4615947612;1.34296
9050.64;4620058241;1.33584
9057.66;4624981518;1.33013
9065.62;4630424880;1.33911
9073.14;4636147104;1.33481
9080.22;4640010105;1.33164
9088.1;4645438510;1.34148
9095.55;4650690622;1.33686
9102.57;4655838237;1.33325
9110.42;4660312570;1.34271
9117.84;4665214861;1.35246
9124.86;4669978377;1.36241
9132.66;4675566706;1.3843
9140.04;4680099525;1.37845
9147.02;4685139450;1.37341
9154.73;4690683750;1.38023
9162.02;4694915568;1.38728
9168.92;4700233059;1.39449
9176.56;4705706039;1.41297
9183.79;4709966658;1.40612
9190.63;4715933913;1.39994
9198.27;4720549021;1.40607
9205.51;4725571101;1.39886
9212.36;4730591427;1.39226
9219.88;4735067810;1.39655
9227;4739886909;1.38895
9233.74;4745009677;1.38191
9241.22;4750556839;1.38647
9248.31;4755754979;1.37893
9255.03;4760227513;1.3719
9267.09;4765731375;1.4224
9267.08;4770737774;1.34436
9267.08;4775874566;1.27051
9284.2;4780429028;1.3718
9284.2;4785101421;1.29474
9284.2;4790943115;1.22179
9289.85;4795386893;1.20928
9293.51;4800206269;1.16952
9296.2;4804937124;1.12415
9302.21;4810160364;1.11574
9307.27;4816071473;1.09003
9311.69;4820763597;1.06177
9346.9;4825494226;1.3455
9346.9;4830854332;1.27037
9346.9;4835775044;1.19917
9367.24;4840286119;1.33502
9367.24;4845306069;1.26018
9367.24;4851457097;1.18924
9372.55;4855356092;1.17518
9375.99;4860432289;1.08934
9378.53;4865466271;1.11468
9384.19;4870255830;1.1714
9388.97;4875746103;1.04775
9393.14;4880798199;1.08942
9400.08;4885215963;1.15883
9406.28;4890749198;1.16435
9411.79;4895611257;1.1828
9419.85;4900028663;1.23647
9426.98;4904891824;1.24772
9433.21;4910734827;1.2594
9441.79;4915187128;1.30106
9449.27;4920851038;1.02368
9455.75;4924924938;1.0885
9464.59;4930408341;1.17688
9472.27;4936014034;1.05051
9478.94;4940147325;1.11712
9487.99;4945773554;1.20766
9495.9;4949993077;1.23359
9502.79;4955040613;1.26811
9511.17;4960630293;1.3266
9518.53;4965745005;1.34358
9524.98;4970666640;1.36036
9532.75;4975105617;1.39634
9539.61;4979904306;1.39545
9545.67;4985069991;1.39405
9553.37;4990541754;1.41591
9560.23;4995516159;1.40384
9566.35;5000219518;1.39371
9574.04;5005897515;1.40828
9580.95;5010180460;1.39161
9587.16;5015790447;1.37889
9594.66;5020366856;1.38907
9601.44;5025409310;1.36852
9607.57;5030146945;1.35302
9615.07;5035054773;1.36133
9621.88;5040616586;1.33896
9628.09;5045811062;1.32197
9635.36;5050352092;1.32572
9642.01;5055478961;1.3084
9648.09;5060342289;1.29568
9655.26;5065825774;1.30289
9661.86;5070078582;1.29118
9667.92;5075620458;1.28316
9674.97;5080522247;1.29302
9681.48;5085000943;1.28109
9687.48;5089914072;1.27254
9694.49;5095482855;1.28146
9700.99;5100735364;1.26948
9707;5105175943;1.26057
9713.95;5110634717;1.26792
9720.4;5115641024;1.25745
9726.4;5120618107;1.24961
9731.97;5125238338;1.24399
9737.15;5130167071;1.22083
9741.96;5135340740;1.20073
9748.98;5140843232;1.2089
9755.54;5145854186;1.20188
9761.68;5150015963;1.19679
9768.63;5155496982;1.20542
9775.14;5160034222;1.19876
9781.24;5165211733;1.1938
9788.14;5170878820;1.20224
9794.62;5174991351;1.19655
9800.71;5180287349;1.19233
9807.49;5185736722;1.20008
9813.87;5190662381;1.19375
9819.86;5195551467;1.18876
9826.51;5200070546;1.19512
9832.77;5205506127;1.18829
9838.67;5210077661;1.18268
9845.46;5215537637;1.19061
9851.86;5220766966;1.19894
9857.9;5225509295;1.20755
9864.51;5230396943;1.22551
9870.74;5235734568;1.21761
9876.62;5240544315;1.21073
9883.16;5246005906;1.2148
9889.35;5250623623;1.20719
9895.19;5255028511;1.20048
9901.81;5260251319;1.20574
9908.08;5265682990;1.19935
9914;5270103115;1.19373
9920.56;5275455599;1.19847
9926.76;5280352392;1.19274
9932.63;5285386938;1.18765
9939.06;5290830383;1.19203
9945.15;5295751018;1.18641
9950.91;5300784311;1.18136
9959.27;5305394459;1.20606
9959.27;5310488243;1.13813
9959.27;5315596986;1.07406
9963.63;5320191303;1.05731
9966.46;5325667675;1.01955
9968.54;5330161864;0.978032
9973.49;5335657742;0.968716
9977.67;5341003749;0.945034
9981.31;5345971319;0.919581
9986.88;5350518107;0.916948
9991.85;5354858183;0.900439
9996.26;5360573609;0.881887
10000.1;5365963051;0.861403
10003.5;5369989614;0.829438
10006.4;5375833544;0.796239
10014.7;5380303033;0.821057
10022.1;5385303346;0.830221
10028.5;5390271250;0.833538
10037.1;5395722788;0.861463
10044.5;5400969331;0.852852
10051;5405300424;0.917905
10058.9;5411051331;0.996732
10065.8;5415319362;1.02194
10071.8;5420352627;1.05377
10079.7;5426027544;1.11194
10086.7;5430190125;1.13187
10092.8;5434924201;1.15114
10100;5440308172;1.18675
10106.4;5445785190;1.19475
10112;5451048961;1.20147
10119.2;5455830445;1.2291
10125.6;5459981661;1.25437
10131.3;5465274453;1.27787
10138.3;5470027494;1.31909
10144.6;5475151175;1.29858
10150.3;5480356718;1.28174
10156.9;5485856915;1.28406
10162.9;5490264437;1.25869
10168.4;5495332632;1.23837
10174.8;5500695127;1.23766
10180.7;5504875977;1.21738
10186;5511021719;1.20177
10192.5;5515645409;1.20689
10198.5;5520711362;1.1876
10203.9;5525023957;1.17275
10210.3;5530458968;1.17568
10216.2;5535127065;1.16245
10221.6;5540839773;1.15276
10227.8;5545542506;1.15794
10233.5;5550699830;1.14309
10238.7;5555382255;1.13158
10243.6;5560804091;1.1229
10248;5565625021;1.09751
10252.2;5570496987;1.07577
10266.6;5575857467;1.16311
10266.6;5580153295;1.09658
10266.6;5585900103;1.03643
10270.7;5590138945;1.02355
10273.4;5595895165;0.986086
10275.4;5600431496;0.947356
10277;5605908399;0.909952
10278.3;5609853055;0.85807
10279.5;5615654532;0.809937
10285.8;5620177997;0.819109
10291.6;5625437303;0.812566
10296.7;5630409530;0.805252
10303.8;5635848921;0.821884
10310.1;5640327959;0.823114
10315.6;5645174108;0.821489
10323.4;5650611072;0.846602
10330.2;5655806150;0.866102
10336.1;5660979220;0.880464
10343.3;5665433264;0.91172
10349.6;5670565874;0.830755
10355.1;5675580353;0.885399
10362.5;5680282517;0.959224
10368.9;5685587873;0.982061
10374.5;5690370457;1.01128
10381.4;5695770325;1.06033
10387.4;5700744241;1.1049
10392.8;5705745273;1.14457
10399.1;5710100503;1.19666
10404.8;5715609983;1.18918
10409.7;5720052695;1.1815
10416.1;5725677056;1.19403
10421.8;5730188672;1.18033
10426.9;5735643661;1.16838
10433.2;5740346582;1.17545
10438.7;5745556932;1.15373
10443.8;5750720425;1.13601
10449.9;5755439908;1.1378
10455.4;5760671731;1.12032
10460.3;5765500297;1.10706
10466.1;5770865841;1.11039
10471.4;5775242793;1.08927
10476.2;5780087302;1.07276
10482;5785643401;1.0745
10487.2;5790934054;1.0585
10492.1;5795878961;1.04642
10498;5800562692;1.05211
10503.4;5805127792;1.04237
10508.3;5810125010;1.03569
10513.8;5815645651;1.04107
10518.9;5820015554;1.02789
10523.6;5826035283;1.01773
10527.9;5830409624;1.0101
10531.9;5835470229;0.987737
10535.6;5840198862;0.968622
10541.3;5845645825;0.975462
10546.6;5850751576;0.967688
10551.6;5855086156;0.962035
10556.1;5860522485;0.958171
10560.4;5865881015;0.942922
10564.4;5870673410;0.929925
10570;5875187245;0.938029
10575.2;5880753613;0.932513
10580.1;5885038406;0.928547
10585.6;5890510800;0.935049
10590.7;5895876074;0.927742
10595.5;5900194713;0.921934
10601;5905877904;0.927134
10606.2;5910333102;0.923469
10611;5915108353;0.920928
10616.3;5920724066;0.927445
10621.4;5924914385;0.934406
10626.1;5930708684;0.941702
10631.5;5935186837;0.958808
10636.6;5940559124;0.952491
10641.3;5945380525;0.947202
10646.7;5950916869;0.951577
10651.8;5954965896;0.956373
10656.6;5961105635;0.961498
10665.9;5965683012;1.01537
10665.9;5970860046;0.959386
10665.9;5976098375;0.907031
10669.1;5980104597;0.890219
10671.2;5985023517;0.856143
10672.7;5989988832;0.820031
10676.3;5995425213;0.807193
10679.2;6000031089;0.782203
10681.8;6008149625;0.75671
10686.8;6010639901;0.757827
10691.2;6015166300;0.748658
10695.1;6019963818;0.737808
10701;6025432087;0.749071
10706.2;6030692463;0.746938
10710.7;6035766255;0.741525
10716.3;6040491141;0.749405
10721.1;6045668461;0.744131
10725.3;6050446327;0.735346
10748.3;6055019710;0.917171
10748.3;6060486249;0.82367
10748.3;6065850957;0.823676
10760.1;6070257877;0.942407
10760.1;6075265688;0.910281
10760.1;6080080119;0.889472
10775.6;6085463423;1.02905
10775.6;6090704814;0.993717
10775.6;6095361970;0.963886
10779.1;6100760740;0.973111
10781.4;6105176471;0.946467
10783.1;6109974942;0.919013
10786.5;6115431753;0.913502
10789.4;6120178848;0.88362
10791.8;6125423368;0.856721
10796.5;6130030385;0.857805
10800.6;6134904596;0.843685
10804.3;6140907648;0.83217
10810;6145338444;0.846447
10814.9;6150390076;0.666916
10819.3;6155574456;0.710582
10842.4;6160092673;0.942035
10842.4;6165323740;0.823146
10842.4;6170741934;0.823141
10845.6;6175134567;0.854442
10847.6;6180045632;0.719727
10849.1;6184991316;0.734657
10852.7;6190562376;0.771052
10855.8;6195810207;0.766601
10858.5;6200053006;0.770582
10863.2;6205601948;0.80092
10867.4;6210569210;0.809172
10871.2;6215320176;0.818028
10894.2;6220798807;1.02357
10894.2;6225849790;0.977091
10894.2;6230629939;0.935535
10907.4;6235051111;1.03021
10907.4;6240132522;0.974007
10907.4;6245899960;0.924237
10910.3;6250224770;0.910117
10912.2;6255015666;0.697653
10913.6;6260424424;0.711722
10914.7;6265674561;0.722987
10915.7;6270511287;0.701171
10916.5;6275195444;0.689097
10922;6280513474;0.72915
10927;6285370546;0.742348
10931.4;6290140323;0.756119
10936.9;6295376983;0.784662
10941.9;6300293728;0.786594
10946.2;6305064676;0.787514
10951.8;6310425993;0.806701
10956.8;6315188823;0.626429
10961.1;6320056054;0.669307
10966.7;6325478156;0.726033
10971.7;6330427566;0.643272
10976;6335682943;0.686074
10981.6;6340311284;0.742458
10986.5;6345307090;0.76217
10990.8;6350278438;0.785947
10996;6355710909;0.823927
11000.6;6360003218;0.858321
11004.6;6364913683;0.888877
11009.6;6370553687;0.930514
11014;6374937435;0.919597
11017.9;6380919435;0.908979
11022.8;6385675751;0.913495
11027.1;6390841808;0.901874
11031;6395766902;0.891764
11035.8;6400173282;0.896389
11040.1;6405392220;0.882561
11043.9;6410577339;0.871565
11048.6;6415065562;0.875803
11052.9;6420135628;0.861593
11056.7;6425003677;0.850729
11061.2;6430461155;0.852635
11065.3;6435865272;0.836892
11069;6440756562;0.824678
11073.5;6445279357;0.826553
11077.5;6450816014;0.815433
11081.3;6455814981;0.807213
11085.8;6460244957;0.811943
11089.9;6465606413;0.803203
11093.6;6469915233;0.796922
11098;6475807902;0.80189
11102.1;6480235094;0.793418
11105.8;6485463830;0.787149
11113.2;6490219551;0.822499
11113.2;6495347108;0.774855
11113.2;6500186575;0.732091
11124.6;6505586077;0.806732
11124.6;6510853538;0.759605
11124.6;6515591782;0.717
11138.2;6520075694;0.814528
11138.2;6525685591;0.76982
11138.2;6530778422;0.72918
11140.5;6535226100;0.715031
11142;6540180363;0.685088
11143;6545702011;0.655084
11146;6550230067;0.64674
11148.4;6555405541;0.626564
11150.6;6560135945;0.606859
11154.3;6565554575;0.607046
11157.7;6569899327;0.597067
11160.8;6575781260;0.58672
11165.3;6580152865;0.594159
11169.2;6584988140;0.560303
11172.7;6589990828;0.595103
11177.4;6595696841;0.641726
11181.4;6600238573;0.568258
11184.9;6604954028;0.603471
11189.6;6610646715;0.650483
11193.7;6615092854;0.555565
11197.3;6620074425;0.590987
11201.8;6625553289;0.636233
11205.7;6630787394;0.652941
11209.2;6636030063;0.672555
11223;6640739628;0.799852
11223;6645841811;0.770776
11223;6650966354;0.746228
11234;6655897636;0.834836
11234;6660053226;0.796867
11234;6665156753;0.76291
11236.7;6670803631;0.759029
11238.4;6675820036;0.731213
11239.6;6680662374;0.704053
11242.6;6685146349;0.698817
11245.1;6690524725;0.67721
11247.2;6694993806;0.658316
11250.7;6700039617;0.657498
11253.8;6705531100;0.641199
11256.5;6710389319;0.62758
11275.8;6715838113;0.785472
11275.8;6720310240;0.740296
11275.8;6725343509;0.700927
11286.9;6730929720;0.777316
11286.9;6735358011;0.6389
11286.9;6740162816;0.638906
11289.5;6745566673;0.665055
11291.2;6750602272;0.571538
11292.4;6755684810;0.584
11294.8;6760196878;0.608064
11296.9;6765827218;0.60206
11298.6;6770707500;0.602692
11302.5;6775399456;0.628721
11306;6780608067;0.633739
11309;6785688546;0.639586
11313;6790234150;0.657741
11316.5;6795084959;0.658575
11319.6;6800271624;0.658673
11323.7;6805840991;0.672252
11327.3;6809878616;0.515095
11330.3;6815723077;0.545923
11334.7;6820087826;0.589135
11338.4;6824880088;0.515447
11341.7;6830552651;0.547998
11356.3;6835017189;0.694588
11356.3;6839838596;0.668483
11356.3;6845342153;0.651575
11367.3;6850888191;0.748594
11367.3;6855156822;0.724528
11367.3;6860846921;0.704215
11367.3;6865380987;0.686541
11367.3;6870727480;0.647976
11367.3;6875234294;0.613433
11370.2;6880796853;0.611993
11372.7;6885953912;0.596891
11374.9;6890709081;0.583323
11378.4;6895086762;0.588159
11381.6;6900420529;0.579256
11384.5;6905211646;0.572148
11388.8;6910661619;0.584105
11392.5;6915157678;0.578858
11395.9;6920137978;0.574593
11411.2;6925702341;0.696174
11411.2;6930976466;0.549091
11411.2;6936106189;0.549094
11421.6;6940691944;0.653001
11421.6;6945769994;0.54325
11421.6;6951189175;0.54325
11423.7;6955997271;0.563944
11425;6960632244;0.57735
11426;6965512759;0.587225
11428.2;6970000819;0.60906
11430;6975427106;0.598156
11431.6;6980315632;0.589396
11434.8;6985683656;0.599115
11437.6;6990833578;0.591592
11440.1;6995900672;0.584693
11443.9;7000425957;0.593737
11447.2;7005849289;0.584248
11450.1;7010286546;0.575497
11464.7;7015832179;0.688052
11464.7;7020855218;0.534056
11464.7;7025527913;0.534059
11466.8;7030220482;0.555843
11468.2;7035908620;0.466561
11469.3;7040079460;0.476938
11471.7;7045461641;0.500888
11473.7;7050539203;0.500489
11475.5;7055756758;0.504747
11478.4;7060288091;0.52369
11480.9;7065393818;0.527542
11483.2;7070229443;0.531918
11500.1;7075771568;0.685459
11500.1;7079876614;0.653922
11500.1;7085351317;0.62569
11508.9;7090802997;0.687892
11508.9;7094849485;0.65039
11508.9;7100107831;0.617166
11510.8;7105649837;0.60735
11512.1;7110354599;0.474151
11513;7115874417;0.483391
11515.2;7120274471;0.505438
11517.1;7125308603;0.502281
11518.7;7130107943;0.504386
11521.5;7135555923;0.522031
11524;7140629470;0.523051
11526.2;7145062370;0.525019
11528.2;7150997095;0.526939
11530.9;7155394780;0.525192
11533.3;7160053210;0.523189
11536.6;7165506280;0.533768
11539.5;7170815371;0.395215
11542.1;7175238121;0.420408
11556.9;7180656027;0.568643
11556.9;7185914757;0.480149
11556.9;7190796603;0.480149
11558.8;7195193933;0.499701
11560.1;7200234531;0.492982
11561;7205312931;0.489762
11562.7;7209989646;0.497268
11564.1;7215204812;0.489356
11565.4;7220323783;0.483031
11568;7225863052;0.493673
11570.4;7230817859;0.489674
11572.6;7235844406;0.486035
11575.4;7240476167;0.491889
11577.9;7245459752;0.497137
11580.1;7250607607;0.491761
11581.9;7255106212;0.486814
11583.5;7260991496;0.469551
11584.9;7265120314;0.454117
11588.4;7270887311;0.463342
11591.4;7275576488;0.345195
11594;7280850482;0.371517
11597.7;7285382667;0.407877
11600.9;7290686370;0.420207
11603.6;7295488707;0.43545
11614.6;7300902692;0.536081
11614.6;7305922747;0.519327
11614.6;7310854220;0.505187
11616.5;7315552036;0.511427
11617.7;7320320347;0.496577
11618.6;7325466635;0.481368
11620.7;7330998971;0.481372
11622.5;7335727547;0.471371
11624.1;7341006075;0.462315
11637.2;7345736640;0.572144
11637.2;7349906385;0.553348
11637.2;7355640239;0.53721
11642.6;7360060178;0.576724
11642.6;7365442246;0.542234
11642.6;7370592937;0.512081
11651.8;7375143161;0.577454
11651.8;7380076066;0.541028
11651.8;7385077921;0.509094
11652.9;7390468635;0.492628
11653.6;7395419771;0.390321
11654.2;7400326874;0.395813
11663.9;7404999984;0.493207
11663.9;7410447212;0.474669
11663.9;7415636558;0.46266
11669.9;7420263594;0.513133
11669.9;7425427810;0.49158
11669.9;7429978642;0.473378
11675.8;7435453004;0.517195
11675.8;7440814356;0.387364
11675.8;7445714836;0.387364
11682.3;7450123466;0.452183
11682.3;7455338466;0.396903
11682.3;7460161702;0.396903
11684.7;7465488369;0.42136
11686.3;7470433589;0.345564
11687.5;7475193143;0.357236
11696.7;7480676180;0.449959
11696.7;7484975321;0.438525
11696.7;7490123375;0.431121
11703.3;7495583621;0.491415
11703.3;7500647417;0.394408
11703.3;7505901478;0.394408
11705;7510313363;0.410559
11706;7515405373;0.361548
11706.8;7520420753;0.369277
11708.2;7525952158;0.38372
11709.4;7531028077;0.336152
11710.5;7535090110;0.346747
11712.8;7540605220;0.369504
11714.8;7545640274;0.325405
11716.6;7550579634;0.343606
11718.9;7555198868;0.365964
11720.8;7560597513;0.361244
11722.6;7564988975;0.362608
11732;7570593383;0.445832
11732;7575092053;0.353046
11732;7580398033;0.353042
11737.6;7585973364;0.409451
11737.6;7590049670;0.343324
11737.6;7595125989;0.343324
11743.1;7600670023;0.398324
11743.1;7605238770;0.38212
11743.1;7610710589;0.371624
11749.5;7615275574;0.427225
11749.5;7620524255;0.412783
11749.5;7625140986;0.400588
11749.5;7630703959;0.389984
11749.5;7634917648;0.367176
11749.5;7640112404;0.346752
11761;7645641087;0.444063
11761;7650394827;0.421704
11761;7655627909;0.40198
11761.9;7660168130;0.393219
11762.4;7665683726;0.303854
11762.8;7670864433;0.307878
11764.1;7675363273;0.320579
11765.2;7680273787;0.276602
11766.1;7685202545;0.286031
11775.4;7690765074;0.377555
11775.4;7695642745;0.324933
11775.4;7700450900;0.324933
11780.9;7705227872;0.378841
11780.9;7710595602;0.314476
11780.9;7714963438;0.314476
11782.3;7720871282;0.327703
11783.1;7725243943;0.336295
11783.8;7730657538;0.342636
11785;7735643572;0.35542
11786.1;7740901371;0.250654
11787;7745703941;0.260069
11796.4;7750042889;0.353909
11796.4;7755342735;0.345478
11796.4;7760165887;0.340015
11796.9;7765575548;0.340963
11797.2;7770845343;0.33159
11797.5;7775620262;0.323327
11804.4;7780058191;0.382969
11804.4;7785051173;0.290727
11804.4;7791097675;0.290727
11805.3;7795837779;0.299909
11805.9;7799870678;0.249675
11806.3;7804915668;0.254046
11807.5;7810412867;0.265794
11808.5;7815949249;0.262411
11809.4;7819985720;0.262463
11810.6;7825573814;0.268193
11811.6;7829913358;0.266201
11812.6;7835965467;0.264961
11823;7840557570;0.360124
11823;7845019488;0.266841
11823;7850039545;0.266841
11824.2;7855605134;0.278068
11824.9;7860889046;0.28023
11825.5;7865717475;0.282315
11826.3;7870310680;0.288537
11827.1;7875972004;0.226627
11827.7;7881029805;0.232977
11834.8;7885758446;0.304214
11834.8;7890601201;0.29509
11834.8;7895750676;0.28918
11840.2;7900154915;0.339354
11840.2;7904905199;0.327651
11840.2;7910142501;0.317776
11840.6;7915607370;0.312105
11840.8;7920326339;0.302107
11840.9;7925515071;0.292902
11847.5;7930240053;0.34896
11847.5;7935414176;0.244423
11847.5;7940155564;0.244423
11848.5;7945615686;0.255052
11849.2;7950355457;0.250464
11849.7;7955720192;0.248148
11850.8;7960186398;0.253148
11851.7;7965783561;0.253343
11852.4;7970054899;0.253751
11853.8;7975694260;0.261118
11855;7980027487;0.203145
11856.1;7985619063;0.213974
11857.4;7990174565;0.22631
11858.5;7995114136;0.183474
11859.4;8000549141;0.192826
11860.9;8005164995;0.207475
11862.2;8010127916;0.216574
11863.3;8015312214;0.225337
11864.6;8020709254;0.236717
11865.7;8025017949;0.182847
11866.7;8030913342;0.192573
11868;8035473568;0.206099
11869.2;8040607436;0.207097
11870.3;8045069305;0.210384
11871.7;8050516499;0.2197
11873;8055402013;0.221972
11874.1;8060091688;0.22441
11875.4;8065407329;0.23008
11876.6;8070587712;0.228007
11877.6;8075788395;0.22605
11879.1;8080172995;0.230037
11880.4;8085679864;0.23077
11881.6;8090487406;0.231641
11883;8095729581;0.235486
11884.2;8100658734;0.232932
11885.3;8105671034;0.231028
11886.5;8109993122;0.232176
11887.6;8114900822;0.230135
11888.6;8120039717;0.228791
11889.8;8125402247;0.231586
11891;8130367354;0.229443
11892;8135745242;0.228016
11893.2;8140553245;0.229711
11894.3;8145503797;0.226205
11895.3;8150380037;0.223519
11896.5;8156020071;0.224186
11897.6;8160207712;0.221813
11898.6;8165540423;0.220093
11899.7;8170098349;0.220462
11900.7;8175639541;0.215439
11901.6;8180523743;0.211235
11902.4;8185274732;0.207735
11903.2;8190269359;0.202062
11903.9;8195015244;0.197136
11904.8;8200391181;0.195249
11905.6;8204989025;0.19137
11906.4;8211032398;0.188048
11907.4;8215563560;0.187615
11908.2;8220568804;0.183902
11909.1;8225307631;0.180694
11909.9;8230782444;0.179141
11910.8;8235001059;0.175398
11911.5;8240614231;0.172113
11912.4;8245021246;0.170426
11913.1;8250149933;0.166382
11913.9;8255008467;0.162775
11914.8;8260444085;0.161697
11915.6;8265885462;0.159273
11916.4;8270356576;0.157166
11917.2;8275696257;0.156194
11918;8279895393;0.15544
11918.7;8285541022;0.154856
11919.4;8290249775;0.155605
11920.2;8295218416;0.154025
11920.9;8300558171;0.152642
11921.6;8305428741;0.152051
11922.2;8310788093;0.149137
11922.9;8315857292;0.14646
11923.5;8320505216;0.144373
11924.1;8325801544;0.141248
11924.6;8330571560;0.13835
11925.3;8335314271;0.137488
11925.9;8340300771;0.135546
11926.5;8345421743;0.133778
11927.3;8350898704;0.134283
11928;8354854698;0.132675
11928.7;8360086304;0.131205
11929.4;8365535314;0.130059
11930;8370083023;0.128178
11930.6;8375597487;0.126431
11931.2;8380059123;0.12518
11931.7;8385391231;0.122847
11932.2;8390458432;0.120646
11932.8;8395939298;0.119596
11933.4;8400053084;0.118015
11933.9;8404958053;0.116527
11934.4;8410302642;0.115137
11934.8;8415939110;0.11338
11935.2;8420022052;0.111719
11935.8;8425526087;0.111796
11936.3;8430663879;0.110099
11936.8;8435544140;0.108505
11937.3;8440050452;0.108062
11937.9;8445233150;0.10556
11938.3;8450633424;0.103184
11938.8;8455125585;0.100485
11939.1;8459978738;0.0977212
11939.5;8465027942;0.095075
11939.9;8470482487;0.0928333
11940.2;8477317729;0.0902597
11940.5;8480042525;0.087795
11940.9;8485638518;0.0862607
11941.2;8490779354;0.0838292
11941.5;8495677888;0.0815129
11941.9;8500076531;0.0800847
11942.2;8505039094;0.0787221
11942.5;8511660747;0.077434
11942.8;8515134495;0.0760229
11943.1;8519990548;0.0730169
11943.3;8525631576;0.0701332
11943.6;8530190316;0.068537
11943.9;8535757966;0.065969
11944.2;8540897923;0.0635146
11944.5;8545327663;0.0612486
11944.7;8550484420;0.0595584
11944.9;8555142489;0.057967
11945.1;8560607279;0.0567232
11945.3;8565903587;0.055191
11945.5;8570188787;0.0537518
11945.7;8575618957;0.052165
11945.8;8580982119;0.0497873
11945.9;8585627403;0.0475089
11946.1;8590117577;0.0456585
11946.2;8595079436;0.0432179
11946.3;8600885580;0.0408924
11946.5;8605385766;0.0394148
11946.6;8610792543;0.0382284
11946.8;8614976948;0.0371135
11946.9;8620563113;0.0363456
11947.1;8625590974;0.0343983
11947.2;8630331236;0.0326221
11947.2;8635094260;0.0304578
11947.3;8640103062;0.0283185
11947.3;8645779359;0.0263077
11947.4;8650117390;0.0245845
11947.4;8655279526;0.0228864
11947.5;8660073585;0.0213038
11947.4;8665484590;0.019761
11947.4;8670496594;0.0183648
11947.4;8675468013;0.0171166
11947.4;8680340998;0.0160146
11947.3;8685626558;0.0142518
11947.3;8690559780;0.0125903
11947.4;8695919359;0.0120565
11947.4;8699973274;0.0112784
11947.4;8705782712;0.0106228
11947.4;8710150235;0.00955658
11947.3;8715157480;0.00776545
11947.3;8720506040;0.00631362
11947.2;8725053711;0.00475053
11947.1;8730038548;0.00406119
11947.1;8735054018;0.00383212
11946.9;8740417361;0.00611096
11946.7;8746016795;0.00930342
11946.4;8750883443;0.0123806
11946.4;8755393871;0.0130429
11946.4;8760241254;0.0129438
11946.4;8765330223;0.0128142
11946.3;8770744421;0.0133934
11946.2;8774997884;0.0139167
11946.1;8779945360;0.0143977
11946;8785848883;0.0147955
11945.9;8790253503;0.0161706
11945.8;8795021851;0.0175863
11945.7;8800388864;0.0186901
11945.6;8805785174;0.0189221
11945.5;8810490004;0.0191472
11945.4;8815924198;0.0192142
11945.3;8819983669;0.0194413
11945.2;8825642429;0.0196253
11945.1;8830123444;0.0198861
11945.1;8835257740;0.0184366
11945;8840162060;0.0170383
11944.8;8845515241;0.0161314
11944.7;8850059383;0.0173114
11944.6;8855971492;0.0184395
11944.4;8860532209;0.0195234
11944.3;8865887107;0.0201027
11944.2;8870835900;0.0206929
11944.1;8875271796;0.0203483
11944.1;8880555098;0.0195032
11944;8885527233;0.018673
11943.9;8890037664;0.0185696
11943.8;8894955095;0.0187375
11943.7;8900019116;0.0188851
11943.6;8905588817;0.018641
11943.5;8910841101;0.0186479
11943.5;8915384111;0.0186289
11943.2;8920373973;0.0201165
11943;8925520305;0.0214404
11942.8;8930904924;0.022701
11942.8;8935586995;0.0214387
11942.9;8940756560;0.0196422
11942.9;8945512660;0.0178643
11943;8950146721;0.0161246
11943;8955736706;0.0144193
11943;8960781221;0.0127335
11942.9;8965212472;0.0124675
11942.8;8970716581;0.013112
11942.7;8975625482;0.0137665
11942.7;8980068683;0.0137819
11942.7;8985689854;0.0129866
11942.6;8990557131;0.012207
11942.7;8994946667;0.0107764
11942.7;9000393069;0.00978156
11942.7;9005743714;0.00880749
11942.6;9010275274;0.00920622
11942.5;9015763087;0.0082245
11942.4;9020101071;0.00742964
11942.4;9025583408;0.00576979
11942.4;9030110702;0.00590366
11942.3;9034947086;0.00617782
11942.2;9040353371;0.00776057
11942.1;9045714742;0.00929512
11942;9050687005;0.0107917
11941.9;9055225671;0.0122435
11941.8;9060185100;0.0122849
11941.7;9065575287;0.0123218
11941.7;9070024921;0.0116637
11941.7;9075715557;0.0117111
11941.7;9080080885;0.0117949
11941.6;9085715431;0.0121609
11941.5;9090943844;0.0132575
11941.4;9095497805;0.0143331
11941.4;9100064653;0.0143294
11941.5;9105477543;0.0128746
11941.5;9110513253;0.0114592
11941.5;9115945498;0.0105902
11941.5;9120441532;0.010722
11941.5;9124975452;0.0109038
11941.4;9130626284;0.0113061
11941.3;9134975743;0.0103869
11941.3;9140791001;0.00954265
11941.2;9145264442;0.00898521
11941.1;9150278738;0.00847645
11941;9155046266;0.00801961
11941.1;9160602022;0.0064273
11941.1;9164953074;0.0057605
11941.2;9170039509;0.00525262
11941.2;9175676453;0.00493247
11941.3;9180487809;0.00353486
11941.3;9185481783;0.00225611
11941.3;9190098456;0.00230765
11941.3;9195393358;0.00303306
11941.3;9199973969;0.00374692
11941.3;9205587411;0.00305806
11941.3;9210895408;0.00275767
11941.4;9215845645;0.00249868
11941.4;9220315159;0.00318441
11941.4;9225358787;0.00311339
11941.4;9230243025;0.00319162
11941.3;9235014068;0.00254889
11941.2;9240025654;0.00222031
11941.1;9245054856;0.00189922
11941.1;9250993992;0.0016383
11941.1;9255846157;0.000882848
11941.1;9261070007;0.000818934
11941;9265624576;0.00212548
11940.9;9270848704;0.00341926
11940.8;9275637907;0.0046862
11940.8;9280114350;0.00572498
11940.7;9285750426;0.00596429
11940.7;9290498796;0.006193
11940.7;9294959849;0.00552429
11940.8;9300359248;0.00559973
11940.8;9305188097;0.00569508
11940.8;9310661546;0.00620847
11940.7;9315929522;0.00636899
11940.7;9320793074;0.00652707
11940.7;9325200249;0.00649175
11940.7;9330745197;0.00574019
11940.7;9335941217;0.00500627
11940.7;9340486959;0.0043686
11940.7;9345613247;0.00439265
11940.7;9351723325;0.0046483
11940.7;9355492401;0.00509679
11940.7;9360759630;0.00473854
11940.7;9365499558;0.00451479
11940.7;9370965084;0.00455527
11940.8;9374882340;0.00409267
11940.8;9380949007;0.00372729
11940.8;9385531953;0.00397522
11940.9;9390593202;0.00563779
11941;9395904285;0.00726956
11941;9400733022;0.0086826
11941;9405780565;0.00887587
11941.1;9410500061;0.00907484
11941.1;9415949197;0.00821557
11941.1;9419829930;0.00813019
11941.1;9425058762;0.00805455
11941;9430956957;0.00812914
11940.9;9435492416;0.00749744
11940.8;9440279231;0.0070119
11940.7;9445679169;0.00658491
11940.6;9450745204;0.00632709
11940.5;9455253070;0.00636966
11940.6;9460751603;0.00612507
11940.6;9465836520;0.00584971
11940.7;9470748378;0.00561859
11940.7;9475143171;0.00469017
11940.7;9480593591;0.00357718
11940.7;9485238307;0.00283112
11940.6;9490704396;0.00346608
11940.5;9495685146;0.00456303
11940.5;9500043023;0.0058646
11940.4;9505888372;0.0067726
11940.4;9510199256;0.00718575
11940.4;9515101913;0.00758414
11940.5;9520696518;0.00706768
11940.5;9525802790;0.00565391
11940.6;9530770352;0.00446456
11940.5;9535204856;0.00381297
11940.5;9540307631;0.00318409
11940.5;9545155717;0.00263878
11940.5;9550634729;0.0030092
11940.5;9555652247;0.00388637
11940.5;9560272956;0.00479398
11940.6;9565784537;0.00595424
11940.7;9571021542;0.00618688
11940.7;9575949525;0.00650594
11940.8;9580431697;0.0065063
11940.9;9585840967;0.00696981
11941;9590590179;0.00784882
11941;9595009222;0.00764682
11940.9;9600433016;0.00686167
11940.9;9605425314;0.00611437
11940.8;9609995710;0.00539858
11940.8;9615061485;0.00460205
11940.7;9620072142;0.0039288
11940.7;9625444034;0.00297424
11940.7;9630541287;0.00278727
11940.7;9635345145;0.00262755
11940.8;9640857851;0.00391118
11940.9;9645197584;0.00441278
11941;9650390617;0.00498618
11941;9655074833;0.00508817
11941;9660163247;0.0045036
11941;9665498708;0.00394672
11941.1;9670996794;0.00350523
11941.1;9675497587;0.00282634
11941.2;9680795498;0.00215941
11941.1;9685237763;0.000791031
11941;9690363687;0.00131673
11940.9;9695177297;0.0018991
11941;9700586592;0.00249322
11941.1;9705904438;0.00347583
11941.1;9710796120;0.00458439
11941.2;9715252220;0.00516613
11941.2;9720213936;0.00593268
11941.3;9725006911;0.00668017
11941.2;9730059615;0.00629078
11941;9735617966;0.00471434
11940.9;9739914564;0.00373138
11940.9;9745563155;0.00433066
11940.9;9750047986;0.00459987
11940.9;9755856141;0.00488434
11940.9;9760208345;0.00397984
11940.9;9765139275;0.00344177
11940.9;9770262127;0.00301741
11941;9775696687;0.00263878
11941;9780900396;0.00147206
11941.1;9785725628;0.00141822
11941.1;9790396501;0.00223414
11941.2;9795791401;0.00202768
11941.2;9800762602;0.00222379
11941.2;9805181007;0.00246799
11941.2;9810679196;0.00229168
11941.3;9814981522;0.00213106
11941.2;9820932962;0.00271453
11941.2;9825274082;0.00355505
11941.2;9830303981;0.00448556
11941.1;9835892060;0.00379066
11941;9840141822;0.00363011
11940.9;9844974001;0.00356996
11941;9850367285;0.00439266
11941;9855844872;0.00403569
11941.1;9860855557;0.00373523
11941;9865214165;0.00264259
11940.9;9870308786;0.0020975
11940.9;9874990166;0.00225047
11940.9;9880405065;0.00273023
11940.8;9885724255;0.00302697
11940.8;9890692537;0.0035332
11940.8;9895668237;0.00442843
11940.8;9900231667;0.00551267
11940.8;9905163748;0.00670083
11940.8;9910568654;0.00675698
11940.8;9915799579;0.00693885
11940.8;9920437595;0.0072415
11940.8;9925118104;0.00776704
11940.8;9930564714;0.00666824
11940.8;9935061541;0.00561693
11940.8;9940017086;0.00461863
11940.9;9945132062;0.00485818
11940.9;9950129115;0.00510106
11941;9955595114;0.0049082
11941;9960456760;0.00417812
11941.1;9965575733;0.00371551
11941.2;9970020471;0.00406739
11941.3;9975033147;0.00474649
11941.3;9980575544;0.00559858
11941.3;9985181337;0.00471529
11941.2;9990691387;0.0036105
11941.1;9994943316;0.00307892
11941.1;10000722377;0.0043303
11941.1;10005888407;0.00463859
11941.1;10010758991;0.00497886
11941.1;10015181343;0.00497545
11941.1;10020210646;0.00513617
11941.1;10025043981;0.0052898
11941.1;10030505921;0.00539894
11941;10035919024;0.00570169
11940.9;10040635488;0.00646247
11940.8;10045209365;0.00745531
11940.8;10050403006;0.00803624
11940.8;10055306365;0.00865479
11940.8;10060883191;0.00924195
11940.8;10065072287;0.010124
11940.8;10070134656;0.0110152
11940.8;10075615742;0.0113356
11940.7;10080182519;0.0105983
11940.7;10084997153;0.00988229
11940.8;10090458536;0.00871664
11940.9;10096027206;0.00763736
11941;10100873295;0.00668622
11941;10105359824;0.00588986
11940.9;10110809273;0.00572612
11940.9;10116075577;0.0056765
11940.8;10120864622;0.00573808
11940.8;10124864305;0.00473093
11940.7;10130718921;0.00376745
11940.8;10135290901;0.00179825
11940.9;10140776302;0.000449882
11940.9;10145809516;0.00160439
11941;10150234015;0.00258989
11941;10155465949;0.00331934
11941;10160213714;0.00409518
11941;10165556376;0.00432824
11940.9;10170844443;0.00398817
11940.9;10174857933;0.00365101
11940.9;10180346690;0.00346633
11941;10185481706;0.00260932
11941.1;10190814556;0.00187689
11941.2;10195355057;0.00176445
11941.2;10200527366;0.00300781
11941.3;10205778824;0.00424336
11941.2;10210289482;0.00441982
11941.2;10215733504;0.00458134
11941.1;10220675637;0.00475056
11941.1;10225036457;0.00402898
11941;10230369449;0.00215434
11940.9;10235616137;0.000893438
11940.9;10240251674;0.00141318
11940.9;10245301442;0.00186124
11940.9;10250938064;0.00230306
11941;10255725070;0.00289122
11941;10260900441;0.00319796
11941;10265481521;0.00364951
11941;10270020940;0.00351401
11941.1;10274899477;0.00224112
11941.1;10280979014;0.00100342
11941.1;10285384857;0.000224941
11941.1;10289980519;0.000471514
11941.1;10295932751;0.000981251
11941.1;10300862293;0.00199429
11941.1;10304851558;0.00196773
11941.1;10310140278;0.00201001
11941.1;10315617960;0.00289321
11941.1;10320681908;0.00277571
11941.1;10325315277;0.00286054
11941.1;10330069078;0.0031134
11941.1;10335145488;0.00348349
11941.1;10340912910;0.00385442
11941;10345306456;0.0029663
11941;10350710111;0.00186297
11941;10355657166;0.000808028
11941;10360190255;0.000393665
11941.1;10365651961;0.000625172
11941.1;10370436505;0.000855458
11941.2;10375792365;0.00105909
11941.2;10380950610;0.00130206
11941.2;10386757589;0.00156787
11941.1;10390510172;0.0014749
11941;10395517154;0.00181027
11940.9;10400891555;0.00229192
11940.9;10405358977;0.00338807
11940.8;10410183432;0.00394864
11940.7;10415545135;0.00456872
11940.6;10420014384;0.00470165
11940.6;10424885877;0.00491075
11940.6;10430915269;0.00517486
11940.7;10435355816;0.00422856
11940.7;10440653278;0.00331703
11940.8;10445653829;0.00275846
11940.9;10450118549;0.00291843
11940.9;10455182025;0.00336542
11941;10460364781;0.0038102
11940.9;10465885937;0.00483973
11940.9;10470927422;0.00566252
11940.8;10475241284;0.00651032
11941;10480766106;0.00526057
11941.1;10485885319;0.00383044
11941.3;10490932135;0.00385307
11941.2;10495292158;0.00403576
11941.2;10500795122;0.00383462
11941.2;10505692416;0.00401571
11941.1;10510218198;0.0045756
11941.1;10515362847;0.00488885
11941.1;10520575594;0.0052536
11941.1;10525152130;0.00564084
11941.1;10530334180;0.00489808
11941.1;10535435875;0.0043304
11941.1;10540252045;0.00388377
11941.1;10545355959;0.00370836
11941.2;10550711066;0.00352938
11941.2;10555867435;0.00336451
11941.2;10560375430;0.00359524
11941.2;10565137387;0.00386263
11941.1;10570609000;0.00480298
11941.1;10575707288;0.00358748
