Distance;Time;Velocity Kalman
0;172230;0
0;4310310;0
0;9314023;0
0;14967154;0
0;19572510;0
0;24984869;0
0;29811678;0
0;34467238;0
0;39507679;0
0;44302126;0
0;49728390;0
0;54320283;0
0;59917500;0
0;64747010;0
0;69394022;0
0;74210666;0
0;79918499;0
0;84826469;0
0;89488996;0
0;94224285;0
0;99166073;0
0;104694498;0
0;109461453;0
0;114542874;0
0;120157900;0
0;124733261;0
0;129489943;0
0;135020131;0
0;139965897;0
0;144937159;0
0;149612272;0
0;155094537;0
0;159939780;0
0;164121721;0
0;169634084;0
0;174413445;0
0;179500179;0
0;185009179;0
0;189699627;0
0;194801770;0
0;199365928;0
0;204745819;0
0;209220944;0
0;214734962;0
0;219132814;0
0;224738757;0
0;229497417;0
0;234898130;0
0;239385656;0
0;244502710;0
0;249893880;0
0;254247775;0
0;259170924;0
2.38799;264548133;0.0238799
4.7125;269969311;0.047125
6.97427;274508399;0.0697427
9.1733;279144155;0.0917329
13.5616;284560459;0.135616
17.8285;290085200;0.178285
21.9741;294190149;0.219741
28.1159;299830724;0.281159
34.0814;304469704;0.340814
39.8725;309549131;0.398725
47.4706;314896427;0.474706
54.8441;319296996;0.548441
61.9947;325057856;0.619947
68.9236;329783086;0.689236
77.4785;334299688;0.774785
85.7675;339824556;0.857675
93.7931;344497951;0.937931
103.284;349942460;1.03284
112.471;354378534;1.12471
121.359;359044793;1.18971
131.651;364463732;1.26939
141.606;369983572;1.34632
151.226;374764002;1.42053
160.516;379668805;1.46954
171.173;384351873;1.53345
181.465;389836119;1.5949
191.395;394096540;1.63279
202.653;399425157;1.68572
213.517;404818331;1.73644
223.99;408993579;1.7652
235.755;414448850;1.80911
247.098;419923792;1.85103
258.025;424607047;1.89102
268.543;429321573;1.91065
280.325;434733428;1.94557
291.667;439253079;1.97874
302.577;444287086;1.99293
314.719;449700909;2.02247
326.399;454998598;2.05041
337.627;459526622;2.05976
348.41;464142694;2.06804
360.404;469651592;2.09178
371.925;474410832;2.11409
382.983;479264346;2.1181
395.226;484713193;2.13761
406.979;489197987;2.15584
418.253;494516450;2.156
430.686;499474676;2.1717
442.616;504865119;2.18625
454.051;509091924;2.18296
466.622;514573056;2.19525
478.677;519990015;2.20652
490.225;524704950;2.21682
501.276;529137141;2.20952
513.453;534489554;2.21786
525.112;540025343;2.22535
536.264;544317408;2.21546
548.522;549881422;2.22122
560.252;554295724;2.22625
571.467;559232902;2.23058
583.77;564709284;2.23366
595.537;570143620;2.23612
606.78;574770577;2.23797
617.512;580060754;2.22286
629.326;584453692;2.22347
640.61;590038433;2.22356
651.376;594218794;2.20689
663.209;600005926;2.20593
674.507;604383568;2.20456
685.281;609967325;2.18658
697.108;614370361;2.18432
708.396;619977187;2.18172
719.156;624967869;2.1788
729.401;629785320;2.15948
740.698;634173595;2.15586
751.465;639627558;2.15201
761.714;644387457;2.13192
773.003;649946533;2.1275
783.758;654347418;2.12291
793.993;659091158;2.10223
805.256;664541077;2.0972
815.985;669946099;2.09205
826.191;674656802;2.08679
835.887;679143770;2.06561
846.614;684504141;2.06005
856.818;690082899;2.05442
866.511;694937165;2.03302
877.225;699406876;2.02718
887.414;704683615;2.02134
897.092;709156908;1.99984
906.272;714682154;1.97876
916.476;720132233;1.9732
926.168;724756961;1.96768
935.362;729881765;1.94664
945.57;734230296;1.94105
955.266;739706148;1.93553
964.464;744464837;1.91461
974.667;749990721;1.90909
984.358;754327533;1.90365
993.55;759815580;1.88294
1003.74;764336695;1.87754
1013.42;769787938;1.87226
1022.6;774451036;1.86709
1031.29;779328114;1.84675
1040.98;784776415;1.84165
1050.18;789560181;1.83669
1058.89;795077945;1.81667
1068.6;799877955;1.81181
1077.8;804261203;1.8071
1086.53;809283623;1.80253
1096.23;815013921;1.79755
1105.44;819514703;1.79272
1114.17;824243359;1.78805
1122.42;829760472;1.76852
1131.67;834145382;1.764
1140.43;839545356;1.75963
1148.72;844290847;1.74051
1157.99;849797945;1.7363
1166.78;854126622;1.73226
1175.1;859545400;1.71357
1182.96;864293139;1.69543
1191.81;869818563;1.69211
1200.18;874588316;1.68895
1208.11;879891778;1.67123
1217;884276472;1.66824
1225.43;889699733;1.66541
1233.41;894231685;1.64812
1242.35;899844164;1.64545
1250.82;904246656;1.64295
1258.84;909069155;1.62608
1267.81;914655996;1.62373
1276.32;920129900;1.62155
1284.38;924761961;1.61954
1291.99;929926468;1.60323
1300.56;934382381;1.60135
1308.68;939822264;1.59963
1316.36;944286747;1.58371
1324.99;949683075;1.58211
1333.16;955204936;1.58067
1340.9;959728329;1.57939
1349.57;964222286;1.57769
1357.8;969535424;1.57614
1365.58;974121372;1.57475
1372.94;979753479;1.55932
1381.24;984114812;1.55802
1389.09;989555243;1.55687
1396.53;994449878;1.54177
1404.89;999149036;1.54071
1412.82;1004499556;1.53979
1420.31;1009901277;1.52501
1428.74;1014318444;1.52417
1436.72;1019865739;1.52347
1444.28;1024603286;1.5229
1451.42;1029146274;1.50856
1459.48;1034888057;1.50804
1467.12;1039718784;1.50766
1474.35;1045112628;1.49359
1482.49;1049614425;1.49326
1490.2;1055045916;1.49305
1497.5;1059479519;1.47924
1505.71;1064073358;1.47907
1513.48;1069494475;1.47902
1520.84;1074291264;1.47908
1527.8;1079206641;1.46564
1535.67;1084647561;1.46572
1543.12;1089252620;1.46591
1550.16;1094263995;1.45269
1558.11;1099651013;1.45289
1565.63;1104954784;1.4532
1572.76;1109453800;1.44017
1579.48;1114997291;1.4276
1587.11;1119539413;1.42836
1594.34;1124306945;1.42921
1601.17;1129210989;1.41681
1608.89;1134659846;1.41764
1616.2;1139231066;1.41856
1623.12;1144234441;1.40633
1630.92;1149730343;1.40722
1638.32;1154076790;1.4082
1645.32;1159423149;1.39611
1653.19;1164953863;1.39705
1660.65;1169405588;1.39807
1667.72;1175091003;1.39918
1674.4;1179052050;1.3873
1681.95;1184501500;1.38834
1689.11;1190098739;1.38947
1695.88;1194177324;1.37769
1703.51;1199735050;1.37875
1710.74;1204122667;1.37988
1717.59;1209168842;1.38109
1725.29;1214927515;1.38181
1732.6;1219358724;1.3826
1739.51;1225009998;1.38346
1746.05;1229768464;1.3716
1753.44;1234132257;1.37238
1760.44;1239659209;1.37323
1767.07;1244798239;1.36144
1774.54;1249312260;1.3622
1781.62;1254745928;1.36303
1788.32;1259265486;1.35132
1794.65;1264161106;1.34
1801.83;1269660419;1.34112
1808.63;1274363717;1.34231
1815.06;1279336396;1.33105
1822.32;1284778139;1.33214
1829.2;1289433311;1.33329
1835.72;1294924153;1.32208
1843.06;1299501751;1.32313
1850.02;1304931652;1.32423
1856.6;1309879427;1.31308
1864.01;1314352656;1.31408
1871.03;1319870317;1.31514
1877.67;1324582889;1.31626
1883.96;1329102848;1.30521
1891.06;1334469204;1.30621
1897.8;1339211491;1.30727
1904.16;1344628786;1.29625
1911.34;1349365956;1.29719
1918.14;1354810528;1.29819
1924.58;1359876157;1.29925
1931.81;1364373325;1.29981
1938.67;1369801851;1.30044
1945.17;1374384867;1.30112
1951.31;1379973717;1.2899
1958.25;1384347624;1.29045
1964.83;1389856013;1.29107
1971.05;1394188982;1.27988
1978.05;1399838374;1.28037
1984.69;1404210454;1.28092
1990.98;1409233850;1.26976
1998.04;1414676612;1.27018
2004.74;1420131018;1.27068
2011.09;1425126455;1.27124
2017.08;1429369644;1.26017
2023.86;1434859950;1.2606
2030.27;1439849644;1.26109
2036.34;1444631589;1.25005
2043.18;1449121424;1.25042
2049.66;1454482756;1.25085
2055.8;1459701420;1.23985
2062.69;1464148046;1.24015
2069.22;1469534448;1.24053
2075.41;1474192209;1.24097
2081.26;1479189570;1.23007
2087.86;1484547682;1.23038
2094.12;1489312621;1.23076
2100.04;1494498163;1.21989
2106.71;1499878572;1.22014
2113.03;1504208552;1.22046
2119.01;1509183566;1.20963
2125.72;1514723947;1.20982
2132.09;1520106328;1.21009
2138.12;1524766641;1.21042
2143.82;1529407158;1.1997
2150.26;1534958186;1.1999
2156.36;1539803803;1.20018
2162.13;1544800444;1.18948
2168.62;1549407564;1.18963
2174.78;1554884681;1.18985
2180.61;1558999362;1.17919
2187.15;1564343106;1.17928
2193.35;1569729338;1.17945
2199.23;1574489858;1.17969
2204.78;1580029742;1.16914
2211.05;1584320565;1.16925
2216.98;1590032200;1.16943
2222.6;1595069332;1.15892
2228.92;1599822559;1.15897
2234.92;1604162882;1.15909
2240.59;1609967113;1.14862
2246.96;1614477635;1.14861
2252.99;1619816750;1.14869
2258.71;1624433052;1.14884
2264.11;1629565894;1.13848
2270.21;1634967925;1.13849
2275.99;1639881274;1.13858
2281.45;1644873238;1.12826
2287.6;1649395246;1.12822
2293.43;1654748010;1.12825
2298.95;1659255775;1.11797
2304.16;1664882775;1.10804
2310.05;1669367203;1.10828
2315.64;1674119440;1.10861
2320.92;1679769404;1.0987
2326.87;1684170931;1.09889
2332.51;1689719207;1.09915
2337.85;1694796839;1.08927
2343.86;1699422278;1.0894
2349.55;1704882138;1.0896
2354.93;1709921621;1.07976
2360.98;1714392477;1.07982
2366.71;1719834601;1.07997
2372.13;1724330479;1.08019
2377.26;1729494475;1.07046
2383.04;1734996642;1.07053
2388.52;1739887736;1.07068
2393.7;1744787626;1.06098
2399.53;1749585016;1.06099
2405.05;1754966430;1.06107
2410.28;1759832109;1.06124
2416.15;1764354154;1.06092
2421.71;1769782568;1.06069
2426.97;1774407242;1.06053
2431.94;1780048225;1.0507
2437.55;1784346212;1.0504
2442.87;1789894588;1.05018
2447.89;1794645630;1.04038
2453.55;1799542787;1.04001
2458.9;1804866506;1.03972
2463.97;1809242661;1.02996
2469.66;1814753093;1.02953
2475.05;1819225459;1.02919
2480.15;1824110693;1.02893
2484.97;1829960271;1.01929
2490.41;1834446500;1.01888
2495.56;1839149744;1.01856
2500.43;1844945504;1.00895
2505.9;1849423437;1.00848
2511.09;1854736272;1.00811
2516;1859467379;0.998531
2521.51;1864934033;0.998013
2526.73;1869750204;0.997585
2531.67;1874870933;0.997245
2536.33;1880030625;0.987794
2540.74;1885006363;0.978664
2544.88;1889567028;0.969853
2549.64;1894368995;0.960893
2554.13;1899915666;0.952255
2558.36;1904299398;0.943932
2563.2;1909916146;0.935459
2567.78;1914397709;0.927305
2572.1;1919590440;0.919463
2577.01;1924409747;0.920384
2581.65;1929867986;0.912467
2586.04;1934500660;0.904858
2591.02;1939928356;0.905917
2595.73;1944523015;0.898227
2600.18;1949199541;0.890842
2605.2;1954587768;0.892026
2609.96;1959092926;0.884552
2614.47;1964363789;0.877377
2618.72;1969737446;0.870496
2623.54;1974624367;0.872082
2628.11;1979126993;0.873735
2632.42;1984964926;0.875448
2637.3;1989870013;0.876663
2641.92;1994357430;0.877942
2646.29;1999272669;0.87928
2651.22;2004686826;0.88012
2655.88;2009123283;0.881025
2660.29;2014919262;0.881989
2665.25;2019489947;0.882456
2669.95;2025076715;0.882988
2674.4;2029693523;0.883583
2678.6;2034618230;0.875872
2683.35;2039179697;0.876245
2687.84;2044946372;0.876683
2692.09;2049448928;0.86891
2696.88;2054800144;0.869131
2701.41;2059355146;0.869419
2705.69;2064702847;0.869771
2710.51;2069232136;0.86963
2715.06;2074869185;0.869558
2719.38;2079575833;0.869554
2723.46;2084502035;0.861528
2728.05;2089170077;0.861309
2732.41;2094970972;0.861161
2736.52;2099108016;0.853087
2741.15;2104661608;0.852729
2745.54;2109182168;0.852447
2749.69;2115075596;0.844335
2754.34;2119619248;0.84385
2758.75;2125028878;0.843444
2762.92;2129641488;0.843114
2767.58;2135178018;0.842304
2772;2139932862;0.841578
2776.19;2144533134;0.840932
2780.86;2149977355;0.83981
2785.29;2154360591;0.838777
2789.48;2159860235;0.83783
2794.15;2164287084;0.836411
2798.57;2169669405;0.835087
2802.76;2175127679;0.833854
2806.73;2179127158;0.832708
2811.16;2184629409;0.831094
2815.37;2189335054;0.829577
2819.34;2195214102;0.828153
2823.78;2199815216;0.826268
2827.99;2204250044;0.824485
2831.97;2209535665;0.822801
2836.4;2214994787;0.820661
2840.61;2219531074;0.81863
2844.59;2224458248;0.816705
2848.34;2229246418;0.807625
2852.56;2234840319;0.805541
2856.54;2239613215;0.803569
2860.31;2244710209;0.79454
2865.18;2249167628;0.798939
2869.81;2254523166;0.803281
2874.2;2259399273;0.800492
2879;2264999035;0.804256
2883.56;2269503912;0.807974
2887.89;2274111837;0.811642
2891.99;2279086820;0.808277
2896.5;2284408469;0.811378
2900.78;2289934359;0.814439
2904.84;2295022367;0.810571
2909.3;2299447908;0.813083
2913.52;2304894248;0.815567
2917.53;2309093641;0.811224
2921.93;2314501466;0.81318
2926.1;2319947109;0.815118
2930.05;2324503153;0.817038
2933.78;2329133846;0.812233
2937.91;2334493742;0.813641
2941.82;2340172995;0.815043
2945.51;2344292718;0.803305
2949.59;2349814458;0.797871
2953.46;2354195519;0.792615
2957.11;2359986973;0.781106
2961.14;2364502870;0.775815
2964.96;2369876799;0.77071
2968.57;2374399121;0.765787
2971.98;2379443603;0.75471
2975.76;2384935392;0.749759
2979.34;2390021121;0.744998
2982.71;2394568509;0.734178
2986.46;2399398153;0.729396
2990.01;2404742882;0.724807
2993.35;2410049852;0.714257
2997.06;2414465391;0.709653
3000.57;2419866755;0.705245
3003.88;2424461512;0.701029
3007;2429977746;0.690942
3010.49;2434289911;0.686705
3013.78;2439827704;0.682662
3016.88;2444134271;0.672842
3020.33;2449566725;0.668778
3023.6;2454871072;0.664909
3026.68;2459398033;0.655355
3030.11;2464819262;0.651463
3033.35;2469317006;0.647766
3036.4;2474208103;0.644259
3039.28;2479107765;0.635154
3042.5;2484629409;0.631611
3045.54;2489327265;0.628257
3048.4;2494230598;0.619398
3051.61;2499690777;0.616005
3054.63;2505098535;0.612799
3057.48;2509230259;0.604179
3060.66;2514815801;0.600929
3063.67;2519250797;0.597866
3066.5;2524305544;0.594984
3069.66;2529691000;0.591724
3072.64;2534052040;0.58865
3075.45;2539544311;0.585755
3078.1;2544496275;0.577622
3081.07;2549837627;0.57466
3083.87;2554095421;0.571878
3086.5;2559474907;0.563946
3089.46;2564948569;0.561091
3092.24;2569681019;0.558413
3094.87;2574299948;0.555906
3097.33;2579846760;0.548335
3100.11;2584518737;0.54574
3102.73;2589402197;0.543313
3105.2;2594471002;0.535914
3107.97;2599176300;0.533394
3110.58;2604650808;0.531041
3113.04;2609564514;0.523805
3115.8;2614927171;0.521352
3118.41;2619406106;0.519065
3120.86;2624391291;0.511986
3123.16;2629065446;0.505193
3125.76;2634566280;0.50308
3128.21;2639215328;0.501126
3130.51;2644956471;0.494465
3133.11;2649434402;0.492388
3135.55;2654841807;0.490467
3137.85;2659590085;0.48393
3140.43;2664193776;0.48188
3142.86;2669633835;0.479985
3145.16;2674186868;0.47824
3147.31;2680019912;0.471964
3149.74;2684331174;0.470073
3152.03;2689959903;0.46833
3154.19;2694859949;0.462147
3156.61;2699172766;0.460254
3158.9;2704414741;0.458508
3161.05;2709864103;0.452412
3163.46;2714299345;0.450511
3165.73;2719657277;0.448756
3167.87;2724125066;0.447142
3169.89;2729713323;0.441265
3172.16;2735125186;0.439482
3174.3;2739821340;0.437839
3176.31;2745069026;0.432025
3178.57;2749530436;0.430209
3180.7;2754874284;0.428534
3182.71;2759504003;0.422779
3184.96;2764161919;0.420927
3187.08;2769542218;0.419216
3189.07;2774194417;0.417641
3190.95;2779750499;0.412072
3193.06;2784033788;0.410309
3195.05;2789833654;0.40868
3196.93;2794628207;0.403152
3199.03;2799329251;0.401334
3201.01;2804767541;0.399651
3202.87;2809741974;0.394161
3204.96;2814285824;0.392288
3206.93;2819658052;0.39055
3208.78;2824272097;0.388945
3210.52;2829911429;0.38362
3212.48;2834193267;0.381813
3214.32;2839849064;0.380138
3216.05;2844227898;0.374837
3218;2849762006;0.37296
3219.83;2854065837;0.371217
3221.55;2860064029;0.36594
3223.48;2864441474;0.363994
3225.29;2870008720;0.362183
3227;2874728256;0.360502
3228.6;2879895289;0.355377
3230.4;2884424884;0.353485
3232.1;2889146710;0.351724
3233.69;2894828382;0.346612
3235.47;2899263616;0.344641
3237.15;2904681757;0.342802
3238.73;2909271327;0.337706
3240.5;2914905909;0.335658
3242.16;2919255266;0.333743
3243.72;2924889461;0.331959
3245.45;2929336929;0.329748
3247.09;2934697573;0.327674
3248.63;2939531952;0.325732
3250.07;2944386378;0.320717
3251.69;2949794537;0.318558
3253.2;2954127585;0.316534
3254.63;2959557455;0.311531
3256.22;2965001290;0.309292
3257.72;2969720843;0.307189
3259.12;2974214047;0.305219
3260.44;2979371442;0.300361
3261.91;2984931107;0.298169
3263.3;2989665329;0.296112
3264.6;2994767058;0.291262
3266.05;2999222963;0.288986
3267.42;3004575388;0.286847
3268.7;3009284559;0.282008
3270.12;3014729255;0.279652
3271.46;3020197489;0.277434
3272.71;3025205551;0.272612
3274.11;3029780601;0.270179
3275.42;3034258360;0.267888
3276.64;3040003273;0.265734
3277.79;3044773379;0.261064
3279.07;3049259784;0.258689
3280.28;3054615446;0.256452
3281.4;3059304345;0.251795
3282.45;3064128982;0.247336
3283.63;3069486495;0.245075
3284.73;3074163777;0.24295
3285.76;3079660738;0.238495
3286.92;3084097168;0.236145
3287.99;3089549984;0.233934
3289;3094993407;0.229487
3290.12;3099341888;0.227051
3291.17;3104619461;0.224757
3292.15;3108978503;0.220322
3293.24;3114363347;0.217805
3294.26;3119715645;0.215433
3295.21;3124289844;0.211013
3296.09;3129948679;0.206785
3297.08;3134262801;0.204381
3298;3140089207;0.202118
3298.86;3144311474;0.197897
3299.82;3149935305;0.195407
3300.71;3154430539;0.19306
3301.54;3159869502;0.190852
3302.45;3164294103;0.188227
3303.31;3169593923;0.185746
3304.1;3174071899;0.183408
3304.85;3179261623;0.179296
3305.67;3184777636;0.176726
3306.43;3189672106;0.174299
3307.14;3194704356;0.170193
3307.93;3199103261;0.167537
3308.66;3204476992;0.165026
3309.33;3209508936;0.160931
3310.08;3214793398;0.158193
3310.77;3219220038;0.155603
3311.41;3224301414;0.153157
3312.11;3229623128;0.150299
3312.76;3235109363;0.147591
3313.37;3239891677;0.14503
3313.92;3244807483;0.141069
3314.53;3249189314;0.138276
3315.1;3254532556;0.135633
3315.62;3259826075;0.131684
3316.19;3264266099;0.128812
3316.71;3269752447;0.12609
3317.2;3274613949;0.123516
3317.64;3279422094;0.119728
3318.12;3284963028;0.116919
3318.57;3289888916;0.114259
3318.97;3295023160;0.11048
3319.41;3299649587;0.107588
3319.82;3305104917;0.104848
3320.19;3309964549;0.101083
3320.58;3314453078;0.0981125
3320.94;3319830493;0.0952964
3321.27;3324392750;0.0915494
3321.56;3329941721;0.087977
3321.88;3334312697;0.0851029
3322.16;3339881066;0.0823813
3322.42;3345027196;0.0788193
3322.69;3349432291;0.0758629
3322.93;3354899940;0.0730613
3323.14;3359744774;0.0695136
3323.33;3364720194;0.0661355
3323.52;3369332030;0.0632669
3323.69;3374990629;0.060551
3323.84;3379752150;0.0571787
3323.99;3384446666;0.0542234
3324.12;3389426979;0.051423
3324.22;3394419354;0.0480609
3324.32;3399888183;0.0450232
3324.4;3404375973;0.0421416
3324.46;3408949051;0.0387935
3324.51;3414536596;0.0356879
3324.54;3420026832;0.0327412
3324.56;3424615263;0.0299486
3324.55;3429363104;0.026779
3324.54;3434826278;0.0238361
