Distance;Time;Velocity Kalman
0;262904;5.28157e-05
0.000545915;5610131;5.56726e-05
0.000545915;10158004;5.08024e-05
0.000690534;15711098;5.08024e-05
0.000880262;20085937;5.08024e-05
0.00138107;25473648;5.08024e-05
0.00156326;29989210;5.08024e-05
0.00176052;35614642;5.28157e-05
0.00176052;40114229;4.81521e-05
0.00225087;44872391;5.08024e-05
0.00244141;50372760;5.08024e-05
0.00264078;55789391;4.81521e-05
0.00264078;60353220;4.60644e-05
0.00284714;64844614;4.60644e-05
0.00332067;70296082;4.60644e-05
0.00352105;75666114;4.60644e-05
0.00352105;80080927;4.40131e-05
0.00372664;85452682;4.15039e-05
0.00372664;89918099;3.93665e-05
0.00420035;95569029;4.20035e-05
0.00440131;99839383;3.93665e-05
0.00440131;105085357;3.93665e-05
0.00460644;109949501;3.93665e-05
0.00460644;115345388;3.72664e-05
0.00481521;119949216;3.49556e-05
0.00508024;125633301;3.52105e-05
0.00528157;130254083;3.52105e-05
0.00528157;135193046;3.52105e-05
0.00548638;140471462;3.27549e-05
0.00548638;144857353;3.05907e-05
0.00569429;150164418;3.05907e-05
0.00569429;155501369;3.05907e-05
0.00569429;159932348;2.84714e-05
0.00616183;165567090;2.84714e-05
0.00616183;170133615;2.64078e-05
0.00616183;175444268;2.64078e-05
0.00636641;179809887;2.64078e-05
0.00636641;185085923;2.64078e-05
0.00636641;190431080;2.18366e-05
0.00657369;195085460;2.18366e-05
0.00657369;200715095;2.18366e-05
0.00657369;205405825;1.96832e-05
0.00657369;210286552;1.96832e-05
0.00678342;214787886;1.96832e-05
0.00678342;219986621;1.77737e-05
0.00678342;225373800;1.54408e-05
0.00678342;229950400;1.54408e-05
0.0072465;235459296;1.76052e-05
0.0072465;240683125;1.76052e-05
0.0072465;245197199;1.56326e-05
0.0072465;250700882;1.56326e-05
0.0072465;254838839;1.56326e-05
0.0072465;260503745;1.09183e-05
0.0072465;264883795;1.09183e-05
0.00745329;270377574;1.31474e-05
0.00745329;274877660;1.09183e-05
0.00745329;280526967;1.09183e-05
0.00745329;285305617;1.09183e-05
0.00745329;290364431;8.80262e-06
0.00745329;294762291;8.80262e-06
0.00745329;300011032;8.80262e-06
0.00745329;305388363;8.80262e-06
0.00745329;310014165;6.90534e-06
0.00745329;315439866;6.90534e-06
0.00745329;320880591;6.90534e-06
0.00745329;325286447;6.90534e-06
0.00745329;329771448;2.44141e-06
0.00766228;335131628;4.88281e-06
0.00766228;340366141;4.88281e-06
0.00766228;345095515;4.88281e-06
0.00766228;350679855;4.88281e-06
0.00766228;355537434;4.88281e-06
0.00766228;359971342;4.88281e-06
0.00766228;364856298;2.44141e-06
0.00766228;370315072;2.44141e-06
0.00766228;375583343;2.44141e-06
0.00766228;380246198;2.44141e-06
0.00766228;385632263;2.44141e-06
0.00766228;390186594;2.44141e-06
0.00766228;395620877;2.44141e-06
0.00766228;399895017;2.44141e-06
0.00766228;405248787;2.44141e-06
0.00766228;410821340;2.44141e-06
0.00766228;415342416;2.44141e-06
0.00745329;420484559;0
0.00745329;424900870;0
0.00745329;430433297;2.44141e-06
0.00745329;435100900;2.44141e-06
0.00745329;440699037;2.44141e-06
0.00745329;445359682;2.44141e-06
0.00745329;449817736;2.44141e-06
0.00745329;455714487;2.44141e-06
0.00745329;460457806;2.44141e-06
0.00745329;464825898;2.44141e-06
0.00745329;470262216;2.44141e-06
0.00745329;475622454;2.44141e-06
0.00745329;480100454;2.44141e-06
0.00745329;484744264;2.44141e-06
0.00745329;490279235;2.44141e-06
0.00745329;494757272;2.44141e-06
0.00745329;499989720;2.44141e-06
0.00745329;505818827;2.44141e-06
0.00745329;510535455;2.44141e-06
0.00745329;515308171;0
0.00745329;520747146;0
0.00720939;525443623;4.88281e-06
0.00720939;529946066;4.88281e-06
0.00720939;534852668;4.88281e-06
0.00720939;540103803;4.88281e-06
0.00699539;545493376;5.45915e-06
0.00699539;550590093;5.45915e-06
0.00699539;554869940;5.45915e-06
0.00699539;560285603;5.45915e-06
0.00699539;565149940;5.45915e-06
0.00699539;570652370;5.45915e-06
0.00699539;575049869;5.45915e-06
0.00699539;580633573;5.45915e-06
77.9022;584918591;0.779085
77.9022;590278338;0.779085
77.9022;595128537;0.779085
77.9022;600730093;0.779085
77.9022;605301791;0.779085
92.089;609863524;0.920952
103.411;615455641;1.03418
112.973;620279321;1.12978
133.138;624814741;1.33143
151.095;630313565;1.51101
167.118;634779844;1.67124
181.33;640051584;1.81335
193.81;645559624;1.93816
215.756;649965299;2.15762
235.091;655270461;2.35097
262.407;660592329;2.62412
286.359;664902034;2.86364
307.212;670438603;3.07218
325.264;675203497;3.2527
350.217;680735538;2.72351
371.942;685361197;2.94078
390.807;690678740;3.12945
407.158;695479516;3.29297
429.539;699726747;3.51679
449.128;705037152;3.57083
466.266;710218533;3.629
488.581;715496783;3.75654
508.272;720821268;3.75177
525.654;725519106;3.74598
547.594;730166618;3.80511
567.11;735642518;3.85813
584.481;740477754;3.90701
606.058;744839782;3.90322
625.397;750060658;3.9032
642.744;755262007;3.80343
663.992;760746922;3.77635
683.171;765234159;3.75959
700.493;769871099;3.7523
721.452;775356334;3.71239
740.488;779829191;3.68557
757.787;785294159;3.66998
773.516;790152822;3.66384
792.698;795652415;3.63196
810.234;799903258;3.61152
830.949;805303207;3.64743
849.97;809881074;3.61457
867.44;815258057;3.59246
883.49;820208864;3.57924
902.587;825445175;3.55087
920.206;830902382;3.53195
936.466;835294839;3.52089
955.599;840077403;3.49648
973.322;845678971;3.48034
989.74;849977850;3.47108
1004.95;855368689;3.41067
1022.91;859928924;3.39853
1039.61;865457722;3.39233
1055.14;870088992;3.33798
1073.28;875510623;3.32904
1090.2;879962825;3.32525
1109.59;885616937;3.36185
1127.72;890201932;3.35131
1144.67;894774624;3.34545
1160.51;900478060;3.29669
1178.76;904831827;3.28888
1195.85;910643996;3.28511
1211.86;914658509;3.28473
1230.18;920047352;3.27695
1247.39;925356042;3.27278
1263.54;929942745;3.27167
1278.69;935538611;3.2318
1296.09;939839677;3.22856
1312.45;945222384;3.22802
1327.83;950092957;3.22973
1345.39;955484850;3.22565
1361.93;960066590;3.22402
1377.5;965445150;3.22446
1395.19;969776629;3.21987
1411.87;975034621;3.21748
1427.6;980520446;3.18085
1445.38;984776578;3.17739
1462.18;990142659;3.17587
1478.04;995044921;3.17597
1492.99;1000025492;3.14302
1509.97;1005368591;3.14189
1526.01;1009876041;3.14219
1541.16;1015311953;3.11043
1558.3;1020748347;3.10974
1574.51;1025516537;3.11031
1589.82;1030003864;3.11195
1604.27;1035447546;3.08245
1620.7;1040899764;3.08308
1636.24;1045435668;3.08465
1650.92;1050342645;3.05584
1667.54;1055783331;3.05663
1683.27;1060304331;3.05825
1698.15;1065500816;3.03016
1714.94;1069811839;3.03121
1730.84;1075536182;3.03298
1745.89;1080170821;3.00561
1760.12;1085018831;2.9798
1776.25;1090452959;2.98255
1791.52;1094798370;2.98581
1805.96;1100159389;2.96042
1822.3;1105590166;2.96326
1837.77;1110029858;2.96655
1852.42;1115465569;2.94163
1868.93;1120888561;2.94464
1884.58;1125513027;2.94803
1899.41;1129952739;2.95173
1913.42;1134811455;2.9276
1929.31;1140035151;2.93105
1944.36;1145141172;2.93478
1961.24;1150739393;2.93735
1977.26;1155345259;2.94024
1992.45;1160796947;2.94334
2006.83;1165349998;2.9192
2020.41;1170404334;2.89603
2035.86;1175818062;2.89998
2050.49;1180145748;2.90408
2064.33;1185694619;2.88117
2080.01;1190102005;2.88523
2094.88;1195368310;2.88942
2108.95;1200272558;2.86682
2124.84;1205608184;2.87102
2139.92;1210079440;2.87533
2154.2;1215026816;2.85302
2170.29;1220291042;2.85738
2185.56;1225522515;2.86182
2200.03;1229801475;2.86634
2213.72;1234685722;2.84438
2229.23;1240184077;2.84893
2243.93;1245726694;2.82717
2257.85;1250210968;2.80614
2271.01;1254788428;2.78585
2286;1260071441;2.79195
2300.2;1265516781;2.79805
2313.63;1269986020;2.77794
2326.32;1275121560;2.75852
2340.85;1280851307;2.76536
2354.6;1285324552;2.74608
2367.61;1290637294;2.72748
2382.43;1295028156;2.73503
2396.48;1300283709;2.71657
2409.78;1305111345;2.69876
2424.89;1310901314;2.707
2439.21;1315869152;2.68932
2452.77;1320391493;2.67227
2465.6;1325532007;2.65585
2480.24;1330190066;2.66534
2494.11;1335679571;2.649
2507.24;1340679550;2.63327
2522.17;1345124634;2.64334
2536.33;1350516500;2.65333
2549.74;1355572152;2.63755
2564.93;1360208487;2.64748
2579.35;1365673725;2.65731
2593.01;1370216909;2.66703
2608.44;1375600991;2.67609
2623.1;1380105603;2.68506
2636.99;1385249630;2.69391
2652.63;1390863532;2.70209
2667.49;1395489891;2.71016
2681.58;1399857472;2.71812
2697.42;1405230869;2.72541
2712.46;1410719271;2.7326
2726.73;1415669180;2.73967
2742.73;1419965314;2.77137
2757.93;1425346462;2.777
2772.35;1429989401;2.78252
2786.03;1434796845;2.78794
2801.43;1440093195;2.79268
2816.06;1445495574;2.79734
2829.92;1450251749;2.80189
2845.5;1455609438;2.80579
2860.3;1460122642;2.8096
2874.34;1465712941;2.81333
2890.08;1470093331;2.81641
2905.03;1474890650;2.81943
2919.22;1480204278;2.82237
2932.65;1485066920;2.8003
2947.8;1490642185;2.8032
2962.18;1495279381;2.80603
2975.81;1500405867;2.78397
2991.13;1504937036;2.78678
3005.68;1510455532;2.78955
3019.47;1515322007;2.76752
3034.95;1520735229;2.77028
3049.65;1525469790;2.77302
3063.59;1530142134;2.77571
3076.8;1534899191;2.7537
3091.69;1540188540;2.7564
3105.82;1545608781;2.75908
3121.61;1550079124;2.76116
3136.62;1555769474;2.76322
3150.86;1560401484;2.76527
3164.35;1564895407;2.74283
3177.13;1570231866;2.721
3191.58;1575596800;2.72371
3205.29;1580005370;2.7264
3218.27;1585303232;2.70471
3232.92;1589879420;2.70745
3246.82;1595371047;2.71018
3259.99;1600433370;2.68863
3274.81;1605081257;2.69142
3288.89;1610550497;2.6942
3302.23;1614981488;2.6728
3314.85;1620494587;2.65201
3329.14;1624798030;2.65548
3342.69;1630094059;2.65895
3355.52;1635801914;2.63832
3370;1640435900;2.64184
3383.74;1645061154;2.62136
3396.76;1650595402;2.60151
3409.08;1655589567;2.58227
3423.06;1660255146;2.58709
3436.31;1664794953;2.5919
3448.86;1670069364;2.57279
3460.71;1675172955;2.55429
3474.24;1680914276;2.55973
3487.05;1685517759;2.54135
3499.17;1689881159;2.52357
3510.62;1694852015;2.50638
3523.74;1700148567;2.48931
3536.17;1705420077;2.47284
3547.92;1710385767;2.45695
3561.32;1714861882;2.4648
3574.03;1720322345;2.44898
3586.06;1725796194;2.43373
3597.42;1730323165;2.41904
3608.14;1735130959;2.38137
3620.54;1740402241;2.36794
3632.27;1744846979;2.35505
3643.35;1749711021;2.3427
3656.1;1755059738;2.33041
3668.17;1760682280;2.31864
3679.59;1765330040;2.30739
3690.37;1769989499;2.29664
3702.83;1775304283;2.28592
3714.62;1780547525;2.27569
3728.04;1784869611;2.28874
3740.78;1790335608;2.30166
3752.86;1795168146;2.29118
3764.28;1800058583;2.28116
3777.34;1805463648;2.2943
3789.73;1809887342;2.28411
3801.46;1815092007;2.27436
3814.82;1820333186;2.28766
3827.49;1825698937;2.30079
3839.51;1830220280;2.31373
3853.13;1835480148;2.32593
3866.06;1839711155;2.33796
3878.32;1845074743;2.34978
3889.94;1850448671;2.33843
3903.16;1855879002;2.34992
3915.71;1860482606;2.36121
3929.83;1864892506;2.39464
3943.26;1870251824;2.40438
3956.01;1875573296;2.41394
3968.09;1880269008;2.4005
3981.75;1885778466;2.40971
3994.73;1890282548;2.41874
4007.03;1895696313;2.42757
4020.91;1900075904;2.43566
4034.09;1904968941;2.44357
4048.8;1910482827;2.47336
4062.79;1915033103;2.47977
4076.09;1919708753;2.48602
4090.91;1925143758;2.51406
4105.01;1930376829;2.51884
4120.59;1934829589;2.54534
4135.43;1940102151;2.57112
4149.55;1945384334;2.59617
4162.97;1949994344;2.59807
4177.87;1955352473;2.62163
4192.05;1960788172;2.62217
4205.52;1964863262;2.62259
4220.47;1970499866;2.64461
4234.68;1974736903;2.66597
4248.19;1980396493;2.66442
4263.17;1984739454;2.68441
4277.41;1990371015;2.70376
4290.94;1995717519;2.70034
4303.77;2000545295;2.69688
4318.08;2005111015;2.69285
4331.67;2010652573;2.6888
4344.56;2015275013;2.68476
4358.92;2020593184;2.68017
4372.56;2024896495;2.6756
4385.51;2030050281;2.64918
4399.9;2035408888;2.64471
4413.58;2040840801;2.64028
4426.55;2045497331;2.63591
4438.85;2050259070;2.60982
4452.6;2055795233;2.60559
4465.66;2060298944;2.60144
4478.03;2065637772;2.57568
4491.85;2070082934;2.57171
4504.97;2075456992;2.56783
4517.41;2080238979;2.54246
4531.28;2084879410;2.53879
4544.46;2090186751;2.53524
4556.95;2095288370;2.5318
4570.87;2100611661;2.52791
4584.08;2104980028;2.52414
4596.61;2110525166;2.5205
4608.48;2115155842;2.49556
4621.78;2120833471;2.49217
4634.39;2125562351;2.4889
4646.34;2130125548;2.46444
4657.64;2134978697;2.44068
4670.39;2140244331;2.43836
4682.46;2145631336;2.43619
4693.89;2150342137;2.4129
4706.76;2155654343;2.41099
4718.95;2160117088;2.40921
4730.49;2165551602;2.38642
4741.4;2169992828;2.36432
4753.75;2175250779;2.36348
4765.46;2180575725;2.34172
4776.52;2185220010;2.32065
4789.02;2190742288;2.32075
4800.87;2195547178;2.30001
4812.07;2199939001;2.27995
4824.71;2205361980;2.28095
4836.68;2209873365;2.28207
4848.02;2215247983;2.26244
4858.74;2219986032;2.24346
4870.89;2225467868;2.24544
4882.39;2229875629;2.24752
4893.28;2235114485;2.22893
4903.56;2240427705;2.21097
4915.28;2245815012;2.21385
4926.37;2250248513;2.19614
4936.85;2255580406;2.17905
4948.76;2260149516;2.1827
4960.04;2265432938;2.18641
4970.71;2270401024;2.16961
4982.8;2274963061;2.17344
4994.25;2280253899;2.17733
5005.1;2285642347;2.16077
5015.34;2290684006;2.14481
5027.01;2294994828;2.14935
5038.06;2300233296;2.13355
5048.51;2305617474;2.11831
5060.37;2309972033;2.12348
5071.6;2315346218;2.12868
5082.24;2320078252;2.1136
5094.27;2325439033;2.11882
5105.68;2329931025;2.12406
5116.49;2334681277;2.12931
5128.67;2340061285;2.13401
5140.24;2345321501;2.13872
5151.19;2350180702;2.14344
5163.52;2355024937;2.1476
5175.22;2360555101;2.15177
5186.31;2365517509;2.15593
5198.75;2369891024;2.15954
5210.57;2375237621;2.16315
5221.77;2380717144;2.16675
5234.32;2385446103;2.18974
5246.23;2389996828;2.19227
5257.54;2395425165;2.19479
5268.24;2399963215;2.19732
5280.29;2405284087;2.19928
5291.73;2409896412;2.20125
5302.56;2415234182;2.20322
5314.73;2420595009;2.20463
5326.29;2424849449;2.20606
5337.24;2430300043;2.20749
5347.6;2435399159;2.18927
5359.31;2439967859;2.19068
5370.4;2445589838;2.19211
5380.92;2449938118;2.17398
5390.85;2455647772;2.15638
5402.14;2459961549;2.15831
5412.83;2465388349;2.14079
5422.94;2469802618;2.1238
5432.5;2475649515;2.10733
5443.41;2480084712;2.09092
5453.74;2485436861;2.07503
5463.5;2490328208;2.05967
5474.6;2495740178;2.06365
5485.13;2499983330;2.04836
5495.08;2505250066;2.03358
5506.37;2509713102;2.03804
5517.07;2515169143;2.02332
5527.2;2520688813;2.0091
5536.77;2525662547;1.99538
5547.68;2530325297;2.0008
5558.02;2534854368;1.98712
5567.79;2540540480;1.97392
5578.89;2545022470;1.97976
5589.41;2550506252;1.98558
5599.37;2555438479;1.97237
5610.64;2560010155;1.9781
5621.32;2565527895;1.9838
5631.45;2570556063;1.98948
5642.86;2575035423;1.99458
5653.7;2580522602;1.99965
5663.97;2585195690;2.00469
5675.52;2590556144;2.00914
5686.48;2594949931;2.01357
5696.88;2600456748;2.01796
5706.72;2605716083;2.00359
5717.85;2610436931;2.00785
5728.4;2614998688;2.01208
5738.4;2619830323;2.01628
5749.67;2625170576;2.0199
5760.36;2630672105;2.02348
5770.5;2635744905;2.02704
5781.89;2640037353;2.03
5792.7;2645333764;2.03295
5802.96;2650646773;2.03588
5812.67;2655092407;2.02031
5823.63;2660596891;2.02311
5834.04;2664932298;2.02589
5843.89;2670689176;2.01028
5854.99;2675454475;2.01295
5865.53;2679936092;2.01561
5875.51;2685362561;1.99997
5884.96;2690700230;1.9848
5895.66;2695262392;1.98782
5905.8;2700773034;1.99082
5915.41;2704932336;1.97562
5926.25;2710429282;1.97853
5936.54;2714814789;1.98142
5946.29;2720081799;1.96621
5955.51;2725597934;1.95146
5965.97;2729909407;1.95472
5975.88;2735189689;1.93996
5985.27;2740534129;1.92567
5995.89;2744837697;1.92929
6005.95;2749877217;1.9329
6017.23;2755355979;1.93595
6027.94;2759888783;1.939
6038.09;2765393597;1.94205
6047.72;2770310497;1.92726
6058.55;2775713811;1.93021
6068.83;2780175979;1.93315
6080.29;2785577690;1.95325
6091.18;2790031966;1.95517
6101.51;2795650212;1.95709
6111.31;2800444747;1.95902
6122.29;2805222300;1.96038
6132.72;2810661957;1.96176
6142.6;2815354216;1.96314
6153.66;2820599247;1.98152
6164.16;2824929757;1.9819
6174.11;2830185645;1.98231
6183.54;2835303710;1.98273
6194.15;2840724755;1.98261
6204.21;2845422923;1.98251
6213.73;2850021141;1.96509
6222.75;2855485326;1.94815
6231.26;2860049133;1.93168
6240.97;2865584657;1.9325
6250.16;2870191158;1.91608
6258.84;2875065757;1.90016
6268.71;2880476420;1.88425
6278.06;2885826702;1.86883
6286.9;2890143214;1.85389
6295.25;2895636613;1.83944
6304.79;2899877190;1.825
6313.82;2905162697;1.81105
6322.36;2909924982;1.79757
6332.07;2915359869;1.7841
6341.27;2919915519;1.7711
6349.97;2925463373;1.75858
6358.19;2929991803;1.74651
6367.59;2935509709;1.73444
6376.49;2939771709;1.72283
6384.9;2945209035;1.71167
6394.48;2950652002;1.7173
6403.55;2954928061;1.72293
6413.77;2960544339;1.728
6423.46;2964927693;1.73308
6432.66;2970364008;1.73815
6441.36;2975189689;1.7265
6451.2;2979755067;1.73143
6460.54;2985034068;1.73635
6470.99;2990606892;1.75732
6480.91;2995263235;1.76123
6490.33;3000869169;1.76513
6499.26;3004864195;1.76901
6509.3;3010362677;1.77232
6518.83;3015730913;1.77562
6527.86;3020509462;1.7789
6538;3025438564;1.79804
6547.62;3029884727;1.80032
6556.74;3035356744;1.80258
6566.96;3040711698;1.82061
6576.67;3045416492;1.82188
6585.87;3049795446;1.82314
6594.58;3055268833;1.80815
6604.39;3059874052;1.80928
6613.7;3065158041;1.81042
6622.51;3070018139;1.81157
6632.42;3075473012;1.81216
6641.81;3079866764;1.81277
6650.72;3085170274;1.79734
6659.15;3090119475;1.78233
6668.66;3095530100;1.78328
6677.68;3099806443;1.78425
6686.22;3105044982;1.76927
6695.84;3110491851;1.77015
6704.96;3115045872;1.77105
6713.61;3120011064;1.75611
6723.31;3125539957;1.75693
6732.52;3129929617;1.7578
6742.77;3135325114;1.75814
6752.52;3140601930;1.75852
6761.76;3144907925;1.75895
6770.52;3149946334;1.75942
6780.33;3155349787;1.75937
6789.63;3159781046;1.75937
6798.46;3164995074;1.75942
6808.31;3170342306;1.75895
6817.67;3174805056;1.75854
6826.54;3179773030;1.75819
6836.43;3185165572;1.77285
6845.82;3190508475;1.77164
6854.73;3194745303;1.7705
6863.17;3200681731;1.76942
6872.63;3205288556;1.76785
6881.6;3209868413;1.76635
6890.1;3215076724;1.76491
6899.61;3220311319;1.763
6908.64;3225573974;1.76116
6917.19;3230358295;1.74417
6926.75;3235819113;1.74234
6935.82;3240445257;1.7406
6944.42;3245092134;1.73895
6952.55;3250521355;1.72224
6960.23;3255156132;1.70601
6968.94;3260733122;1.70486
6977.18;3265515993;1.68875
6984.98;3269885008;1.67312
6992.33;3275267791;1.65797
7000.71;3280504019;1.64284
7008.64;3284854970;1.62819
7016.13;3290608198;1.61403
7024.64;3294857284;1.61475
7032.69;3300066226;1.60069
7040.31;3305450222;1.5871
7048.93;3309789564;1.5883
7057.09;3315124381;1.57481
7064.82;3320156612;1.56178
7073.53;3325672862;1.56345
7081.8;3330392533;1.55051
7089.62;3335705724;1.53803
7097.02;3340846464;1.526
7105.41;3345415251;1.52856
7113.35;3350737764;1.53118
7120.87;3355115077;1.51927
7127.96;3360111327;1.5078
7136.06;3365616695;1.5108
7143.72;3370106271;1.51385
7150.96;3375745040;1.50245
7159.18;3380155446;1.50543
7166.98;3385273907;1.50844
7175.73;3390965666;1.51095
7184.04;3395809709;1.51351
7191.92;3400588307;1.51611
7199.37;3405488517;1.50444
7207.78;3410123115;1.50693
7215.76;3415639501;1.50947
7223.32;3420825583;1.49783
7231.82;3425558760;1.50025
7239.89;3430191595;1.50272
7247.54;3434810463;1.50522
7256.12;3440178537;1.5072
7264.27;3445582502;1.50921
7271.99;3449882728;1.51126
7279.3;3454912956;1.51334
7287.54;3460404072;1.51489
7295.36;3465639259;1.51648
7302.77;3470628592;1.51809
7311.1;3475285533;1.51919
7319.01;3479892960;1.52032
7326.5;3485376417;1.50763
7333.58;3489894158;1.49534
7340.26;3495091280;1.48344
7347.89;3500371930;1.48523
7355.11;3505100468;1.4733
7363.26;3510695012;1.47497
7370.98;3515108905;1.47667
7378.3;3519976462;1.46475
7386.53;3525339363;1.46633
7394.33;3529801404;1.46795
7401.73;3535652713;1.45604
7410.02;3539946725;1.45753
7417.9;3545219097;1.45908
7425.36;3550797465;1.46065
7433.72;3555552960;1.46172
7441.65;3560059129;1.46282
7449.16;3565586652;1.46397
7457.56;3570035258;1.4646
7465.54;3575368174;1.46529
7473.1;3580298257;1.46601
7481.53;3584977410;1.47953
7489.54;3590431660;1.49275
7497.13;3595490633;1.49237
7505.58;3599803316;1.50469
7513.61;3605126959;1.50351
7521.22;3610681631;1.5024
7528.43;3614857048;1.50134
7536.5;3620129104;1.49979
7544.16;3625406400;1.49831
7551.42;3630366065;1.49689
7559.52;3635806986;1.49499
7567.22;3640298336;1.49317
7574.5;3644788868;1.49142
7581.4;3650094313;1.47682
7590.38;3655534379;1.4873
7598.92;3660132250;1.49755
7607.03;3665444491;1.49471
7614.73;3670524730;1.49197
7623.25;3674917730;1.50153
7631.34;3680170426;1.49811
7639.02;3685654358;1.4948
7647.5;3690073652;1.5037
7655.55;3695412488;1.49974
7663.2;3699867963;1.49589
7671.64;3705078587;1.50418
7679.66;3710584662;1.51226
7687.26;3715747388;1.50759
7695.66;3720304355;1.51496
7703.63;3725085353;1.52215
7711.19;3730455438;1.51669
7718.35;3735473080;1.51137
7726.31;3739753807;1.51802
7733.85;3745229367;1.52451
7740.99;3750220727;1.50616
7748.92;3755634572;1.50003
7756.44;3760243866;1.49407
7763.56;3765003783;1.48829
7771.46;3770393881;1.48212
7778.95;3774933812;1.47614
7786.05;3779876979;1.47035
7793.91;3785147579;1.46418
7801.37;3790590768;1.4582
7808.44;3795154960;1.45242
7815.12;3799934949;1.43482
7822.58;3805290570;1.42918
7829.64;3809880443;1.42375
7836.32;3815472146;1.40659
7843.76;3819754105;1.4013
7850.81;3825264128;1.39622
7857.49;3829768958;1.39135
7863.79;3835395136;1.37484
7870.86;3840757221;1.37012
7877.55;3845521141;1.3656
7883.87;3849786888;1.34954
7890.96;3855094333;1.34517
7897.66;3860501821;1.34101
7904;3865294810;1.32541
7911.09;3870723842;1.32139
7917.81;3875398359;1.31758
7924.16;3879785334;1.30243
7930.15;3885679180;1.28777
7936.9;3890103042;1.2846
7943.28;3895462534;1.28162
7949.31;3900195086;1.26738
7956.09;3905782784;1.26454
7962.5;3910125204;1.26188
7968.56;3914957301;1.24805
7975.36;3920340413;1.2455
7981.8;3924897177;1.24315
7987.89;3930307012;1.24098
7993.63;3934887828;1.22771
8000.11;3940131241;1.22563
8006.25;3945399060;1.22372
8012.04;3950781822;1.21081
8018.56;3955588071;1.20898
8024.73;3959934803;1.20732
8030.57;3965302076;1.19474
8037.12;3970705870;1.19315
8043.33;3975257610;1.19172
8049.2;3980831174;1.19046
8054.73;3985654649;1.17835
8061;3989928882;1.17712
8066.92;3995194369;1.17605
8072.51;4000434776;1.16422
8078.82;4004851391;1.16318
8084.79;4010391187;1.16228
8090.44;4015146544;1.15072
8096.78;4020417391;1.14984
8102.8;4024848360;1.1491
8108.48;4030351903;1.1485
8114.86;4035087165;1.14748
8120.91;4040711150;1.1466
8126.62;4045493497;1.14586
8132.02;4050098536;1.13462
8138.12;4055485763;1.13385
8143.89;4059964371;1.13322
8149.34;4064748176;1.12218
8155.48;4070227602;1.12152
8161.29;4075744277;1.12099
8166.79;4080144679;1.12058
8172.97;4085781829;1.11973
8178.82;4090092225;1.11901
8184.35;4094900143;1.11841
8190.56;4100257237;1.11737
8196.44;4105477668;1.11646
8202;4110034745;1.11566
8207.26;4115150981;1.10473
8213.18;4120498105;1.10387
8218.79;4124977805;1.10314
8224.1;4130351297;1.09235
8229.1;4135151603;1.08194
8234.77;4140654888;1.08152
8240.14;4145276351;1.0812
8245.21;4149817808;1.07092
8250.94;4155165660;1.07053
8256.36;4160826522;1.07025
8261.49;4165052380;1.06009
8267.27;4170562300;1.05973
8272.74;4175109999;1.05947
8277.91;4180280570;1.04943
8283.73;4185560764;1.04909
8289.24;4189983499;1.04886
8294.45;4195851576;1.03893
8299.37;4200850800;1.02936
8304.94;4205642267;1.02938
8310.21;4210181969;1.0295
8315.18;4215545704;1.02002
8319.88;4220711759;1.01088
8325.22;4225462370;1.01124
8330.27;4229903353;1.01169
8335.04;4235065614;1.00262
8340.44;4240292171;1.00294
8345.55;4245768875;1.00336
8350.38;4249859684;0.994347
8355.83;4255333582;0.994633
8360.99;4259890977;0.99501
8365.87;4264839113;0.986046
8371.37;4270361988;0.986287
8376.57;4274976563;0.986618
8381.5;4280011116;0.977699
8387.03;4285417935;0.97789
8392.27;4289832198;0.978171
8397.23;4295169031;0.978537
8401.91;4300615471;0.969739
8407.2;4304968035;0.969951
8412.21;4310462710;0.970248
8416.94;4315425026;0.970626
8422.27;4320829472;0.970527
8427.32;4325330324;0.970513
8432.09;4330523187;0.97058
8437.45;4334843590;0.970172
8442.53;4340102943;0.96985
8447.34;4345374790;0.969612
8451.88;4350681899;0.960487
8457;4355070975;0.960087
8461.85;4360584003;0.959775
8466.43;4365073368;0.950669
8470.76;4370189481;0.941874
8475.67;4374865792;0.941711
8480.31;4380476913;0.932849
8484.7;4385591950;0.924299
8489.66;4389944963;0.924286
8494.35;4395223893;0.924359
8498.78;4400478885;0.915823
8502.97;4405221761;0.907592
8507.72;4410768205;0.907801
8512.22;4415336365;0.899493
8516.47;4420190301;0.891489
8521.28;4424778481;0.891831
8525.83;4430215906;0.883748
8530.13;4435725856;0.875968
8534.98;4440527240;0.876438
8539.57;4445165292;0.87699
8543.92;4450310773;0.869204
8548.81;4455873106;0.869575
8553.44;4460459761;0.870027
8557.82;4464903746;0.870556
8561.95;4470634245;0.862835
8566.63;4475422151;0.863171
8571.06;4479965718;0.863584
8576.01;4485391456;0.863519
8580.7;4490016196;0.863536
8585.15;4495545822;0.863631
8589.35;4500386075;0.863802
8594.07;4505656383;0.863491
8598.55;4510148954;0.863261
8602.78;4515517175;0.863109
8607.52;4519937481;0.862477
8612.02;4525258926;0.861929
8616.27;4530706368;0.861463
8620.29;4535605159;0.85312
8624.82;4539815009;0.852462
8629.11;4545144031;0.85189
8633.16;4549935854;0.843536
8637.71;4555388698;0.842776
8642.03;4559954489;0.842106
8646.1;4565052002;0.84152
8650.67;4570346617;0.840464
8655.01;4575630056;0.839499
8659.1;4579868304;0.830946
8662.97;4584948842;0.822681
8667.33;4590211103;0.821827
8671.45;4595573750;0.821064
8675.35;4600406673;0.812806
8679.73;4605043793;0.811865
8683.88;4610416537;0.81102
8687.8;4614866286;0.802776
8691.5;4620413186;0.794818
8695.68;4625062861;0.794082
8699.63;4630509233;0.79344
8703.37;4634765423;0.78549
8706.89;4640127476;0.777822
8710.89;4645511108;0.777281
8714.67;4649869590;0.769524
8718.23;4655352065;0.76205
8721.59;4659944017;0.754854
8725.42;4665411391;0.747468
8729.04;4670783662;0.740365
8732.46;4675581507;0.733538
8736.33;4680170639;0.733645
8740;4685487169;0.726718
8743.46;4690136405;0.720064
8746.72;4695676840;0.713678
8750.44;4699961748;0.707095
8753.96;4705001296;0.700782
8757.92;4710740606;0.701213
8761.67;4715256031;0.701731
8765.22;4720158740;0.695393
8769.21;4724877268;0.695704
8772.98;4730295989;0.696102
8776.55;4735612464;0.696581
8780.55;4739986128;0.696586
8784.33;4745249335;0.696677
8787.92;4750595249;0.696852
8791.3;4755238774;0.697104
8794.49;4760411484;0.690676
8798.11;4764755109;0.690697
8801.54;4770243253;0.690799
8804.76;4775605100;0.684313
8807.81;4780247813;0.678074
8811.28;4784972695;0.678188
8814.56;4790561287;0.67838
8817.65;4795665097;0.672074
8821.16;4799976026;0.672028
8824.48;4805709369;0.665584
8828.21;4810230471;0.665312
8831.73;4814876512;0.665124
8835.07;4820441665;0.658632
8838.8;4825198911;0.65822
8842.34;4830791957;0.657895
8845.68;4835443377;0.65136
8849.41;4839799645;0.650812
8852.95;4845252398;0.650354
8856.3;4850771552;0.649983
8860.02;4855363462;0.655343
8863.55;4859902056;0.65443
8866.9;4865210582;0.653608
8870.05;4870619754;0.65287
8873.58;4875292315;0.657773
8876.93;4880517370;0.656498
8880.64;4884812873;0.66078
8884.15;4890324787;0.665003
8887.48;4895624551;0.663151
8890.62;4900447733;0.661395
8894.12;4905670314;0.65918
8897.44;4910138241;0.657071
8900.57;4915336092;0.655066
8904.06;4919920575;0.652609
8907.36;4925246236;0.650265
8910.48;4930658356;0.648032
8913.43;4934729260;0.640165
8916.73;4939984592;0.637744
8919.84;4945258325;0.635437
8922.78;4950666759;0.627597
8926.07;4954996625;0.625114
8929.17;4960649768;0.622752
8932.1;4965196198;0.62051
8934.87;4970516403;0.612827
8937.97;4975087600;0.610409
8940.9;4980310853;0.602649
8943.67;4984926849;0.595156
8946.76;4990495794;0.592836
8949.68;4995336775;0.590646
8952.44;5000510111;0.583208
8955.52;5005152929;0.580852
8958.44;5010542498;0.578628
8961.19;5014764057;0.571254
8963.78;5020307326;0.564142
8966.69;5024893550;0.562019
8969.43;5030177452;0.560027
8972.02;5035050671;0.552973
8974.92;5040341578;0.550817
8977.66;5044938582;0.548793
8980.25;5049999180;0.541801
8983.13;5055385420;0.539613
8985.86;5059727063;0.537563
8988.43;5065006196;0.535642
8990.85;5070625833;0.528846
8993.58;5075228480;0.526756
8996.15;5079799282;0.524799
8998.57;5084851189;0.518061
9001.28;5090436873;0.515936
9003.84;5094709716;0.513945
9006.25;5099968793;0.507268
9008.52;5105457822;0.500844
9011.08;5110038650;0.498937
9013.49;5115528804;0.497163
9015.76;5120454220;0.490789
9018.32;5125121307;0.488838
9020.72;5130568755;0.487025
9022.99;5135589659;0.480703
9025.53;5139849317;0.478711
9027.93;5145063439;0.476855
9030.19;5150306592;0.470587
9032.32;5154865260;0.464564
9034.71;5160665319;0.462776
9036.97;5165168290;0.461118
9039.09;5170588629;0.455137
9041.08;5175176053;0.449398
9042.95;5180572140;0.443893
9045.09;5184914749;0.438159
9047.1;5190424399;0.432665
9048.99;5195050966;0.427403
9051.14;5200339877;0.426177
9053.16;5205735115;0.420807
9055.06;5210109779;0.41567
9057.21;5215672429;0.414472
9059.24;5219915600;0.409225
9061.15;5225076975;0.404203
9063.29;5230629571;0.403027
9065.32;5235343546;0.397894
9067.23;5239745818;0.392987
9069.02;5245398091;0.3883
9071.05;5249906833;0.38736
9072.96;5255330834;0.382545
9074.76;5260401200;0.37795
9076.79;5265728647;0.377005
9078.7;5270071460;0.376177
9080.5;5275090355;0.375463
9082.52;5280810249;0.374303
9084.43;5285545290;0.37326
9086.22;5290518397;0.372331
9088.24;5294863872;0.370957
9090.13;5299963202;0.369702
9092.23;5305391169;0.37172
9094.22;5310803695;0.370052
9096.09;5315720348;0.368504
9097.85;5320379417;0.367075
9099.51;5325515383;0.362134
9101.37;5329998464;0.360465
9103.12;5335305355;0.358917
9104.77;5340051301;0.357483
9106.61;5345514522;0.355605
9108.35;5349851629;0.35385
9109.98;5355710863;0.352211
9111.8;5360416748;0.350135
9113.52;5365957147;0.348183
9115.14;5369729623;0.346352
9116.93;5375366565;0.344085
9118.62;5379781712;0.341945
9120.22;5385016154;0.33993
9121.98;5390556755;0.337483
9123.65;5395460762;0.335167
9125.21;5399902902;0.329819
9126.69;5405075234;0.32468
9128.32;5410620769;0.322351
9129.87;5415157699;0.320153
9131.32;5420853640;0.318085
9132.93;5425294213;0.315587
9134.44;5430561092;0.313223
9135.87;5435528215;0.310989
9137.44;5439900116;0.308332
9138.93;5445240477;0.305812
9140.32;5450657598;0.303427
9141.87;5455044669;0.30062
9143.32;5460561518;0.297953
9144.68;5464887827;0.295427
9146.18;5470258536;0.292479
9147.59;5474798890;0.28968
9148.92;5480003808;0.287021
9150.38;5485503625;0.283949
9151.75;5489963247;0.281023
9153.04;5495668663;0.278244
9154.25;5500810227;0.275605
9155.58;5505557165;0.272553
9156.83;5510068644;0.269649
9158.01;5514851107;0.266889
9159.3;5520177787;0.263718
9160.51;5525726797;0.260698
9161.65;5530129974;0.25783
9162.9;5535425847;0.254552
9164.07;5540691040;0.251428
9165.17;5545112256;0.248459
9166.2;5550456321;0.243304
9167.33;5554786081;0.240135
9168.39;5560170594;0.237119
9169.38;5565483921;0.232018
9170.47;5570149816;0.228806
9171.5;5575747266;0.225754
9172.45;5580085850;0.220708
9173.34;5585638844;0.215871
9174.32;5590072752;0.212827
9175.24;5595351682;0.209941
9176.1;5599903729;0.205154
9177.04;5605224901;0.202069
9177.92;5610569642;0.199142
9178.74;5614819515;0.194408
9179.64;5620234062;0.191287
9180.48;5625831087;0.188324
9181.26;5630658294;0.183647
9182.12;5635199201;0.18049
9182.92;5640778035;0.177494
9183.66;5645321914;0.174656
9184.35;5650694194;0.170196
9184.98;5655082392;0.165932
9185.69;5660606671;0.163084
9186.34;5664926327;0.158705
9186.95;5669996406;0.154524
9187.62;5675347054;0.151665
9188.23;5679785673;0.148963
9188.8;5685122035;0.144822
9189.33;5690261034;0.140869
9189.91;5695526668;0.138143
9190.45;5699748820;0.13407
9190.94;5705324887;0.130185
9191.48;5710629710;0.127435
9191.98;5714993198;0.123429
9192.44;5720031203;0.119612
9192.95;5725344140;0.116833
9193.41;5730615082;0.112895
9193.83;5734879656;0.109143
9194.22;5740552154;0.105574
9194.64;5744868641;0.102945
9195.03;5750242540;0.100468
9195.38;5755218787;0.0969162
9195.77;5759827255;0.0942127
9196.11;5765249980;0.0916621
9196.43;5770229962;0.0881293
9196.77;5775000716;0.0853496
9197.08;5780422248;0.0827266
9197.35;5784903631;0.0802538
9197.65;5790211430;0.0773755
9197.91;5794964566;0.0746518
9198.15;5800570383;0.0720832
9198.39;5804983547;0.0691071
9198.61;5810452980;0.0662904
9198.81;5815003867;0.0636278
9198.97;5820809868;0.0602587
9199.15;5825445506;0.0573602
9199.29;5829878767;0.0546172
9199.42;5834785143;0.0520246
9199.55;5840308151;0.0490277
9199.65;5845836636;0.0461879
9199.73;5850327223;0.0435019
9199.81;5855660646;0.0404111
9199.86;5859946817;0.0374787
9199.9;5865658174;0.0347018
9199.93;5870159653;0.0315805
9199.94;5875693402;0.0286167
9199.93;5879954524;0.0258094
9199.91;5885273769;0.0226656
9199.89;5889923717;0.0197644
9199.85;5895501769;0.017016
9199.8;5900873677;0.0140233
9199.74;5905651539;0.0112669
9199.67;5910229361;0.00866156
9199.59;5915045926;0.00620092
9199.51;5920409511;0.00365988
9199.42;5925156318;0.00126209
9199.32;5930468151;0.000994521
9199.22;5934784724;0.00324772
9199.11;5940061616;0.00536614
9199;5945315112;0.0073558
9198.87;5950969553;0.00933638
9198.75;5955769495;0.0111097
9198.62;5960073210;0.0127632
9198.49;5965084799;0.0143847
9198.36;5970567857;0.0158101
9198.22;5975084945;0.0171278
9198.08;5980263330;0.0183418
9197.94;5985701252;0.0194549
9197.8;5990067639;0.0204734
9197.66;5995047555;0.0213958
9197.52;6000565280;0.0222305
9197.38;6005199221;0.0229782
9197.23;6010699234;0.023645
9197.08;6015603226;0.0243121
9196.94;6019896841;0.0248208
9196.8;6025370231;0.0252571
9196.65;6030617830;0.0257045
9196.51;6035115605;0.0260018
9196.37;6040463673;0.0262352
9196.23;6045051630;0.0264084
9196.09;6050680479;0.0266049
9195.96;6055053244;0.0266647
9195.82;6060736370;0.0266703
9195.69;6065394717;0.0267097
9195.56;6069896907;0.0266169
9195.43;6075452871;0.0264816
9195.3;6080422221;0.0263837
9195.18;6085114782;0.0261618
9195.07;6090771000;0.0259063
9194.95;6095599380;0.0256951
9194.84;6099913836;0.0253701
9194.73;6105136018;0.0250116
9194.62;6110692034;0.0246267
9194.51;6115434071;0.0242943
9194.41;6119953540;0.0238551
9194.31;6125594716;0.0233939
9194.21;6130071187;0.0229917
9194.12;6135310033;0.02257
9194.03;6140629904;0.0220452
9193.94;6145157241;0.0215062
9193.85;6150543322;0.021033
9193.77;6155016644;0.0204642
9193.7;6160517280;0.0198832
9193.62;6165339270;0.0193743
9193.55;6169952859;0.0187717
9193.49;6175536691;0.0181643
9193.42;6180278998;0.017631
9193.37;6185537622;0.0170078
9193.31;6189801450;0.0163817
9193.25;6195194120;0.0158334
9193.2;6200060689;0.015281
9193.15;6205787634;0.0146441
9193.11;6210183280;0.0140083
9193.07;6214971002;0.0134544
9193.03;6220437234;0.0128175
9193;6224847766;0.0121844
9192.96;6229796296;0.011553
9192.93;6235109257;0.0109268
9192.91;6240362542;0.0103035
9192.88;6244874228;0.00968577
9192.86;6249736044;0.0091564
9192.84;6255243366;0.00854815
9192.83;6260593220;0.00794686
9192.81;6265280990;0.00743509
9192.8;6270598765;0.00684718
9192.79;6275144396;0.00626745
9192.79;6279726649;0.0057766
9192.78;6284921934;0.0052935
9192.78;6290475842;0.00473452
9192.78;6295082491;0.00418608
9192.78;6299914087;0.00372789
9192.79;6305284498;0.00319712
9192.8;6309862748;0.00267485
9192.8;6315365394;0.00224525
9192.81;6319854505;0.00182383
9192.83;6325504088;0.00132889
9192.84;6330055494;0.000927578
9192.86;6335024075;0.00053353
9192.88;6340317098;6.81373e-05
9192.9;6344732542;0.000387361
9192.92;6350747706;0.000750156
9192.95;6355628869;0.00118539
9192.97;6360217840;0.00160956
9193;6365736755;0.00194216
9193.02;6370745425;0.00226425
9193.05;6375303858;0.0026598
9193.08;6379743785;0.00304324
9193.12;6385142528;0.00341685
9193.16;6390582716;0.00377852
9193.19;6394890096;0.00413033
9193.23;6400154425;0.00439066
9193.27;6404897680;0.0047222
9193.31;6410490235;0.00504405
9193.35;6415700419;0.00535512
9193.39;6420044341;0.00565534
9193.44;6425503173;0.00594587
9193.48;6429733267;0.00622671
9193.52;6434872427;0.00641614
9193.57;6440362893;0.00667938
9193.61;6445081733;0.00693179
9193.65;6450549496;0.00709301
9193.7;6455542334;0.00724832
9193.74;6459938832;0.00747754
9193.79;6465338787;0.00769836
9193.84;6470009513;0.00782798
9193.88;6475530034;0.00795194
9193.93;6479931560;0.00806921
9193.98;6485349505;0.00817979
9194.02;6490032774;0.00828365
9194.08;6495449413;0.00846374
9194.13;6500677183;0.00855501
9194.18;6505037584;0.00872161
9194.24;6510489541;0.00888221
9194.29;6515319947;0.00895308
9194.34;6520294965;0.00901856
9194.39;6524896031;0.00916046
9194.45;6530348087;0.00929452
9194.5;6534720490;0.00934106
9194.56;6540085181;0.00946638
9194.61;6545590053;0.00958481
9194.67;6549958022;0.00969665
9194.72;6555445673;0.00972118
9194.77;6560937410;0.00982351
9194.83;6565381977;0.00991915
9194.88;6570284317;0.0100105
9194.94;6574902465;0.0100952
9195;6580194085;0.0101768
9195.05;6585079779;0.0102529
9195.11;6590328890;0.0103227
9195.16;6595652547;0.0103882
9195.22;6600065719;0.0103677
9195.28;6605350416;0.0104253
9195.34;6609918184;0.0104799
9195.39;6615326247;0.0105326
9195.44;6620645577;0.0104961
9195.5;6625012777;0.0105422
9195.56;6630336389;0.010583
9195.61;6635280553;0.0105382
9195.67;6640555769;0.0105751
9195.73;6644861348;0.0106078
9195.78;6650257630;0.0106367
9195.83;6655672157;0.010583
9195.89;6659914382;0.010609
9195.94;6665167108;0.0106322
9196;6670278975;0.0105709
9196.05;6675090117;0.01059
9196.11;6680821809;0.0106066
9196.16;6685463416;0.0105409
9196.21;6689932406;0.0104742
9196.27;6695230578;0.0104892
9196.32;6700516934;0.0104209
9196.37;6705320172;0.0103526
9196.43;6709885901;0.0103639
9196.48;6715461906;0.010376
9196.53;6720119652;0.0103048
9196.59;6724933405;0.0103146
9196.64;6730391338;0.0103227
9196.7;6735459019;0.0102478
9196.75;6739730136;0.0102559
9196.81;6745165300;0.0102614
9196.86;6750560293;0.0102657
9196.91;6755460140;0.010189
9196.96;6760055063;0.0101931
9197.02;6765639983;0.0101959
9197.07;6770230109;0.0101169
9197.12;6775640828;0.0101208
9197.17;6779962421;0.0101223
9197.22;6785118757;0.0101236
9197.28;6790711025;0.0101248
9197.33;6795244793;0.0101247
9197.38;6800385243;0.0101223
9197.44;6805789355;0.0101208
9197.49;6810272137;0.0101181
9197.54;6814839380;0.0101142
9197.59;6820419634;0.0100283
9197.65;6825672689;0.0100267
9197.7;6830099409;0.0100239
9197.75;6835530006;0.00993808
9197.8;6840169746;0.00993771
9197.85;6844926830;0.00993392
9197.9;6849815790;0.00993006
9197.96;6855205873;0.00992723
9198.01;6860503807;0.0099243
9198.06;6864871159;0.00992024
9198.11;6870418768;0.00991608
