Distance;Time;Velocity Kalman
0;341605;0
0;5097471;0
0;12930427;0
0;15527650;0
0;19944902;0
0;27102358;0
0;29266475;0
0;34754944;0
0;39280722;0
0;44874718;0
0;50121198;0
0;55169557;0
0;59425411;0
0;64466372;0
0;69378056;0
0;74740282;0
0;80263974;0
0;85081195;0
0;89487112;0
0;94571528;0
0;99888030;0
0;104513800;0
0;110146473;0
0;115231958;0
0;119652590;0
0;124788897;0
0;142726891;0
0;148782747;0
0;153564571;0
0;160485727;0
0;163384003;0
0;167934671;0
0;172885309;0
0;178662726;0
0;183576718;0
0;188072974;0
0;192891853;0
0;198092731;0
0;203289843;0
0;207788167;0
0;213618079;0
0;218419008;0
0;223794536;0
0;228103560;0
0;233540622;0
0;237943372;0
0;243292628;0
0;248057703;0
0;253306209;0
0;258238224;0
0;263026744;0
0;268302186;0
0;273385223;0
0;277813952;0
0;282998375;0
0;288695623;0
0;293575553;0
0;298645675;0
0;303037221;0
0;308572346;0
0;312950475;0
0;317924609;0
0;322862115;0
0;328123694;0
0;333305417;0
0;337850668;0
0;342908215;0
0;347906826;0
0;353029350;0
0;358600645;0
0;363683031;0
0;367759041;0
0;373449930;0
0;377991828;0
0;383698189;0
0;387918423;0
0;392998853;0
0;397953469;0
0;403789155;0
0;408440464;0
0;412899215;0
0;418407977;0
0;422782528;0
0;428021490;0
0;432781373;0
0;437832454;0
0;443328938;0
0;448374336;0
0;453297854;0
15.4343;457819420;0.154343
15.4343;462925527;0.154343
15.4343;468397024;0.154343
22.1746;472774912;0.221746
26.5441;478605420;0.265441
29.7624;482997380;0.297624
32.3396;487995902;0.323396
38.81;493742298;0.3881
44.4662;498012200;0.444662
49.4746;502839530;0.494746
57.5707;508643871;0.575707
64.8029;513096778;0.648029
71.2022;518371681;0.712022
80.8957;523062932;0.808957
89.44;528176106;0.8944
96.8972;532971908;0.968972
103.351;538100140;1.03351
112.443;543168756;1.12443
120.343;548223987;1.20343
127.177;553698069;1.11814
136.441;558596965;1.21078
144.509;563175507;1.29146
151.521;568737705;1.2941
159.991;573822725;1.33503
167.401;578363524;1.37688
173.879;583191087;1.41585
198.193;588262541;1.59409
198.192;593046350;1.5374
198.19;598289633;1.48724
198.189;603469572;1.40631
201.761;608456832;1.36976
204.38;613802742;1.33203
206.473;618562412;1.25597
212.605;623008219;1.23182
217.969;628179594;1.21087
222.729;633520993;1.19392
230.085;637898945;1.1765
236.662;643136115;1.16323
242.489;648517096;1.15313
247.594;653449310;1.11155
254.978;657960671;1.10473
261.437;663090705;1.0992
267.037;668159442;1.07061
275.203;673193250;1.07835
282.314;678254661;1.08489
288.478;682893231;0.903614
293.801;687898005;0.95693
298.387;693747758;1.00285
316.896;698321871;1.1872
334.398;703397978;1.32663
334.398;707921883;1.30041
334.398;713658831;1.27945
334.398;718431050;1.21808
337.836;723149220;1.19879
340.357;728403048;1.17638
342.372;733322036;1.12296
348.266;738360492;1.11614
353.422;742811813;1.10945
357.996;748061401;1.10415
362.06;753711873;1.0709
368.953;758294724;1.07526
375.092;763420635;1.08065
380.502;768794862;1.05306
387.768;773637159;1.05458
394.13;778764067;1.05655
399.655;783224091;1.05855
407.869;788280628;1.09484
415.03;793579863;0.982469
421.244;798090777;0.869239
426.619;802839978;0.923074
449.634;808652793;1.15237
449.633;813157241;1.15236
449.632;818688358;1.11797
467.779;823587828;1.27477
467.779;828723312;1.25462
467.779;833502290;1.19564
472.643;837898048;1.19298
475.796;842924062;1.17896
478.117;847900174;1.1617
479.977;853082004;1.11138
507.343;858301038;1.3225
507.342;863089839;1.2684
507.342;868210108;1.19575
526.24;873501315;1.32155
526.24;878604603;1.26631
526.24;883252388;1.18405
530.554;888725877;1.15562
533.349;892908747;1.12143
535.408;898426890;1.08826
565.162;902851001;1.15599
565.162;908631651;1.156
565.162;913045754;1.15601
565.162;918296381;0.973832
583.756;923690212;1.16034
583.756;927978059;1.16034
583.756;933511504;1.11139
598.041;938352040;1.22247
598.041;943482120;1.19923
598.041;948426685;1.18065
603.587;953367409;0.963749
607.179;958660684;0.999591
609.825;963790608;1.02598
611.943;968774518;0.857028
617.222;973062981;0.909833
621.832;978601997;0.955961
625.911;983119401;0.953584
632.174;988791848;0.988249
637.763;993190150;1.02355
642.702;998352428;0.776714
650.231;1003310984;0.851863
656.863;1008491667;0.918078
662.647;1013611553;0.975842
667.651;1017855737;0.838949
675.124;1023278591;0.91368
681.625;1028351614;0.978703
687.255;1033121024;0.89238
694.69;1038322034;0.966813
701.166;1042924945;1.03166
706.797;1048734740;1.03266
713.92;1053324533;1.06799
720.157;1057926109;1.10392
725.616;1063068600;1.13734
733.005;1068189509;1.15832
739.533;1073098538;1.17739
745.3;1078245845;1.1942
750.398;1082917650;1.18253
764.719;1088059538;1.26959
764.718;1093494721;1.2202
764.716;1097923427;1.1449
784.333;1103030024;1.27472
784.333;1108345921;1.21687
784.333;1112952903;1.16684
789.8;1118477205;1.14682
793.343;1122872755;1.11725
795.951;1128130716;1.08705
798.04;1133042025;1.03358
801.977;1138261421;1.00818
805.41;1143403900;0.986205
808.441;1148225261;0.945326
814.671;1153495018;0.94521
820.251;1158582819;0.946386
825.202;1162991620;0.921974
858.853;1168190075;1.1932
858.852;1172940735;1.13552
858.852;1178574851;1.08454
858.851;1183758782;0.942143
862.178;1188158749;0.975498
864.618;1193379251;0.999958
866.568;1197939951;0.822861
871.142;1202796585;0.868507
875.14;1208497251;0.908414
878.682;1213730592;0.888922
885.066;1217930686;0.917261
890.785;1223363562;0.948342
895.86;1228102106;0.978204
900.314;1233670633;0.983401
906.909;1238320202;1.01502
912.687;1243463594;1.0425
917.705;1247981640;1.03034
945.129;1253750584;1.2488
945.129;1257866626;1.19927
945.128;1263541352;0.862756
949.805;1268628329;0.909535
952.834;1273031319;0.939841
955.064;1278776771;0.962155
956.85;1283704312;0.946776
980.478;1288131841;1.15911
980.478;1293315517;1.13957
980.478;1297890184;1.09393
998.136;1303216559;1.22998
998.136;1308424801;1.19456
998.136;1312734288;1.13073
1002.14;1317742171;1.11352
1004.73;1322829770;1.08869
1006.64;1328872708;1.06323
1032.02;1333254420;1.25138
1032.02;1338387370;1.19354
1032.02;1342863422;1.14331
1032.02;1348822832;0.869456
1049.88;1353107214;1.04758
1049.88;1357781928;1.04759
1049.88;1363112961;1.00085
1054.03;1368291289;1.01212
1056.72;1373600567;1.01675
1058.7;1378115783;1.01872
1060.29;1383603483;0.798752
1064.5;1388031368;0.840822
1068.18;1393395195;0.877573
1071.44;1398193268;0.733008
1077.36;1403288310;0.7923
1082.67;1408524871;0.845396
1087.38;1413122250;0.852591
1093.99;1418443176;0.892911
1099.82;1423578121;0.932175
1104.9;1428434808;0.728797
1112.03;1433173093;0.800166
1118.25;1438114763;0.862425
1123.65;1443413720;0.916423
1128.31;1448330366;0.784254
1151.48;1453198186;1.0162
1151.48;1458390803;1.01619
1151.48;1463088004;0.974647
1155.65;1467962089;0.989491
1158.36;1473262324;0.996722
1160.35;1478143698;1.00077
1165.22;1483291710;1.00733
1169.33;1488477282;1.01166
1172.92;1493046421;1.0149
1176.08;1497967895;0.987165
1181.07;1503433183;0.984024
1185.52;1508474942;0.981422
1189.44;1513470327;0.954519
1195.95;1518335906;0.961322
1201.68;1522837118;0.967867
1206.69;1528171395;0.946696
1211.03;1532872016;0.927977
1236.07;1538347519;1.12451
1236.07;1543432535;1.07803
1236.06;1548649822;0.845914
1240.09;1553382077;0.886161
1242.7;1558548505;0.912232
1244.61;1563562641;0.889667
1248.83;1568475589;0.904779
1252.39;1572870120;0.920472
1255.49;1577771193;0.902768
1261.37;1583489902;0.920388
1266.63;1588618720;0.93713
1271.3;1593193211;0.952312
1275.42;1597982759;0.943563
1281.82;1603530568;0.963096
1287.45;1608715211;0.980184
1292.35;1613623880;0.964104
1298.93;1618075600;0.972458
1304.65;1623154487;0.979581
1309.6;1628896723;0.985732
1316.32;1633709308;0.802565
1322.17;1638233812;0.861071
1327.25;1653999725;0.911847
1334.31;1659750985;0.942198
1340.49;1664546503;0.97792
1348.13;1670001123;1.03514
1354.85;1674654127;1.06027
1360.77;1679671739;1.08393
1367.69;1684601005;1.12219
1373.82;1689888748;1.12476
1379.25;1694279979;1.12652
1384.07;1699095133;1.1279
1388.33;1704831355;1.12939
1393.9;1709192964;1.12104
1398.88;1714482263;1.11453
1405.22;1719614327;1.12887
1410.93;1724703945;1.1202
1416.08;1729808674;1.11443
1422.35;1734298130;1.12764
1428.04;1739543382;1.11732
1433.2;1744708845;1.11045
1439.26;1749343305;1.12028
1444.78;1754723398;1.10492
1449.82;1759462062;1.09352
1454.41;1764866935;1.06304
1459.96;1769213709;1.05121
1465.05;1774107913;1.04284
1469.71;1779659283;1.02027
1475.37;1784916906;1.01556
1480.59;1789076595;1.01341
1485.4;1795025956;1.01336
1491.15;1799238292;1.02817
1496.47;1812448613;1.02571
1502.37;1817700856;1.03494
1507.84;1822602256;1.02631
1512.93;1827851825;1.02003
1518.79;1832599844;1.02715
1524.24;1838067800;1.01895
1529.32;1842542641;1.01284
1534.05;1848220469;1.0085
1539.55;1853062541;1.0029
1544.68;1857618246;0.999005
1549.47;1863139405;0.99655
1555.08;1868169781;1.00668
1560.33;1873073055;1.00372
1565.25;1878063590;1.00201
1570.76;1882963920;1.01048
1575.93;1887900649;1.0056
1580.78;1893255588;1.00193
1586.18;1897891056;1.00782
1591.25;1903520911;1.00103
1596.01;1907735019;0.99543
1600.48;1913162147;0.981089
1605.55;1917987183;0.977027
1610.32;1923260385;0.973889
1614.8;1928033624;0.960115
1620.09;1932963113;0.958497
1625.08;1938202456;0.957613
1629.78;1943024697;0.95735
1635.08;1947571766;0.955328
1640.08;1953094139;0.953979
1644.79;1958190056;0.953203
1649.23;1962672399;0.941521
1654.27;1967949695;0.939363
1659.02;1973241876;0.937761
1663.51;1978314892;0.927485
1668.52;1983442994;0.925872
1673.25;1988555583;0.924728
1677.72;1992682568;0.915464
1681.94;1997847937;0.906915
1686.66;2002913051;0.906581
1691.13;2007816114;0.906569
1695.34;2012517190;0.898012
1700.26;2017874160;0.899507
1704.91;2022852325;0.901228
1709.31;2028251085;0.89229
1714.24;2032934524;0.891632
1718.9;2037604139;0.89125
1723.31;2042801971;0.882387
1727.47;2048422205;0.874049
1732.24;2052481919;0.874576
1736.75;2057691072;0.875286
1741.02;2063025672;0.867593
1745.9;2067832412;0.868874
1750.53;2073206519;0.870296
1754.91;2078274267;0.86399
1761.09;2083106220;0.878901
1761.09;2088298980;0.834198
1761.09;2093354383;0.792047
1764.69;2098000584;0.780823
1767.03;2103211072;0.759509
1768.74;2108438802;0.734551
1770.12;2112509052;0.699133
1773.64;2117634155;0.687709
1776.71;2122654342;0.67439
1779.43;2127622632;0.652324
1784.14;2133057124;0.652679
1788.35;2138148371;0.650618
1792.08;2143512652;0.646227
1798.18;2147953570;0.659546
1803.57;2153498254;0.668299
1808.28;2158348444;0.672771
1812.37;2163349495;0.664837
1818.03;2168553113;0.675151
1822.95;2173511263;0.680571
1827.22;2177575690;0.661235
1833.28;2182631117;0.721866
1838.57;2187554972;0.774759
1843.17;2193503719;0.784811
1849.48;2197891081;0.824577
1855.01;2202549792;0.862797
1859.87;2207716749;0.89766
1864.13;2213173929;0.905106
1869.73;2217702359;0.930363
1874.69;2222773734;0.95272
1879.08;2227830502;0.949503
1884.68;2232628494;0.963381
1889.68;2237872238;0.976052
1894.15;2242890771;0.959702
1899.55;2247721287;0.959828
1904.4;2253255488;0.961219
1908.77;2258399772;0.963963
1912.69;2262913633;0.946625
1917.47;2268180396;0.945172
1921.79;2273121619;0.945801
1925.71;2278422159;0.924348
1937.57;2282559291;0.990304
1937.57;2287688495;0.944246
1937.57;2292548459;0.88126
1941.4;2297937337;0.864409
1943.88;2303098252;0.840828
1945.71;2308196505;0.816652
1947.17;2312997005;0.775393
1950.99;2318195835;0.763962
1954.32;2323161896;0.753381
1957.27;2328073120;0.726726
1961.78;2333472345;0.721538
1965.79;2337981869;0.716909
1969.35;2342728906;0.69833
1993.98;2347919506;0.896767
1993.98;2352953105;0.853135
1993.98;2358162434;0.813881
1993.98;2363116166;0.766223
1997.9;2367912362;0.762146
2000.77;2372590689;0.751716
2003.07;2377977623;0.655231
2007.32;2382680983;0.697754
2011.04;2387838891;0.734885
2014.32;2393407267;0.729356
2019.44;2397981759;0.755646
2024.01;2403472661;0.783032
2028.05;2407860428;0.808791
2031.58;2413473416;0.805916
2036.99;2417930643;0.826709
2041.73;2423069971;0.844554
2045.84;2428177792;0.840617
2051.63;2432608602;0.858324
2056.66;2437888973;0.873183
2061.03;2442777836;0.670686
2067.15;2448084522;0.731867
2072.49;2453491299;0.785242
2077.14;2457997001;0.831721
2082.77;2463120469;0.848857
2087.71;2468413455;0.869456
2092.03;2473872160;0.889675
2095.81;2478038023;0.884918
2100.77;2482664330;0.897325
2105.15;2487669356;0.90826
2109.02;2492627711;0.895804
2114.17;2497802661;0.901602
2118.75;2502575419;0.907158
2122.85;2507708083;0.912863
2126.5;2513180684;0.895327
2131.1;2517752914;0.894002
2135.24;2523012660;0.894317
2138.96;2527470811;0.873634
2143.72;2533351638;0.870882
2148.04;2538477277;0.870396
2151.95;2543172898;0.848312
2156.98;2548102863;0.845246
2161.56;2553168624;0.844672
2165.75;2558455309;0.830293
2179.67;2562721153;0.919822
2179.67;2567964178;0.876632
2179.67;2573377430;0.838829
2179.67;2577919382;0.789161
2183.05;2583100800;0.77906
2185.52;2588242712;0.765054
2187.5;2593145912;0.733386
2189.17;2598137661;0.704201
2192.96;2603239668;0.70118
2196.33;2608298872;0.698348
2199.33;2613191845;0.682361
2204.16;2618378820;0.68929
2208.47;2622904791;0.695102
2212.26;2627978090;0.685413
2233.71;2633286605;0.857359
2233.71;2638243105;0.818228
2233.71;2642622663;0.767868
2236.33;2647857040;0.748214
2238.02;2653149923;0.723311
2239.27;2658360888;0.597482
2242.9;2663481716;0.633964
2245.96;2668455543;0.664787
2248.63;2672850505;0.691653
2250.98;2677957846;0.681727
2255.55;2682622426;0.702867
2292.46;2687886995;1.06498
2292.46;2693053632;1.04849
2294.89;2697929834;1.03369
2296.18;2703071949;1.01265
2297.02;2708196539;0.991095
2307.89;2712629258;1.03856
2307.89;2718038563;0.995607
2301.85;2723398650;0.897505
2301.85;2728155067;0.681849
2314.34;2732772051;0.80798
2314.34;2737876049;0.807984
2314.34;2743446049;0.782095
2321.33;2747681028;0.836192
2321.33;2753354705;0.823897
2321.33;2758521527;0.788256
2324.15;2762588928;0.785462
2325.98;2767736189;0.776925
2327.32;2773421489;0.766808
2351.25;2777652515;0.957742
2351.25;2782731745;0.654133
2351.25;2787912934;0.654135
2351.25;2792779709;0.627648
2365.54;2798070326;0.748143
2365.54;2802621673;0.738943
2365.54;2808000703;0.597507
2379.54;2812514279;0.728114
2367.95;2818195378;0.661273
2367.95;2823160457;0.661273
2394.28;2828598271;0.807946
2387.78;2833473556;0.738895
2387.78;2837583481;0.738895
2387.78;2843252061;0.671436
2404.63;2848121247;0.842163
2404.63;2853064153;0.842163
2404.63;2858651340;0.81311
2408.64;2875073004;0.829079
2431.02;2880368172;1.04653
2431.02;2885969846;0.798062
2431.02;2893266778;0.798063
2431.68;2895449128;0.804728
2431.68;2900382060;0.804729
2431.68;2905354867;0.662375
2431.68;2910820184;0.662375
2433.83;2915277455;0.683948
2435.4;2920967094;0.558741
2436.66;2925182625;0.687553
2439.92;2930342301;0.720271
2442.77;2935267498;0.485735
2445.3;2940086346;0.575359
2450.5;2945165099;0.627607
2455.16;2950348931;0.674643
2459.3;2955629579;0.547007
2462.95;2960780451;0.583757
2468.01;2965182294;0.634646
2472.44;2970211202;0.644005
2476.29;2976022435;0.452827
2505.52;2980964113;0.745053
2505.52;2986067512;0.745047
2505.52;2990410167;0.739993
2504.65;2995593942;0.733
2504.65;3000648828;0.733
2504.65;3005835824;0.733
2504.65;3011058732;0.711825
2528.37;3015461193;0.935121
2528.37;3020475625;0.922742
2528.37;3025372098;0.889924
2540.55;3031000141;0.979806
2540.55;3035436545;0.954389
2540.55;3040522377;0.901865
2543.74;3045792083;0.885789
2543.74;3050997179;0.844398
2543.74;3055635905;0.808076
2543.74;3060806986;0.757753
2564.07;3065184583;0.918328
2564.07;3070288762;0.879549
2564.07;3075479297;0.590063
2567.06;3080654360;0.619285
2568.99;3085320083;0.638266
2570.42;3090917994;0.65914
2575.97;3095249017;0.713361
2575.97;3100943699;0.713361
2575.97;3105515549;0.71336
2598.2;3111205929;0.699662
2587.38;3115145913;0.590989
2587.38;3120661187;0.590989
2587.38;3126188511;0.468371
2590.92;3130254776;0.503805
2593.22;3135467709;0.526765
2594.91;3140517661;0.514104
2625.34;3145580775;0.825081
2625.34;3150932771;0.82508
2625.34;3155375123;0.82508
2625.34;3160948324;0.61316
2626.79;3166005618;0.627737
2627.85;3170453010;0.638428
2628.7;3175635100;0.617307
2646.67;3180715940;0.77747
2646.67;3185873453;0.763309
2646.67;3191017534;0.713754
2644.99;3195357168;0.691078
2644.99;3200559505;0.691078
2644.99;3205356471;0.471269
2644.99;3210466625;0.576394
2667.28;3216121403;0.804549
2667.28;3220555464;0.804549
2667.28;3225407368;0.769066
2682.35;3230552113;0.897375
2682.35;3235621440;0.880449
2682.35;3240890927;0.570865
2679.46;3245947406;0.541926
2679.46;3251084874;0.541926
2679.46;3255300508;0.541927
2691.15;3260237175;0.644623
2702.04;3265796639;0.74238
2702.04;3270435437;0.733836
2702.04;3275656727;0.554415
2715.58;3280091142;0.689311
2715.58;3285871189;0.689312
2715.58;3291119832;0.710426
2723.61;3295709748;0.793009
2723.61;3300438743;0.793009
2723.61;3306053479;0.793009
2726.98;3311341421;0.597755
2729.16;3315541304;0.619667
2730.77;3320357040;0.635803
2732.06;3325497438;0.497502
2744.87;3330692403;0.62535
2744.87;3335334823;0.625349
2744.87;3340554841;0.658103
2754.59;3345710769;0.762009
2754.59;3350623920;0.762009
2754.59;3356329786;0.647996
2762.1;3360847500;0.604429
2762.1;3366104603;0.604429
2762.1;3370823736;0.604429
2762.1;3375566124;0.472322
2768.99;3380707173;0.553991
2768.99;3385422319;0.553991
2768.99;3391082314;0.470164
2774.01;3395958522;0.505833
2774.01;3400106352;0.505833
2774.01;3405121280;0.471977
2774.01;3410810760;0.450046
2774.01;3415699623;0.433897
2774.01;3420112790;0.420967
2778.91;3426091548;0.342078
2783.05;3431097385;0.382679
2786.67;3435991401;0.418417
2789.87;3440722051;0.355313
2809.05;3445508317;0.54551
2809.05;3450749427;0.545507
2809.05;3455658952;0.470805
2809.05;3460463198;0.470803
2809.05;3465998767;0.470801
2809.05;3470502716;0.470799
2829.66;3475804321;0.611819
2829.66;3481078306;0.611819
2829.66;3486214938;0.611819
2831.59;3491018578;0.575883
2832.85;3496025177;0.588469
2833.77;3501098372;0.597744
2834.51;3505602729;0.605175
2836.49;3510818521;0.624978
2838.21;3515295595;0.642285
2839.74;3521190298;0.609062
2841.09;3525910762;0.581816
2857.54;3530404769;0.709333
2857.54;3535304410;0.677563
2857.54;3540837974;0.485567
2857.54;3545916110;0.485568
2868.99;3551048282;0.601108
2868.99;3555537846;0.601111
2875.97;3560660176;0.669501
2875.97;3565435740;0.669503
2875.97;3570343046;0.463197
2891.06;3575971597;0.616455
2891.06;3580689613;0.616455
2891.06;3585195858;0.596778
2891.06;3590974633;0.584038
2892.66;3595759875;0.590959
2893.84;3600838131;0.595402
2894.78;3605251391;0.585029
2895.57;3610955084;0.575681
2896.26;3615329440;0.567262
2896.86;3620725080;0.559736
2918.96;3625336818;0.616029
2918.96;3631060909;0.61603
2918.96;3635124998;0.61603
2918.96;3640377574;0.616031
2918.96;3645933981;0.500467
2918.96;3650352465;0.500467
2918.96;3655648380;0.433376
2921.71;3660156231;0.461082
2924.12;3665433322;0.485399
2926.27;3670772693;0.352088
2930.56;3675338325;0.395064
2934.42;3680776606;0.433765
2937.87;3685939150;0.468293
2940.91;3690700515;0.48262
2943.57;3696118146;0.497387
2945.86;3700743568;0.510924
2947.83;3705681510;0.522657
2951.92;3711199345;0.556712
2955.49;3715537743;0.586418
2958.59;3721044394;0.398023
2963.02;3726229360;0.442683
2966.9;3731218378;0.481735
2970.28;3735777448;0.515819
2973.23;3741130015;0.545531
2975.8;3746140508;0.571407
2978.04;3750625037;0.593929
2979.98;3755480975;0.585829
2983.66;3760977088;0.598679
2986.92;3766097313;0.609934
2989.81;3770777178;0.596099
2992.38;3775100404;0.583268
2994.65;3780946096;0.571713
2996.67;3785336868;0.561649
3000.39;3791015871;0.57223
3003.74;3795741182;0.58271
3006.76;3800770893;0.593164
3009.48;3805416004;0.579244
3024.09;3811216217;0.703189
3024.09;3815745140;0.672222
3024.09;3820365944;0.62781
3024.09;3825957457;0.589008
3034.52;3830196176;0.648233
3034.52;3835200161;0.618516
3034.52;3840934796;0.592635
3034.52;3846075349;0.57011
3034.52;3850105106;0.550513
3034.52;3855675016;0.513327
3047.15;3860780233;0.609018
3047.15;3865219457;0.579804
3047.15;3870990912;0.553891
3060.65;3875631210;0.66282
3060.65;3880248398;0.642435
3060.65;3885495026;0.605214
3066.58;3890753803;0.632583
3066.58;3895989536;0.602428
3066.58;3900228362;0.575248
3077.76;3905322958;0.537571
3077.76;3910804274;0.537577
3077.76;3915306613;0.537583
3077.76;3920444148;0.537588
3084.76;3926068481;0.515909
3084.76;3930305873;0.515909
3084.76;3935389239;0.515909
3093.28;3940656734;0.588413
3093.28;3945774427;0.588413
3093.28;3950543302;0.588413
3093.28;3955730971;0.461286
3093.28;3960776194;0.461286
3093.28;3965819952;0.461286
3093.28;3971105075;0.327152
3093.28;3975421888;0.327152
3093.28;3980474561;0.327152
3093.28;3985743821;0.267047
3124.28;3990210750;0.580167
3124.28;3995675490;0.580167
3124.28;4000192115;0.470176
3125.06;4005563073;0.477663
3125.56;4010734761;0.482521
3125.93;4015720008;0.486102
3126.23;4021038167;0.41628
3138.49;4025162169;0.537314
3138.49;4030432751;0.537314
3138.49;4035728543;0.460976
3138.35;4040232296;0.457822
3138.26;4045837616;0.455881
3138.2;4050827917;0.454505
3141.22;4055386512;0.485571
3143.78;4060902166;0.511854
3146.02;4065147302;0.534846
3148.01;4070820733;0.55524
3149.7;4075333304;0.572081
3151.18;4080611891;0.586904
3152.48;4085507029;0.284984
3167.93;4090570466;0.437522
3167.93;4095939038;0.437519
3167.93;4100713795;0.429863
3175.16;4105752701;0.498372
3175.16;4110296037;0.49475
3175.16;4115365675;0.491853
3177.43;4120229449;0.390034
3178.9;4125307461;0.405167
3179.98;4130479048;0.416374
3180.84;4135801199;0.42778
3193.96;4140872592;0.556984
3193.96;4145923582;0.5576
3193.96;4151964416;0.52742
3200.27;4155457644;0.567894
3200.27;4161018506;0.545061
3200.27;4166094518;0.524834
3203.45;4170792330;0.539519
3205.52;4175887871;0.545114
3207.04;4180523566;0.547229
3208.26;4185484255;0.406783
3219.21;4190897531;0.518396
3219.21;4195307749;0.518397
3219.21;4200164035;0.444508
3221.1;4205388402;0.463652
3222.32;4210482101;0.476053
3223.22;4215920547;0.461233
3239;4221036552;0.601219
3239;4225836706;0.590291
3239;4230793503;0.581574
3239;4235559222;0.455756
3242.07;4240708224;0.495061
3242.07;4245793943;0.495062
3242.07;4250957729;0.419976
3242.07;4256050137;0.419976
3242.07;4261154987;0.419976
3242.07;4265652873;0.388429
3258.58;4271011923;0.530658
3258.58;4275641054;0.515471
3258.58;4280843485;0.503312
3267.73;4285459101;0.486949
3267.73;4290835186;0.48695
3267.73;4295264576;0.486951
3267.73;4300738078;0.46787
3278.62;4306074188;0.564387
3278.62;4310364456;0.5553
3278.62;4316013403;0.402487
3279.47;4320242300;0.411512
3280.02;4325315380;0.417365
3280.42;4330316615;0.421678
3280.75;4335601511;0.388133
3281.83;4340745366;0.399612
3282.78;4345375418;0.409734
3283.61;4350474347;0.41877
3292.64;4355879133;0.510412
3292.64;4361011673;0.510412
3292.64;4365507637;0.356223
3304.09;4370888309;0.473656
3304.09;4375118944;0.473656
3304.09;4380202962;0.371566
3305.36;4386118645;0.384153
3306.18;4391264112;0.392312
3306.79;4395828779;0.398321
3307.27;4400891413;0.296234
3322.66;4405918113;0.465182
3322.66;4411048018;0.465182
3322.66;4415254714;0.455909
3332.72;4420913521;0.527355
3332.72;4425952463;0.523257
3332.72;4431050914;0.51998
3328;4435931022;0.46465
3328;4440862335;0.454525
3328;4446053283;0.445604
3328;4450416397;0.354344
3341.54;4455569868;0.495084
3341.54;4460595293;0.495085
3341.54;4465251025;0.37789
3343.02;4470862889;0.394043
3343.98;4475353418;0.404604
3344.68;4480470012;0.399799
3346.13;4485517501;0.407919
3347.36;4491153944;0.415804
3348.43;4495826808;0.423185
3363.64;4500876496;0.41655
3363.64;4506120763;0.41655
3363.64;4510162177;0.41655
3363.64;4516069812;0.313516
3371.63;4520218436;0.406648
3371.63;4526149831;0.406648
3371.63;4530755296;0.442253
3372.52;4535508252;0.452257
3373.09;4541079807;0.458782
3373.51;4545251286;0.463608
3373.84;4551164016;0.325112
3374.97;4555124625;0.337187
3375.95;4560311510;0.347832
3376.82;4565644746;0.341129
3377.6;4570788615;0.339062
3378.28;4576004942;0.338753
3378.88;4581038169;0.329439
3394.93;4585619355;0.478095
3394.93;4591118830;0.466738
3394.93;4595390456;0.342691
3394.93;4601183710;0.342691
3397.16;4605391173;0.362243
3398.8;4610638953;0.376782
3400.1;4615358206;0.292639
3402.63;4620508063;0.316233
3404.83;4625636846;0.337089
3406.78;4630740998;0.34585
3418.39;4635467180;0.464659
3418.39;4641160294;0.459733
3418.39;4645291984;0.4558
3424.09;4651065662;0.505615
3424.09;4655855020;0.494523
3424.09;4660495328;0.48472
3424.09;4666191744;0.476046
3426.38;4671092561;0.483677
3426.38;4675714768;0.47735
3426.38;4680526679;0.315605
3434.36;4686139470;0.397415
3434.36;4691260959;0.397416
3434.36;4695927081;0.397417
3437.51;4700880254;0.409038
3439.54;4706211126;0.415093
3441.04;4710931500;0.418753
3442.24;4716298685;0.408346
3453.71;4720200457;0.491883
3453.71;4725349211;0.472977
3453.71;4730503475;0.353259
3454.67;4735799972;0.3629
3455.3;4740942583;0.369145
3455.76;4745482010;0.318548
3470.57;4750185934;0.466054
3470.57;4755782926;0.466054
3470.57;4760821336;0.466054
3470.57;4766079497;0.449405
3477.59;4770726737;0.515611
3477.59;4775334219;0.515611
3477.59;4781136820;0.43383
3476.65;4785310276;0.423301
3476.65;4790760367;0.423301
3476.65;4796093514;0.392967
3478.15;4800367435;0.387801
3479.13;4805524507;0.382756
3479.84;4810682051;0.378143
3480.42;4815808276;0.267314
3485.81;4821106140;0.329471
3485.81;4825901592;0.329471
3485.81;4831109201;0.320162
3485.81;4835897838;0.314142
3497.88;4840550852;0.43264
3497.88;4845127635;0.274642
3499.36;4850393651;0.289392
3500.14;4855427473;0.297254
3500.66;4860271952;0.302377
3508.53;4865357232;0.310102
3508.53;4870689485;0.310102
3508.53;4876132259;0.310102
3508.53;4880546783;0.327835
3512.74;4886171847;0.403527
3512.74;4890574427;0.403527
3512.74;4895693637;0.386372
3513.53;4900740722;0.381462
3514.04;4905951809;0.377347
3514.42;4910232372;0.373818
3516.32;4915666514;0.317886
3517.92;4920695564;0.332604
3519.32;4925827071;0.345563
3520.56;4943060774;0.357099
3522.38;4948821748;0.251707
3517.25;4953201771;0.220633
3517.25;4962032030;0.208196
3524.59;4964241293;0.245918
3528.51;4968197229;0.278891
3531.06;4974132330;0.237544
3532.95;4978416520;0.262304
3551.29;4983556027;0.446764
3551.29;4988776669;0.446764
3551.29;4994081580;0.386258
3551.22;4998322463;0.385174
3551.17;5004068691;0.38453
3551.14;5008270820;0.37627
3551.11;5013722993;0.370852
3577.67;5018252693;0.641065
3577.67;5023411520;0.621789
3577.67;5028320977;0.605499
3568.35;5034190546;0.501436
3568.35;5038907419;0.489803
3568.35;5043777010;0.472243
3568.59;5048697937;0.57685
3568.75;5053644668;0.575237
3568.86;5058770494;0.474609
3568.96;5063624605;0.42314
3581.2;5068887179;0.502625
3581.2;5073134195;0.482705
3581.2;5078204831;0.299712
3574.51;5084026275;0.248349
3574.51;5088145858;0.24835
3574.51;5093523155;0.251406
3585.63;5098955613;0.356219
3585.63;5104082681;0.357353
3585.63;5109538108;0.358277
3585.73;5113242158;0.236085
3585.79;5118692659;0.240759
3585.83;5123533084;0.244203
3585.87;5128478987;0.177629
3599.92;5133139703;0.317825
3599.92;5138973413;0.317825
3599.92;5143233553;0.316802
3603.95;5148910484;0.370634
3603.95;5153610371;0.371132
3603.95;5158633792;0.371583
3602.32;5163737535;0.264547
3601.27;5168489236;0.245391
3600.49;5173932017;0.231485
3599.87;5178192631;0.253765
3617.45;5183694139;0.433982
3617.45;5188804325;0.433982
3617.45;5194072661;0.326207
3608.23;5199069872;0.234427
3608.23;5203545009;0.234427
3608.23;5208258894;0.231669
3638.84;5213127832;0.601948
3638.84;5218365001;0.599899
3638.84;5223526565;0.598268
3638.84;5228279138;0.474452
3636.65;5233908092;0.423895
3635.06;5238179545;0.389326
3633.78;5243956303;0.306452
3624.26;5248559636;0.203804
3624.26;5253186560;0.203805
3624.26;5258662073;0.219704
3642.28;5263500789;0.411527
3642.28;5268685341;0.420554
3642.28;5274066290;0.428048
3642.28;5279033391;0.248316
3642.15;5283293828;0.247263
3642.06;5288971542;0.246605
3641.99;5293388150;0.338837
3657.28;5298107746;0.490835
3657.28;5303688419;0.490835
3657.28;5308618903;0.286301
3680.95;5313543819;0.44408
3680.95;5318620543;0.44408
3680.95;5323858110;0.44408
3680.95;5329086361;0.450254
3648.89;5333213331;0.233259
3648.89;5338509093;0.214658
3648.89;5343946666;0.254797
3666.74;5348277046;0.427455
3666.74;5353739103;0.427455
3666.74;5358676811;0.248428
3681.07;5363569174;0.412338
3690.37;5368710057;0.521604
3697.22;5373604859;0.602689
3702.71;5378723571;0.66619
3660.71;5384091193;0.187326
3660.71;5388226667;0.188453
3660.71;5393703222;0.0356614
3712.49;5398887136;0.679645
3712.49;5403279851;0.679645
3712.49;5408273290;0.447934
3673.38;5413284410;0.086164
3673.38;5418421811;0.086164
3673.38;5423607229;0.086164
3686.36;5428649900;0.400438
3686.36;5434166588;0.400438
3686.36;5438315731;0.400438
3686.36;5443399468;0.198146
3663.52;5448654126;0.194983
3663.52;5454010034;0.194983
3663.52;5458555408;0.338329
3670.21;5463931412;0.354941
3674.56;5468670281;0.375624
3677.76;5473455054;0.396325
3684.93;5478619672;0.272601
3684.93;5483184211;0.272602
3684.93;5488769815;0.272605
3684.93;5493506370;0.394166
3697.41;5499124994;0.363798
3697.41;5503403425;0.363798
3697.41;5508936235;0.2462
3699.61;5513647068;0.262313
3699.61;5518816572;0.262313
3699.61;5523898646;0.141678
3706.6;5529057115;0.205626
3706.6;5533604352;0.205626
3706.6;5538766024;0.205626
3706.6;5543323696;0.501652
3703.19;5549129385;0.515097
3703.19;5553586362;0.515097
3703.19;5558298585;0.425402
3717.32;5563705075;0.463883
3717.32;5568855332;0.423549
3717.32;5573659166;0.324043
3717.23;5578060574;0.336181
3717.23;5583127140;0.336182
3717.23;5588397385;0.336184
3717.23;5594065637;0.24393
3721.07;5599802102;0.256168
3721.07;5616905549;0.256168
3724.14;5622625398;0.271817
3724.14;5627251793;0.271817
3725.39;5634490008;0.279711
3726.06;5637204464;0.227568
3726.49;5641963585;0.22978
3727.17;5647291552;0.237163
3727.71;5652548967;0.243062
3728.16;5657618722;0.254706
3729.1;5662310430;0.263364
3729.93;5667383076;0.271111
3730.67;5672732284;0.162982
3731.33;5676998694;0.167191
3732.3;5682106527;0.175953
3733.16;5687385720;0.159554
3733.91;5692355288;0.167081
3734.92;5697672851;0.177547
3735.8;5702847884;0.186764
3736.56;5707777171;0.169283
3745.89;5712272397;0.263329
3745.89;5717696341;0.218259
3745.89;5722369155;0.218259
3745.89;5727455523;0.206698
3750.06;5732042586;0.249805
3750.06;5737307363;0.246496
3750.06;5742469370;0.239145
3756.92;5747689879;0.292418
3756.92;5752424379;0.287788
3756.92;5756973027;0.27854
3756.92;5762147309;0.270368
3757.6;5767901450;0.269652
3758.09;5772298693;0.268042
3758.54;5777490223;0.26313
3758.93;5782101592;0.258684
3759.26;5787205401;0.254843
3759.55;5792485493;0.247518
3760.19;5797219419;0.244928
3760.76;5802568073;0.242878
3761.26;5807203178;0.153741
3770.83;5812732466;0.249485
3770.83;5816970862;0.249485
3770.83;5822137164;0.249486
3768.49;5827512108;0.202354
3768.49;5831967662;0.202354
3768.49;5837433173;0.202354
3768.49;5842148507;0.119332
3768.49;5847232623;0.119332
3770.19;5852542646;0.133067
3771.56;5865460170;0.14652
3792.22;5871109157;0.350087
3792.22;5875588833;0.345605
3780.37;5881205138;0.219543
3780.37;5885671821;0.215273
3780.37;5891419031;0.211636
3787.2;5896432372;0.277088
3787.2;5901526548;0.270544
3787.2;5906041981;0.264719
3787.11;5910607190;0.269954
3787.11;5916192921;0.180055
3787.11;5920859050;0.180055
3787.11;5925540610;0.180056
3795.71;5930928260;0.321198
3795.71;5935693710;0.321198
3795.71;5949931714;0.321198
3802.65;5955471379;0.362464
3795.32;5960846071;0.293727
3795.32;5966685669;0.270205
3795.32;5970932012;0.251829
3799.78;5975687352;0.0773803
3799.78;5980930903;0.0773808
3799.78;5985245892;0.198516
3799.78;5990364314;0.198516
3831.27;5995099058;0.553157
3831.27;6000278613;0.488096
3831.27;6005601135;0.488096
3805.23;6011070393;0.2104
3805.23;6015558834;0.185632
3805.23;6020590736;0.185632
3805.23;6025351535;0.185632
3817.31;6030227518;0.316439
3817.31;6035623233;0.222019
3817.31;6040735109;0.222019
3802.6;6045078364;0.0802986
3802.6;6050348983;0.00827957
3802.6;6055391270;0.0734279
3816.65;6060802816;0.228719
3816.65;6065926563;0.228719
3816.65;6071506323;0.200455
3822.9;6075967702;0.253769
3822.9;6080468225;0.253769
3822.9;6085130940;0.253769
3822.9;6090968558;0.109628
3818.22;6095255692;0.131631
3818.22;6101153019;0.131631
3818.22;6105713656;0.154412
3823.84;6110822339;0.201992
3823.84;6115001837;0.201992
3823.84;6120482044;0.201992
3846.52;6125510674;0.349297
3846.52;6130672698;0.349297
3846.52;6135254284;0.349297
3833.71;6140316538;0.317723
3833.71;6146125864;0.317723
3833.71;6150388022;0.317723
3833.71;6155700773;0.170835
3833.02;6160713418;0.163824
3832.52;6165827532;0.158724
3832.11;6170234831;0.0922143
3832.29;6175176723;0.094013
3832.44;6180428152;0.0956389
3832.59;6185270067;0.0971423
3838.3;6190296130;0.214802
3838.3;6195520776;0.214802
3838.3;6200744158;0.214802
3838.3;6205587002;0.161259
3829.67;6210371144;0.100734
3829.67;6215904202;0.100734
3829.67;6220538153;0.215022
3835.47;6225676904;0.306713
3835.47;6230006542;0.306713
3835.47;6235080319;0.124097
3843.12;6240921102;0.110212
3843.12;6245737384;0.110212
3843.12;6250995509;0.110212
3843.12;6254993235;0.114443
3851.85;6260368817;0.19746
3851.85;6265016596;0.201011
3851.85;6270039052;0.199041
3875.93;6275406828;0.492909
3875.93;6280631007;0.491145
3875.93;6285670861;0.458359
3853.95;6290947007;0.191547
3853.95;6294962604;0.191547
3853.95;6300114907;0.191547
3853.95;6305898915;0.271339
3865.65;6310379983;0.368636
3865.65;6315909911;0.368636
3865.65;6320269181;0.31039
3853.16;6326117391;0.221769
3853.16;6330537374;0.221769
3853.16;6335873042;0.121403
3868.3;6340496700;0.252955
3868.3;6345734376;0.252955
3868.3;6351016879;0.252955
3868.3;6355113831;0.168228
3860.33;6360299948;0.0849288
3860.33;6365674039;0.0849288
3860.33;6370408369;0.255298
3854.39;6375059178;0.291459
3854.39;6380559636;0.291459
3854.39;6385359098;0.0452132
3865.9;6391022056;0.126907
3865.9;6395639345;0.126907
3865.9;6400511751;0.126907
3866.51;6405907819;0.00871153
3866.91;6410092323;0.0126331
3867.2;6415227181;0.0155366
3867.43;6420727656;0.155021
3878.19;6425642624;0.279118
3878.19;6430655223;0.279118
3878.19;6435557919;0.103648
3867.55;6440596763;0.0339656
3867.55;6445407591;0.0339656
3867.55;6451000483;0.0339656
3867.42;6455430781;0.0708344
3867.33;6459990554;0.0702988
3867.26;6465091075;0.0702057
3867.21;6470817240;0.129734
3867.54;6475257888;0.133357
3867.84;6480677051;0.136545
3868.1;6485030428;0.035283
3858.98;6490465128;0.218466
3858.98;6495093247;0.218466
3858.98;6500858310;0.220628
3863.44;6505670524;0.138176
3866.34;6510954181;0.0865493
3868.48;6515346163;0.0521319
3870.19;6521068636;0.117514
3871.17;6525136182;0.0945441
3872.02;6530382718;0.0756537
3872.74;6535480418;0.0639972
3885.03;6541001657;0.214038
3885.03;6545144513;0.214036
3885.03;6550435210;0.220348
3884.77;6555871112;0.206367
3884.61;6560996138;0.198442
3884.49;6565644211;0.193203
3884.39;6570409780;0.185493
3890.41;6575756495;0.227051
3890.41;6580601470;0.224577
3890.41;6585292777;0.376084
3890.59;6590521735;0.382638
3890.7;6595600812;0.386945
3890.79;6600173772;0.312845
3889.55;6605226864;0.254652
3888.51;6610963357;0.212202
3887.6;6615167519;0.179123
3886.8;6620295433;0.157444
3887.35;6625266845;0.163977
3887.35;6630821531;0.151714
3887.35;6635702522;0.0509589
3910.68;6640616238;0.317156
3910.68;6645592789;0.317155
3910.68;6650759610;0.30369
3897.9;6655345538;0.147112
3897.9;6660228181;0.154367
3897.9;6665274674;0.160746
3897.9;6670319125;0.160388
3899.55;6675669948;0.0914589
3899.55;6680795540;0.0914595
3899.55;6685525671;0.0904032
3904.42;6690486235;0.143268
3904.42;6696013522;0.141246
3904.42;6700773775;0.153026
3891.4;6705132049;0.0428664
3891.4;6710824635;0.0492159
3891.4;6715946174;0.0555176
3899.21;6720343883;0.133512
3899.21;6725920643;0.133512
3899.21;6730811819;0.133511
3899.21;6735089136;0.13968
3906.39;6740263503;0.0873526
3906.39;6745810118;0.0873526
3906.39;6750190366;0.153414
3910.22;6755541269;0.143498
3910.22;6760206811;0.143498
3910.22;6764988030;0.143498
3905.91;6770339331;0.124204
3905.91;6775515871;0.124204
3905.91;6780755685;0.124204
3905.91;6786043850;0.0499149
3903.96;6790497965;0.120003
3903.96;6795050533;0.120003
3903.96;6800840418;0.176437
3910.2;6805554527;0.226203
3910.2;6811048611;0.226203
3910.2;6815504376;0.19432
3914.51;6820293893;0.241419
3914.51;6825296116;0.241419
3914.51;6830425042;0.241419
3914.51;6835577139;0.207122
3913.47;6840647501;0.184477
3912.7;6845700473;0.167886
3912.09;6850136367;0.091272
3911.58;6855153295;0.0805066
3911.13;6860945450;0.0712817
3910.74;6865065912;0.0556151
3910.62;6870447885;0.0548265
3910.53;6875066069;0.0543956
3910.46;6880340126;0.0542715
3907.04;6885420660;0.0568777
3907.04;6890857580;0.0568789
3907.04;6895995857;0.0568789
3907.04;6900182578;0.0558738
3928.55;6905428318;0.20583
3928.55;6910716557;0.20583
3928.55;6915004322;0.184489
3923.84;6920077179;0.0933081
3923.84;6925645547;0.0933081
3923.84;6930259249;0.0933081
3924.78;6935616802;0.11349
3925.38;6940561498;0.128345
3925.83;6945726386;0.14026
3926.19;6950445299;0.150367
3925.71;6955316789;0.151594
3925.28;6960860328;0.152834
3924.89;6965508447;0.149562
3918.22;6970975958;0.102144
3918.22;6975663903;0.102103
3918.22;6979949403;0.114402
3918.59;6985093967;0.116328
3918.83;6990132972;0.118142
3919.01;6995378265;0.119748
3919.16;7000308639;0.1702
3926.14;7005539001;0.141617
3926.14;7011089816;0.141617
3926.14;7015028390;0.0325991
3926.46;7020177267;0.0345189
3926.67;7025584776;0.0358655
3926.82;7031359914;0.0354491
3927.8;7035335569;0.0419337
3928.62;7039962265;0.0473841
3929.34;7045718722;0.0521457
3929.98;7050218102;0.0616186
3930.06;7055423788;0.0658801
3930.12;7060204098;0.0696633
3930.16;7065942606;0.121419
3930.35;7070233719;0.122867
3930.51;7075536723;0.124102
3930.64;7080230450;0.120578
3954.48;7085292761;0.392999
3954.48;7090663947;0.393573
3954.48;7095882272;0.394085
3926.27;7100916938;0.0819686
3926.27;7105571146;0.0819686
3926.27;7110408906;0.0819686
3926.27;7115529228;0.0813437
3926.74;7120521090;0.0888027
3927.09;7125723561;0.0943187
3927.36;7130172656;0.0996575
3934.35;7135219946;0.0588125
3934.35;7140594149;0.0519596
3934.35;7145662060;0.0459909
3943.41;7150297383;0.182024
3943.41;7155006641;0.180798
3943.41;7160381351;0.179803
3943.41;7165234783;0.17672
3943.84;7170462475;0.142516
3943.84;7175876156;0.142019
3943.84;7180579889;0.240729
3940.16;7185628461;0.208027
3940.16;7190230531;0.208025
3940.16;7195591180;0.151403
3932.26;7200008720;0.0601005
3932.26;7205151482;0.0601005
3932.26;7210609679;0.0601005
3932.26;7215378878;0.0566747
3954.91;7220456534;0.286248
3954.91;7225354339;0.284709
3954.91;7230610524;0.206209
3942.95;7235748516;0.085997
3942.95;7240869916;0.085997
3942.95;7245088290;0.112439
3943.22;7250268447;0.119606
3943.4;7255402083;0.124287
3943.53;7260564771;0.127749
3943.64;7265752460;0.0371234
3943.78;7270154271;0.0317389
3943.91;7275873044;0.0270911
3944.02;7280096399;0.0569669
3944.23;7285020831;0.0587039
3944.42;7290803395;0.0601961
3944.59;7295838437;0.157512
3950.39;7300560371;0.194069
3950.39;7305400698;0.194069
3950.39;7310685502;0.194068
3950.39;7314956999;0.0498601
3950.2;7320242439;0.0552375
3950.06;7325529022;0.059564
3949.95;7330631173;0.073442
3948.19;7335868783;0.0577302
3946.64;7340970667;0.0451736
3945.26;7345629301;0.0287766
3944.04;7351040454;0.017509
3942.94;7355676985;0.0146739
3941.99;7360319149;0.0199068
3941.15;7365201498;0.0269915
3932.81;7370634704;0.111065
3932.81;7375056394;0.11237
3932.81;7380566807;0.114525
3941.69;7385641982;0.0581044
3941.69;7390693550;0.0589949
3941.69;7395214202;0.0898942
3941.18;7401031346;0.0933279
3940.85;7405897699;0.0959396
3940.61;7410630573;0.0980396
3940.01;7415596412;0.102846
3939.5;7420851473;0.107274
3939.06;7425963711;0.111292
3938.67;7430607272;0.0982935
3938.72;7435295736;0.0809067
3938.78;7440398187;0.0654963
3938.84;7445570447;0.0519747
3939.22;7450753227;0.0373122
3939.57;7455310869;0.0243431
3939.89;7460192742;0.0131623
3940.45;7465413700;0.0764107
3940.95;7470546214;0.081399
3941.39;7475319022;0.0858267
3941.78;7480658986;0.0443493
3938.59;7485749160;0.033855
3938.59;7490558195;0.033855
3938.59;7496112328;0.0266217
3939.64;7500875854;0.0144768
3940.32;7505120378;0.00910075
3940.82;7512009153;0.0136627
3941.22;7515850856;0.0214761
3941.5;7520091104;0.0273966
3941.75;7525342813;0.03301
3941.96;7530675464;0.0324634
3942.06;7535061896;0.0359526
3942.14;7540308238;0.0444245
3942.2;7545396698;0.0468525
3946.65;7550888013;0.108966
3946.65;7555510118;0.106673
3946.65;7560548770;0.103324
3945.84;7565237201;0.0926568
3945.31;7570172445;0.0855701
3944.93;7575565775;0.0804195
3944.62;7580431379;0.0733603
3944.36;7585957888;0.0704936
3944.14;7590957390;0.0680186
3943.94;7595768707;0.0622205
3943.64;7600058820;0.0591976
3943.37;7605545495;0.0579355
3943.14;7610966415;0.0577162
3943.04;7616186717;0.0540476
3942.97;7620929979;0.050915
3942.91;7625244340;0.0482374
3942.87;7630055052;0.0385677
3942.58;7635766491;0.0324262
3942.32;7640132219;0.0271257
3942.1;7645416631;0.0490939
3941.91;7650447764;0.0504609
3941.75;7655418806;0.0516715
3941.6;7660920121;0.0438706
3941.74;7664990389;0.0368168
3941.86;7670223284;0.0313882
3941.98;7675248478;0.0269086
3942.08;7680196502;0.0230591
3939.41;7686068537;0.0487547
3937.01;7691107522;0.0720544
3934.84;7695950590;0.0920452
3945.2;7700515164;0.0523628
3945.2;7705997885;0.0532896
3945.2;7710934501;0.0561141
3944.45;7715764920;0.048332
3943.97;7719941317;0.044082
3943.62;7725258938;0.0413993
3939.49;7730991480;0.08093
3939.49;7735419604;0.0812841
3939.49;7740231563;0.081735
3939.49;7745863409;0.0822397
3932.73;7751132178;0.10216
3932.73;7755218261;0.100463
3932.73;7760738564;0.10158
3937.9;7764942439;0.0496263
3937.9;7770683702;0.0506283
3937.9;7775969057;0.0515588
3939.86;7780315119;0.0825282
3939.86;7785072829;0.0791507
3939.86;7790147901;0.0829872
3939.86;7795951268;0.151946
3933.11;7800026441;0.141526
3933.11;7805399002;0.141528
3933.11;7810301665;0.130954
3933.75;7815334943;0.125336
3934.17;7820138985;0.121695
3934.47;7825075258;0.0592361
3934.71;7830176979;0.0547356
3939.63;7835249325;0.0316758
3939.63;7840873322;0.0316758
3939.63;7845965768;0.173557
3937.7;7850540400;0.146217
3936.46;7855201960;0.128901
3935.54;7860850914;0.0433324
3934.81;7865839159;0.0417301
3940.01;7870929549;0.0522989
3940.01;7875014719;0.0140015
3939.58;7880864825;0.00835077
3939.35;7885056633;0.00688769
3939.2;7890964571;0.00705557
3939.09;7895859442;0.0900621
3935.32;7900018530;0.0279009
3935.32;7905959863;0.0279009
3935.32;7910968611;0.0164079
3936.57;7916039182;0.0266128
3937.38;7920750063;0.0327315
3937.98;7925234032;0.0369042
3937.77;7930988620;0.0476296
3937.59;7935952963;0.0504932
3937.43;7940414348;0.0530609
3937.29;7945591825;0.0287911
3937.67;7950936162;0.0164858
3938.01;7955795258;0.0248232
3938.32;7960233611;0.0375076
3931.81;7965870824;0.094357
3931.81;7970355776;0.0943581
3931.81;7975637375;0.0938636
3949.13;7980864620;0.0977613
3949.13;7986048272;0.0993131
3949.13;7991997125;0.100486
3949.42;7995714669;0.149315
3949.6;8001057977;0.151952
3949.74;8005167858;0.153908
3949.85;8010219586;0.138899
3939.34;8015644234;0.0304233
3939.34;8020298698;0.0212361
3939.34;8025677294;0.0246879
3933.02;8031064192;0.070439
3933.02;8034984104;0.0678099
3933.02;8040829366;0.0654016
3935.11;8046093200;0.039052
3936.46;8050712985;0.0232576
3937.46;8055248589;0.0123636
3938.26;8060928458;0.0758697
3931.92;8065705693;0.0310177
3931.92;8070347948;0.0310167
3931.92;8075453516;0.173653
3932.23;8080531255;0.172574
