Distance;Time;Velocity Kalman
0;574076;4.88684e-05
0.00048852;4881482;4.88684e-05
0.00048852;9722785;4.88624e-05
0.000489234;15137249;4.39901e-05
0.000977039;20360434;4.39834e-05
0.000977635;25196778;4.39834e-05
0.000977635;29952498;3.90985e-05
0.00146611;35335180;3.91054e-05
0.00146611;40206797;3.90985e-05
0.00146683;45434521;3.42209e-05
0.00146683;49903483;3.42209e-05
0.00195527;55616453;3.42209e-05
0.00195527;60045901;3.42137e-05
0.00195604;65373855;2.93449e-05
0.00195604;69743794;2.93366e-05
0.00195604;75175359;2.44527e-05
0.00195694;80382993;2.44617e-05
0.00244446;85637734;2.44527e-05
0.00244527;90474983;2.44527e-05
0.00244527;94776997;2.44527e-05
0.00244527;100037913;1.95694e-05
0.00244617;105478536;1.95795e-05
0.00244617;110270920;1.95694e-05
0.00244617;115548270;1.46992e-05
0.00244617;119924722;1.46873e-05
0.00244717;125038778;1.46992e-05
0.00244717;130191402;9.82386e-06
0.00244717;135415604;9.82386e-06
0.00244717;140326922;9.80845e-06
0.00244826;145670055;9.82386e-06
0.00244826;149963525;4.9679e-06
0.00244826;155294421;4.9679e-06
0.00244826;160303188;4.94206e-06
0.00244945;165646900;4.9679e-06
0.00244945;170021888;4.9679e-06
0.00244945;175085704;4.94206e-06
0.00244945;180334598;7.62939e-07
0.00244945;184791839;6.10352e-07
0.00244945;190435613;6.10352e-07
0.00244945;194839730;6.10352e-07
0.00245073;200327780;6.10352e-07
0.00245073;205539199;6.10352e-07
0.00245073;209995207;6.10352e-07
0.00245073;215314144;6.10352e-07
0.00245073;220695067;4.57764e-07
0.00245073;224971432;4.57764e-07
0.00245073;230297072;4.57764e-07
0.00245073;235653321;4.57764e-07
0.00245073;240079538;3.05176e-07
0.00245073;245492572;3.05176e-07
0.00245211;249971365;4.57764e-07
0.00245211;255177719;4.57764e-07
0.00245211;260552592;3.05176e-07
0.00245211;264845343;3.05176e-07
0.00245211;270078489;3.05176e-07
0.00245211;275429602;3.05176e-07
0.00245211;279671556;3.05176e-07
0.00245211;285502224;3.05176e-07
0.00245211;289722578;3.05176e-07
0.00245211;294973395;1.52588e-07
0.00245211;300474306;1.52588e-07
0.00196649;305130645;4.8852e-06
0.00196649;310543234;4.8852e-06
0.00196649;314837122;4.8852e-06
0.00196649;320028679;4.8852e-06
0.00196649;325372912;4.8852e-06
0.00196649;329604393;4.8852e-06
0.00196649;335614867;4.8852e-06
0.00196649;340063589;4.8852e-06
0.00196649;345452487;4.88281e-06
0.00196649;350266012;4.88281e-06
0.00196649;355640985;4.88281e-06
0.00196649;359943301;4.88281e-06
0.00196649;364746053;4.88281e-06
0.00196649;370001849;4.88281e-06
0.00196649;375255184;4.88281e-06
0.00196649;380489303;4.88281e-06
0.00196649;384890563;4.88281e-06
0.00148262;390420911;9.76562e-06
0.00148262;394805360;9.76562e-06
0.00148262;400655509;4.88281e-06
0.00148262;405183681;4.88281e-06
0.00148262;409864940;4.88281e-06
0.00148262;415106858;4.88281e-06
0.00148262;420421444;4.88281e-06
0.00148262;424745762;4.88281e-06
0.00148262;430463305;4.88281e-06
0.00148262;434767000;4.88281e-06
0.00148262;439986264;4.88281e-06
0.00148034;445539267;4.8852e-06
1.55564;450028713;0.0155754
3.07134;455529980;0.0307324
4.54616;459907042;0.0454807
5.97963;465290196;0.0598154
8.79265;470133779;0.0879455
11.5279;474792115;0.115298
14.1852;480510640;0.141871
18.051;484860823;0.180524
21.8059;490288498;0.218073
25.4499;495187532;0.254514
30.1482;500565023;0.301496
34.7064;504913486;0.347078
39.1266;510121961;0.39128
44.5422;515541558;0.445436
49.7921;519954369;0.497935
54.8777;525074868;0.548791
60.9242;530320316;0.609256
66.7797;535650690;0.667811
72.4462;540082989;0.724477
77.9257;545298959;0.763702
84.3349;549878248;0.812638
90.5329;555304910;0.859871
96.5205;559669257;0.905414
103.407;565125560;0.946154
110.061;569628381;0.985343
116.484;574594684;1.023
123.777;579929287;1.05728
130.816;585289162;1.09013
137.607;590483561;1.1216
145.238;594731323;1.15093
152.6;600121809;1.17897
159.694;605593251;1.20571
166.526;610508435;1.21987
174.177;614789006;1.24389
181.546;620177614;1.26672
188.636;624978176;1.27716
196.522;630184817;1.29746
204.112;635594197;1.3167
211.409;640176752;1.33487
219.48;645481739;1.35149
227.241;650101006;1.36712
234.698;655425176;1.38182
242.906;659731646;1.39503
250.794;665245876;1.40738
258.367;669958335;1.41888
265.632;675030692;1.41859
273.635;680287902;1.42822
281.312;685473419;1.4371
288.673;690761878;1.43439
296.753;695690546;1.44158
304.502;700170114;1.44812
311.924;705725131;1.45402
319.027;710681157;1.44854
326.84;715018356;1.45299
334.321;720277347;1.45689
341.476;724902156;1.44958
349.326;730136027;1.45218
356.838;734792674;1.45433
364.019;740444458;1.44543
371.881;744848605;1.44644
379.399;750433083;1.44705
386.581;754825757;1.43679
393.437;760479761;1.42646
400.966;764663971;1.42602
408.157;770180655;1.42528
415.016;775537386;1.41385
422.537;779766389;1.41228
429.717;785228686;1.41047
436.562;789604187;1.39812
444.057;794949117;1.39559
451.209;800239597;1.39289
458.024;804568547;1.39001
464.512;810169483;1.37675
471.647;815514417;1.37329
478.445;819765120;1.36972
484.913;824809259;1.3559
492.018;830320208;1.35183
498.785;835617946;1.3477
505.222;840197016;1.33345
512.286;845403378;1.3289
519.012;849779591;1.32434
525.407;855174726;1.31973
531.481;859874631;1.30517
538.18;865352734;1.30026
544.549;869977285;1.29536
550.596;874698957;1.28061
557.26;879876873;1.27546
563.595;885110661;1.27035
569.607;890450364;1.25552
576.229;894697100;1.25022
582.521;900074237;1.24499
588.493;904810266;1.23983
595.065;910243658;1.2342
601.308;915430559;1.22866
607.232;919684286;1.22322
612.846;925430293;1.2083
619.059;929939803;1.20276
624.954;934639427;1.19734
630.539;940044810;1.18255
636.716;945266698;1.17706
642.577;950580849;1.17171
648.129;954957370;1.16651
654.266;960278139;1.16088
660.087;965586579;1.1554
665.601;970023695;1.15007
670.817;974834364;1.13559
676.618;979997374;1.13025
682.113;985246629;1.12508
687.313;990438599;1.11085
693.089;994728072;1.10569
698.561;1000048047;1.1007
703.739;1004932647;1.08676
709.486;1010440843;1.08179
714.932;1015136379;1.07701
720.084;1020609144;1.0724
724.952;1025549627;1.05894
730.389;1029949878;1.05436
735.535;1035149825;1.04997
740.397;1039935822;1.03682
745.822;1045185875;1.03247
750.958;1050478628;1.02829
755.81;1054844516;1.01546
760.39;1060253698;1.00304
765.532;1065548452;0.999323
770.395;1070008053;0.995787
774.985;1074915861;0.983679
780.13;1080093069;0.980177
784.997;1085264053;0.976854
789.593;1090315059;0.965057
794.737;1095549472;0.961768
799.604;1099990034;0.958658
804.202;1105461024;0.947162
808.538;1110126147;0.936072
813.422;1115549310;0.933387
818.038;1120015553;0.930875
822.394;1124863718;0.920052
827.289;1130305947;0.91755
831.919;1134721871;0.915221
836.289;1140234078;0.904675
841.192;1145568730;0.902351
845.83;1150055160;0.9002
850.209;1154961356;0.898203
855.114;1160269419;0.89582
859.754;1165437610;0.8936
864.138;1169685560;0.891543
868.275;1175287104;0.881453
872.933;1180587096;0.879367
877.337;1184941910;0.877444
881.494;1190437131;0.867571
886.165;1194848189;0.865619
890.583;1200115918;0.86382
894.755;1205444566;0.862174
899.434;1209890058;0.860118
903.86;1215341495;0.858225
908.042;1219658369;0.85649
911.985;1224786019;0.84696
916.434;1230424343;0.845156
920.639;1234738716;0.843501
924.607;1240120871;0.834158
929.073;1245393944;0.832434
933.296;1250012277;0.830868
937.283;1255476725;0.821699
941.041;1259899976;0.812871
945.294;1265469305;0.811563
949.313;1270028100;0.810388
953.104;1275124619;0.801714
957.383;1280390939;0.80046
961.428;1284757406;0.799344
965.245;1290314681;0.790799
969.542;1295566159;0.78959
973.606;1300035903;0.788509
977.444;1304993810;0.780103
981.752;1310478684;0.778923
985.829;1314766496;0.777873
989.681;1320024585;0.776961
993.314;1325294717;0.768802
997.415;1330625888;0.767766
1001.29;1335049039;0.766854
1004.95;1340202965;0.758794
1009.07;1345747901;0.757759
1012.97;1350212113;0.756852
1016.65;1354726672;0.756069
1020.12;1359791696;0.748217
1024.04;1365293814;0.747296
1027.75;1370069088;0.746493
1031.25;1374680031;0.738711
1035.2;1379932238;0.73776
1038.94;1385286454;0.736938
1042.46;1389970759;0.729229
1046.43;1395275136;0.728259
1050.18;1400620727;0.727407
1053.73;1405089102;0.719763
1057.07;1409615323;0.712406
1060.85;1414883256;0.711693
1064.42;1420266006;0.711094
1067.79;1426728909;0.703787
1071.6;1430378838;0.703029
1075.19;1434769599;0.702381
1078.58;1439960007;0.695118
1082.4;1445249011;0.694306
1086.01;1450560169;0.693603
1089.42;1454992205;0.693019
1092.63;1459879297;0.6859
1096.27;1465437802;0.685133
1099.7;1470029759;0.684475
1102.94;1474818858;0.67738
1106.59;1479992867;0.676549
1110.05;1485164270;0.675817
1113.31;1490293785;0.668747
1116.97;1495043272;0.667842
1120.43;1500425201;0.667045
1123.71;1505119287;0.666362
1126.79;1510207458;0.659417
1130.28;1515538877;0.658541
1133.57;1520109830;0.657769
1136.68;1525146976;0.650833
1140.18;1529679182;0.649874
1143.49;1534945222;0.649028
1146.61;1539626252;0.642107
1150.12;1545095279;0.641073
1153.43;1550581350;0.640138
1156.56;1555074024;0.639312
1159.52;1559939488;0.632515
1162.85;1565232765;0.631491
1166;1570694023;0.630586
1168.97;1574608417;0.623784
1172.31;1579910158;0.622676
1175.47;1585209143;0.621681
1178.46;1589770700;0.614894
1181.8;1595193658;0.613702
1184.97;1600541550;0.612619
1187.96;1605141787;0.611645
1190.77;1610501935;0.604967
1193.95;1614766783;0.603794
1196.95;1620108377;0.602731
1199.78;1625358552;0.596062
1202.97;1629917900;0.594796
1205.97;1635179824;0.593644
1208.81;1640331644;0.586976
1211.99;1645537724;0.58563
1215;1649997628;0.584398
1217.84;1655522633;0.583266
1220.52;1660355601;0.576721
1223.54;1665612968;0.575391
1226.39;1670083523;0.574179
1229.08;1675093621;0.567634
1232.1;1680409656;0.566215
1234.95;1684699151;0.564909
1237.64;1689696958;0.558379
1240.66;1695127497;0.556881
1243.51;1700464549;0.555496
1246.2;1705043334;0.554224
1248.73;1710405752;0.547813
1251.58;1714764468;0.546335
1254.28;1720060168;0.54497
1256.82;1724719536;0.538564
1259.67;1730014161;0.537005
1262.37;1735680022;0.535566
1264.91;1740034254;0.52917
1267.76;1745541634;0.527528
1270.44;1749988739;0.526004
1272.98;1755299598;0.524599
1275.37;1760067741;0.518327
1278.06;1765574853;0.516715
1280.6;1770137672;0.515231
1282.99;1776184574;0.508968
1285.68;1780512024;0.507276
1288.21;1784883686;0.505699
1290.6;1790083820;0.499451
1293.27;1795415519;0.497685
1295.8;1799784952;0.496033
1298.18;1804542631;0.494504
1300.84;1809909480;0.492541
1303.35;1815363128;0.4907
1305.72;1819941227;0.488979
1307.95;1825403779;0.482771
1310.45;1830074959;0.480842
1312.82;1835472763;0.479046
1315.04;1839920817;0.472858
1317.53;1845409263;0.470864
1319.88;1849902116;0.468994
1322.1;1855209219;0.467248
1324.18;1859882934;0.461199
1326.52;1865374576;0.459245
1328.74;1870096490;0.457429
1330.82;1875593655;0.451399
1333.15;1879776114;0.449381
1335.35;1884986772;0.447486
1337.42;1890685877;0.441481
1339.74;1895480101;0.439388
1341.92;1900031417;0.437425
1343.98;1905418873;0.431449
1345.92;1910593905;0.425706
1348.1;1914921403;0.423777
1350.15;1920194262;0.421976
1352.08;1925456270;0.416262
1354.24;1930156020;0.414259
1356.28;1935463460;0.412389
1358.2;1939903677;0.40669
1360.34;1945243336;0.404623
1362.37;1950589767;0.402693
1364.27;1954826034;0.400883
1366.39;1960195709;0.398652
1368.39;1965445919;0.39655
1370.27;1970173068;0.394586
1372.05;1975445273;0.388966
1374.03;1979644088;0.386795
1375.9;1984939340;0.384757
1377.65;1990339429;0.379167
1379.62;1994587592;0.376931
1381.47;1999987611;0.374818
1383.21;2004748555;0.37285
1385.14;2010341676;0.37045
1386.97;2014783469;0.36819
1388.69;2020005582;0.366058
1390.3;2025708949;0.360562
1392.1;2030306613;0.358232
1393.8;2035635143;0.356035
1395.4;2040041939;0.350569
1397.18;2045279126;0.348165
1398.86;2050644340;0.345914
1400.44;2055074664;0.340478
1401.92;2060078016;0.335259
1403.58;2065402357;0.333008
1405.14;2069939953;0.330905
1406.6;2075497723;0.325711
1408.24;2079818456;0.323391
1409.78;2084995574;0.32122
1411.22;2090026503;0.316045
1412.83;2095293392;0.313671
1414.35;2100621010;0.311435
1415.77;2104943873;0.306295
1417.35;2110300564;0.303851
1418.84;2115596530;0.301556
1420.24;2120041555;0.299399
1421.55;2125371898;0.294423
1423.01;2129615908;0.292053
1424.38;2134790459;0.289822
1425.67;2140471634;0.28488
1427.1;2144664486;0.282441
1428.45;2150020409;0.280141
1429.71;2154489270;0.277984
1431.12;2159707956;0.275412
1432.43;2165297600;0.272973
1433.67;2169975570;0.270683
1434.82;2174816283;0.265864
1436.11;2179988448;0.263361
1437.32;2185155091;0.261002
1438.45;2190006367;0.256203
1439.71;2195262562;0.253621
1440.89;2200605012;0.251197
1442;2206614268;0.246428
1443.22;2209902733;0.243787
1444.37;2215432038;0.241293
1445.44;2220059251;0.238948
1446.44;2225710321;0.234348
1447.56;2230034476;0.23178
1448.61;2235269135;0.229361
1449.58;2240551381;0.224781
1450.67;2244946902;0.222149
1451.68;2250516889;0.219656
1452.63;2254948605;0.215109
1453.51;2260341814;0.210756
1454.49;2265553810;0.208248
1455.41;2270013179;0.205879
1456.27;2275349302;0.20154
1457.22;2279661015;0.198958
1458.11;2284854016;0.196524
1458.93;2290331060;0.192205
1459.85;2295629233;0.189544
1460.7;2300043898;0.187041
1461.49;2305474918;0.182742
1462.23;2309932617;0.178646
1463.05;2315720616;0.176108
1463.81;2320065580;0.173714
1464.52;2324919212;0.169623
1465.31;2330538735;0.167006
1466.04;2334862357;0.164543
1466.71;2339850045;0.160466
1467.46;2345155197;0.15778
1468.15;2350557633;0.155233
1468.79;2354975376;0.152833
1469.39;2360612338;0.14893
1470.04;2364785036;0.146303
1470.65;2369977607;0.14382
1471.21;2374705175;0.139922
1471.83;2380061656;0.137206
1472.4;2385595991;0.134649
1472.92;2389595846;0.13077
1473.5;2394863460;0.127975
1474.03;2400171039;0.125344
1474.52;2404821017;0.12285
1474.96;2409732041;0.119125
1475.45;2415306713;0.1164
1475.91;2419759970;0.113832
1476.32;2425567304;0.110112
1476.77;2430005516;0.107302
1477.18;2435445625;0.104646
1477.55;2439949071;0.100946
1477.96;2445213932;0.0980567
1478.32;2450422662;0.0953259
1478.66;2454754480;0.0927339
1478.96;2459787298;0.0891968
1479.29;2465181900;0.0863722
1479.58;2470607314;0.083696
1479.84;2475465690;0.0801639
1480.12;2479835663;0.07726
1480.37;2485165564;0.074495
1480.6;2490038165;0.0709824
1480.83;2495447097;0.0679896
1481.03;2499909729;0.0651503
1481.21;2505149639;0.0624739
1481.39;2510592369;0.059387
1481.55;2514865702;0.0564537
1481.69;2520130709;0.0536833
1481.8;2525158668;0.0503195
1481.91;2530475623;0.0473068
1482;2534875881;0.0444475
1482.07;2540342150;0.0410937
1482.12;2544807081;0.0380019
1482.17;2550373610;0.0350684
1482.19;2554756310;0.0322882
1482.2;2559880135;0.0291122
1482.2;2565236140;0.0261639
1482.18;2569749754;0.023364
1482.15;2574636286;0.0202575
1482.11;2579892719;0.0173882
1482.06;2585224045;0.0146625
1482;2590155741;0.011724
1481.93;2595439118;0.00901297
1481.86;2599909973;0.00643586
1481.77;2604708897;0.00373976
1481.68;2609909366;0.00125643
1481.58;2615511817;0.00108832
1481.47;2620035178;0.00329462
1481.35;2625129566;0.0055455
1481.24;2630413786;0.0075984
1481.11;2634743730;0.00951789
1480.98;2640007793;0.0114125
1480.85;2645240063;0.0131141
1480.72;2650579256;0.0146972
1480.58;2654961932;0.0161761
1480.43;2660437291;0.0176058
1480.29;2664699704;0.0188575
1480.15;2670332661;0.020015
1480;2675384773;0.021138
1479.85;2679670654;0.0221026
1479.7;2684836398;0.0229732
1479.55;2690054365;0.023829
1479.4;2694895220;0.0245217
1479.25;2700350303;0.0251449
1479.1;2704681902;0.0257534
1478.96;2710157654;0.0262233
1478.81;2715454927;0.0266142
1478.66;2720002887;0.0269455
1478.51;2725392651;0.0272818
1478.37;2729646640;0.0274798
1478.22;2734863817;0.0276183
1478.08;2739646513;0.0277717
1477.94;2745086821;0.0278063
1477.8;2750600581;0.0277817
1477.66;2755014417;0.0277173
1477.53;2759629270;0.0276728
1477.4;2764901076;0.0275145
1477.27;2770395302;0.0273215
1477.14;2774970386;0.0271582
1477.01;2780359469;0.0268861
1476.89;2785771721;0.0265794
1476.77;2790011885;0.0263123
1476.66;2795296456;0.0259413
1476.55;2800563353;0.0255456
1476.44;2805181410;0.0251943
1476.33;2809989022;0.0248135
1476.22;2815574659;0.0243436
1476.12;2820007815;0.0238538
1476.02;2825166567;0.0234184
1475.93;2830584232;0.022894
1475.84;2834760838;0.0223547
1475.75;2840226625;0.0218651
1475.67;2845450325;0.0212962
1475.59;2849748165;0.0207174
1475.51;2855110376;0.0201336
1475.43;2859914311;0.0196043
1475.37;2865312815;0.0189959
1475.3;2869944343;0.0183826
1475.23;2875239049;0.0178336
1475.17;2880527920;0.0172151
1475.11;2884845094;0.0165918
1475.05;2890181254;0.0160426
1475.01;2895421995;0.0154144
1474.96;2900002330;0.0147813
1474.91;2905616623;0.0141628
1474.86;2910009668;0.0136039
1474.82;2915317909;0.0130547
1474.78;2919623918;0.0124266
1474.74;2924823014;0.0118776
1474.71;2929671735;0.0113382
1474.68;2934986163;0.0107249
1474.65;2940425088;0.0101906
1474.63;2945404766;0.00966123
1474.61;2949656989;0.00906274
1474.59;2954944946;0.00847407
1474.57;2959949005;0.00796933
1474.56;2965291050;0.00739068
1474.55;2969933526;0.00683151
1474.54;2974875459;0.00633702
1474.53;2980189742;0.00579273
1474.53;2985530451;0.0052487
1474.53;2990041852;0.00478861
1474.53;2995355246;0.00426913
1474.53;3000688087;0.00375472
1474.54;3005006286;0.00325984
1474.55;3010312365;0.00269117
1474.56;3015531013;0.00222097
1474.57;3019967890;0.00175106
1474.58;3025227906;0.00128624
1474.6;3029717697;0.000845823
1474.61;3035043588;0.000405657
1474.63;3039663370;1.97682e-05
1474.65;3044965663;0.000430453
1474.67;3050288930;0.000836024
1474.69;3054729367;0.00123169
1474.71;3060306974;0.00153853
1474.74;3065591103;0.0019144
1474.76;3070051725;0.00227554
1474.79;3074838102;0.00255269
1474.82;3080018555;0.00289887
1474.85;3085229065;0.00323031
1474.88;3089971558;0.00348258
1474.91;3094705704;0.00379428
1474.95;3100154404;0.00410085
1474.98;3105628043;0.00431866
1475.02;3109883179;0.0046055
1475.06;3115285924;0.00487762
1475.09;3119845506;0.00514469
1475.13;3124986362;0.00533262
1475.17;3130469078;0.00557514
1475.21;3134664732;0.0058126
1475.25;3139682373;0.00597574
1475.29;3145141787;0.00619351
1475.33;3149722918;0.00640623
1475.37;3155339310;0.00660907
1475.41;3160005527;0.00673764
1475.46;3165159241;0.00692565
1475.5;3170433137;0.00711345
1475.55;3174768107;0.00728658
1475.59;3179992628;0.00744506
1475.64;3185483056;0.00760335
1475.68;3190117333;0.00768252
1475.73;3195290409;0.00783084
1475.78;3200658952;0.00796452
1475.82;3204595761;0.00802874
1475.87;3210126876;0.00815729
1475.92;3215650573;0.00827121
1475.97;3220018461;0.00838497
1476.01;3225169461;0.00842448
1476.06;3230496197;0.00852832
1476.11;3234701125;0.00862238
1476.15;3239769710;0.00864702
1476.21;3245048538;0.008736
1476.25;3250262808;0.00881043
1476.3;3255527817;0.00888951
1476.35;3260525013;0.00888955
1476.4;3265592489;0.00895397
1476.44;3270051504;0.00894901
1476.49;3274902223;0.0089488
1476.54;3280094935;0.00900331
1476.59;3285486966;0.00906255
1476.64;3290234642;0.00903797
1476.69;3294624121;0.00909221
1476.74;3300074071;0.00913672
1476.78;3305589022;0.00910225
1476.84;3309960730;0.00914178
