Distance;Time;Velocity Kalman
0;556029;0.00172772
0.116668;4917455;0.000380597
0.230364;9920585;0.00109943
0.341242;14367794;0.0024239
0.316386;19118525;0.00239355
0.292145;24415774;0.00236275
0.268676;29552711;0.00233083
0.245872;34249310;0.00229822
0.223786;39446157;0.00226404
0.202234;44017133;0.00222688
0.181454;49794832;0.00151503
0.229337;55020393;0.00149314
0.276779;59685215;0.00147235
0.32335;64311337;0.00212739
0.431787;70002785;0.00341167
0.537542;74774303;0.00466253
0.640102;79779520;0.00587675
0.740118;84149342;0.00705717
0.704244;89889732;0.00687381
0.669234;94747419;0.00669234
0.634819;99664883;0.00518152
0.601036;104772975;0.00370674
0.568041;109174863;0.0022683
0.535796;114186886;0.00219417
0.504189;120021462;0.00212044
0.473296;124793314;0.00204631
0.44324;129239342;0.00197413
0.413746;134736486;0.00190077
0.38517;140004229;0.00183167
0.357333;144283287;0.00176257
0.330294;149781886;0.00101378
0.303965;154071072;0.000378351
0.278373;159318591;0.000607819
0.253515;164954821;0.00184693
0.229634;169771310;0.00313146
0.206423;174811608;0.00438806
0.184132;179908589;0.00561465
0.162811;184515869;0.00547777
0.142399;189534649;0.00534234
0.123024;194828764;0.00520638
0.104709;199283434;0.00507068
0.153083;204445401;0.00426634
0.200599;209428115;0.00348607
0.247186;214763834;0.00273299
0.357167;219524192;0.00131726
0.466675;224302745;0.0004694
0.57379;229113294;0.00161751
0.678502;234451189;0.00293459
0.744312;239973496;0.00387294
0.808548;244525548;0.0047867
0.871044;250005038;0.00567484
0.96209;254474322;0.00683736
1.0506;259377125;0.0079716
1.13678;264802497;0.00907556
1.15602;269899985;0.00950654
1.17466;274383100;0.00992508
1.19239;279522506;0.0103275
1.20939;284579610;0.0107165
1.2249;289153609;0.0110776
1.23956;294375393;0.0114244
1.25354;299353805;0.0110758
1.26676;304146213;0.010741
1.27937;309678510;0.0104144
1.2915;314412016;0.00939911
1.23378;320100846;0.00770457
1.17726;324422107;0.00605435
1.12167;329206003;0.00444226
1.06737;334681012;0.00327015
17.9662;339799595;0.180933
17.9662;344427894;0.180903
17.9662;349378624;0.181213
27.0383;354396679;0.272485
32.924;359017585;0.331744
37.26;364337562;0.375347
47.0062;369189325;0.473074
55.2388;374973152;0.555625
62.408;379302161;0.627522
68.7253;384633438;0.690688
80.0793;389098389;0.804229
90.2128;394957700;0.905552
99.171;399658262;0.995317
112.707;404434546;1.13086
124.629;409109374;1.25025
135.028;414113738;1.35404
148.767;419478685;1.4912
160.731;424543469;1.61062
171.089;429470429;1.71399
185.09;434923063;1.67183
197.275;439052003;1.79365
207.852;444940914;1.8994
217.014;449514675;1.9
229.085;454025701;1.96175
239.638;459285539;2.02387
248.86;464122129;2.01857
260.404;469881255;2.05166
270.575;474991107;2.08167
279.537;479134945;2.10812
287.437;484221578;2.07359
298.24;489703774;2.08028
307.858;494936897;2.0869
316.427;499600822;2.03725
326.417;505012276;2.01795
335.372;509439972;2.00353
343.405;514170184;1.94641
353.48;519735411;1.92751
362.581;524002100;1.91492
370.805;529074972;1.85715
380.689;534369419;1.83415
389.672;539260469;1.81822
397.84;544305525;1.80828
405.269;549599170;1.76187
414.386;554324077;1.74753
422.724;559844431;1.73873
430.353;564549361;1.69958
439.717;569880578;1.69154
448.329;574112605;1.68805
456.249;580025274;1.68828
465.773;585005267;1.6755
474.57;589511278;1.6673
482.698;594785787;1.66288
490.207;599714963;1.63807
498.884;604475739;1.6353
506.929;609513313;1.63544
514.387;614199239;1.60932
523.295;619988685;1.60748
531.584;624277494;1.60821
539.296;629590747;1.58661
548.518;634622968;1.58918
557.128;639817971;1.5938
565.166;644299808;1.60008
572.666;649152902;1.58398
581.156;654271514;1.58559
589.098;659512054;1.58882
596.525;664076033;1.56945
605.191;669649305;1.56996
613.318;674028340;1.572
620.936;679691996;1.55295
629.896;684987996;1.55458
638.318;689536617;1.55754
646.233;694254322;1.5616
653.664;699549569;1.54909
661.795;704073516;1.54998
669.441;709951269;1.55191
676.627;714943938;1.53472
685.068;719476703;1.53624
693.024;724581239;1.53869
700.517;729189637;1.52132
708.978;734702542;1.51969
716.962;739432120;1.51903
724.49;745022862;1.51919
736.261;749713791;1.55311
736.26;754190982;1.47354
736.258;759384824;1.39914
736.256;764261197;1.31244
741.858;770017401;1.28738
745.966;774353868;1.25242
749.249;779745802;1.19582
756.419;784508106;1.18323
762.683;789314808;1.16669
768.232;794763849;1.14783
773.151;799764220;1.11554
781.527;804098784;1.12275
788.98;809509733;1.12534
795.538;814598946;1.1065
805.831;820095043;1.12979
814.873;824278835;1.14522
822.749;830012888;1.13944
833.035;834132261;1.16232
841.991;839460907;1.1765
849.754;844176670;1.13513
860.45;849318781;1.24207
869.781;854557073;1.33537
877.906;859618126;1.41662
884.971;864530119;1.43118
894.665;869744003;1.48705
903.178;874395482;1.53936
910.653;879455392;1.54245
920.489;884273151;1.57823
929.2;889401554;1.60991
936.917;894991817;1.63796
946.746;899842405;1.65249
955.519;904804677;1.66571
963.356;909976540;1.67849
970.359;914486023;1.64562
979.361;919292247;1.64524
987.466;924036319;1.64755
994.769;929734507;1.61783
1003.9;934926222;1.6197
1012.19;939270851;1.62497
1019.7;945001195;1.59323
1028.68;949552455;1.58982
1036.87;954413219;1.59054
1044.34;959412888;1.59468
1051.16;964238786;1.56575
1059.55;969591363;1.5644
1067.25;974042718;1.56653
1074.32;979451900;1.53871
1082.9;984720571;1.53741
1090.82;989315245;1.53936
1098.12;994115224;1.51405
1104.85;999211994;1.49364
1111.06;1004330984;1.47736
1118.45;1009854460;1.48124
1125.3;1014895739;1.45967
1133.46;1019174916;1.46027
1141.06;1024427554;1.46315
1148.11;1029106597;1.44238
1156.52;1034074188;1.44365
1164.36;1039323680;1.44696
1171.68;1044038743;1.43031
1180.23;1049828544;1.43398
1188.23;1054823722;1.4393
1195.72;1059988338;1.44596
1202.71;1064993097;1.43202
1210.92;1069190904;1.43707
1218.61;1074402845;1.44334
1225.82;1079367779;1.42956
1234.04;1084085772;1.43258
1241.77;1089867299;1.43681
1249.03;1094061670;1.44202
1257.28;1099783464;1.46241
1265.05;1104650243;1.46614
1272.36;1109477751;1.47074
1279.23;1114544827;1.45777
1287.16;1119696871;1.46122
1294.64;1124694386;1.46546
1301.69;1129913147;1.45184
1309.74;1134227967;1.45395
1317.35;1139805566;1.45682
1324.52;1144083098;1.443
1331.28;1149175876;1.43058
1339.05;1154957745;1.43346
1346.39;1159310262;1.43691
1353.32;1164871276;1.42419
1361.21;1169657642;1.42614
1368.67;1174695264;1.42864
1375.72;1179867611;1.41692
1383.71;1184635978;1.41953
1391.27;1189729433;1.42258
1398.42;1194507915;1.41161
1406.44;1199912099;1.41418
1414.05;1204868819;1.41715
1421.24;1209125106;1.42043
1428.05;1214686242;1.40912
1435.71;1219026928;1.41092
1442.97;1224139445;1.41303
1449.84;1229663234;1.40118
1457.53;1234653326;1.40208
1464.82;1239366488;1.40329
1471.72;1244265991;1.40473
1478.24;1249551224;1.39227
1485.72;1254106256;1.3936
1492.8;1259155514;1.39513
1500.68;1264436595;1.39514
1508.17;1269375087;1.39539
1515.26;1274120781;1.39584
1521.98;1279458579;1.38317
1529.61;1284074333;1.38393
1536.86;1289865800;1.38485
1543.72;1294475441;1.37326
1551.5;1299572105;1.37504
1558.89;1304693760;1.37694
1565.89;1309197352;1.37892
1573.67;1314312208;1.38023
1581.07;1319304529;1.38164
1588.08;1324890333;1.38312
1594.72;1329183686;1.37261
1602.15;1334196426;1.37409
1609.2;1339313922;1.37562
1615.88;1344826997;1.37719
1623.48;1349294428;1.37846
1630.7;1354704941;1.37977
1637.54;1359703735;1.36929
1645.27;1365658534;1.3718
1652.62;1369518378;1.37432
1659.59;1374849779;1.37683
1666.19;1380163044;1.36647
1673.54;1384804729;1.36762
1680.52;1389360266;1.36881
1687.14;1394140416;1.35713
1694.58;1399725876;1.35773
1701.64;1404889045;1.35838
1708.34;1410290779;1.34745
1715.89;1414323214;1.34901
1723.06;1419351796;1.35057
1729.86;1424519845;1.35214
1736.29;1429541853;1.34212
1743.62;1434408784;1.34484
1750.56;1440335924;1.34753
1757.15;1444876211;1.33737
1764.57;1449773798;1.33951
1771.62;1455150865;1.34162
1778.3;1459466093;1.33108
1785.79;1464823695;1.33249
1792.9;1469612886;1.33389
1799.64;1474650813;1.3353
1806.02;1479416664;1.32552
1813.25;1484646342;1.32808
1820.12;1489182239;1.33061
1826.62;1494851854;1.32118
1833.95;1500561105;1.32377
1840.9;1504864073;1.32633
1847.49;1508962692;1.3167
1854.9;1514580580;1.31907
1861.92;1519762832;1.32142
1868.59;1524835549;1.32374
1874.9;1530636489;1.31359
1882.01;1534629224;1.31525
1888.76;1539696306;1.31691
1895.16;1545230029;1.30658
1902.45;1549258037;1.309
1909.37;1554524210;1.31139
1915.93;1560072562;1.30213
1923.28;1564365494;1.30455
1930.26;1569986669;1.30695
1936.87;1574858560;1.30932
1943.14;1579625771;1.29961
1950.24;1584617450;1.30204
1956.99;1589421451;1.30444
1963.38;1594688385;1.29509
1970.65;1599394707;1.29822
1977.54;1605844261;1.30131
1984.08;1609113222;1.29264
1991.33;1614810721;1.29481
1998.21;1620387819;1.29696
2004.73;1624469011;1.29908
2012.12;1629310751;1.30181
2019.15;1634506984;1.3045
2025.81;1639744373;1.30714
2032.12;1644915839;1.29729
2039.21;1650039322;1.29898
2045.94;1654089450;1.30066
2052.32;1659670109;1.29091
2059.49;1665017639;1.2928
2066.29;1669372040;1.29466
2072.74;1674328885;1.2965
2080.05;1680609020;1.29846
2086.99;1684071827;1.3004
2093.57;1689290737;1.3023
2099.8;1694240655;1.29197
2106.8;1699706556;1.29296
2113.44;1704508554;1.29396
2119.73;1709754186;1.28438
2126.94;1714827574;1.28766
2133.78;1719737354;1.29088
2140.28;1725142312;1.28188
2147.62;1729260179;1.28509
2154.59;1734297097;1.28824
2161.21;1740382144;1.29133
2167.49;1744185681;1.28309
2174.48;1749262049;1.28572
2181.12;1755211305;1.2883
2187.4;1759820682;1.27949
2194.51;1764372372;1.28249
2201.25;1769182426;1.28543
2207.65;1774985788;1.27632
2214.76;1779278249;1.27803
2221.51;1784493564;1.27972
2227.91;1789768864;1.28139
2233.97;1794400177;1.272
2240.87;1800552018;1.27457
2247.41;1804016445;1.27711
2253.62;1809300601;1.26701
2260.63;1814415941;1.26869
2267.29;1819738937;1.27036
2273.6;1824956403;1.26006
2280.69;1831258286;1.26114
2287.41;1834213139;1.26222
2293.79;1839859780;1.26331
2299.83;1844987152;1.25377
2306.74;1849477536;1.25657
2313.31;1854681174;1.25932
2319.53;1859092686;1.25048
2326.47;1864323610;1.25242
2333.05;1869501754;1.25433
2339.3;1874555846;1.24566
2346.26;1879825210;1.2478
2352.88;1884166864;1.24992
2359.15;1889728695;1.25201
2365.08;1894825506;1.24238
2371.9;1899547969;1.24513
2378.37;1904765409;1.24784
2384.5;1909489259;1.23901
2391.39;1914100557;1.24128
2397.93;1919695763;1.24353
2404.13;1924654769;1.23466
2411.16;1929964844;1.23768
2417.83;1934878515;1.24066
2424.17;1939064846;1.2436
2430.17;1944400275;1.23441
2436.92;1949229711;1.23633
2443.33;1954315084;1.23823
2449.41;1959990039;1.22959
2456.43;1964168556;1.23398
2463.11;1969232568;1.23828
2469.44;1974706303;1.23193
2476.27;1979700020;1.2341
2482.75;1984024409;1.23623
2488.9;1989073907;1.23833
2494.71;1994841761;1.22829
2501.45;1999959864;1.23093
2507.84;2004702346;1.23352
2513.89;2009563483;1.22521
2519.63;2014129802;1.21715
2525.04;2019496582;1.20933
2531.25;2024577275;1.20117
2537.14;2029825894;1.19326
2543.67;2034952672;1.19523
2549.86;2039493259;1.1972
2557.04;2044789164;1.2014
2563.86;2049368011;1.20552
2570.35;2054784973;1.20957
2576.49;2059330170;1.20077
2583.43;2064747307;1.2034
2590.02;2069214036;1.20599
2596.27;2074759177;1.20022
2603.07;2079344738;1.20341
2609.53;2084657761;1.20656
2615.65;2089767821;1.20964
2622.53;2094794872;1.21108
2629.06;2099108542;1.21249
2635.26;2104371129;1.21389
2641.13;2109359831;1.21528
2647.86;2114304840;1.22843
2666.34;2119744728;1.36373
2666.33;2124675696;1.30561
2672.3;2129965653;1.2872
2671.55;2134076018;1.22817
2671.55;2139153842;1.15727
2689.35;2144183721;1.25605
2689.35;2150006128;1.19127
2685.75;2154325427;1.09371
2685.75;2159320764;1.0245
2695.63;2164260724;1.05644
2709.4;2169516183;1.13148
2709.4;2174088033;1.06344
2735.46;2179782627;1.25954
2735.46;2184132943;1.19828
2735.46;2189651371;1.12949
2740.22;2194747620;1.1118
2743.3;2199164602;1.08069
2748.72;2204299727;1.07656
2748.72;2209420457;1.00932
2774.87;2214953250;1.11851
2774.28;2219753879;1.10074
2774.07;2224142340;1.01897
2793.31;2229519987;1.24548
2791.43;2234458017;1.21829
2790.75;2239174975;1.01448
2797.31;2244519104;1.07972
2801.56;2249463518;1.16243
2804.68;2254578870;1.19423
2807.19;2259647962;1.11875
2839.41;2264661816;1.30109
2833.63;2269750480;1.24265
2833.63;2274383248;0.982476
2857.31;2279436330;1.21957
2855.22;2284963097;1.19773
2854.47;2289650002;1.14319
2859.94;2294163209;1.16657
2863.48;2299287528;1.14914
2866.98;2304590717;1.18365
2866.98;2309133648;0.922085
2895.32;2314311625;1.21415
2895.32;2319842793;1.21805
2895.32;2324748026;1.02032
2901.09;2329977715;1.09925
2915;2334094312;1.24363
2915;2339408438;1.17747
2936.33;2344456826;1.35137
2934.38;2349452258;1.2971
2933.67;2354752375;1.26487
2939.02;2359895527;0.996096
2942.49;2364867003;1.09304
2943.94;2369766378;1.1069
2945.11;2374210398;0.877951
2979.93;2379955151;1.25171
2964.61;2384885560;1.10432
2964.61;2389838773;1.04831
3001.42;2394464837;1.38435
2987.73;2399447790;1.21096
2987.73;2404421060;1.21096
3020.25;2409559368;1.25025
3020.25;2414132339;1.25025
3003.43;2419333005;1.08466
3003.43;2424321071;1.02795
3039.19;2429047875;1.24516
3024.65;2434200614;1.09654
3024.65;2439589967;0.886025
3058.24;2444982073;1.24216
3058.24;2449125500;1.2514
3058.24;2454367742;1.19581
3063.12;2459295269;1.20881
3066.28;2464285936;1.2264
3064.38;2469340425;1.19627
3064.38;2475020729;0.845684
3096.7;2479782278;1.32527
3078.66;2485047472;1.14056
3078.66;2489163688;0.777448
3116.11;2494565898;1.28598
3116.11;2499824259;1.28598
3116.11;2504727936;0.95915
3116.11;2509837522;0.95915
3119.72;2514846521;1.1764
3122.37;2519527495;1.20315
3124.49;2524914361;0.853775
3126.27;2529673591;1.02406
3142.24;2534510844;1.17807
3142.24;2539195884;0.840323
3142.24;2544290891;0.840322
3142.24;2549730242;0.840321
3142.24;2554815103;0.791617
3142.24;2559821937;0.760074
3183.86;2564786303;1.19483
3183.86;2569943334;1.19483
3183.86;2575090171;0.871712
3183.86;2580078121;1.05744
3196.02;2584206888;1.18415
3196.02;2589387111;0.799538
3196.02;2594892918;0.799538
3216.71;2599276348;1.00594
3216.71;2604973043;1.00594
3216.71;2609182462;0.969828
3230.19;2614290902;1.07819
3230.19;2619448021;1.05704
3230.19;2624383404;1.03921
3230.19;2630008301;0.880802
3249.02;2634181550;1.06859
3249.02;2639345779;1.06859
3249.02;2644668181;1.06859
3255.56;2650061879;1.13409
3259.8;2654691341;1.17652
3262.92;2659181149;0.791201
3287.12;2664529208;1.04023
3287.12;2669217735;1.04022
3287.12;2674348206;1.04022
3287.12;2679141600;0.913973
3287.12;2684144708;0.913972
3287.12;2689583602;0.913971
3287.12;2694409120;0.710917
3298.06;2699519046;0.822789
3307.66;2704543853;0.921059
3316.22;2709727334;0.875618
3323.48;2714556276;0.946106
3329.91;2719091793;1.00883
3335.56;2724468697;1.06405
3340.47;2729314889;0.926805
3363.57;2734392638;1.15063
3363.57;2739868261;1.15062
3363.57;2744001275;1.08519
3367.94;2749128436;1.08656
3370.77;2754963096;1.08369
3372.85;2759917024;0.857404
3377.06;2764308001;0.899486
3380.61;2769433196;0.935021
3383.7;2774892775;0.965951
3386.42;2779434180;0.993186
3442.74;2784440231;1.55794
3442.74;2789147781;1.55793
3442.74;2794734563;1.45021
3435.74;2800190211;1.28139
3435.74;2804241522;1.19659
3435.74;2809303051;1.12387
3435.74;2814494378;1.05934
3453.51;2819330522;1.18017
3453.51;2824520247;1.13092
3453.51;2830027022;0.899466
3453.51;2834900204;0.899473
3455.98;2839372939;0.924147
3457.79;2844519169;0.898559
3483.7;2850049625;1.13018
3483.7;2854742039;1.10931
3483.7;2859338241;1.06719
3490.91;2864250855;1.10496
3495.58;2869427036;1.1218
3499.02;2874622641;1.12987
3501.77;2879888440;0.623001
3524.17;2884121551;0.836372
3524.17;2889668667;0.836373
3524.17;2894168749;0.890249
3546.68;2899287964;1.11228
3546.68;2904621949;1.11228
3546.68;2909443878;1.11228
3546.68;2914670332;0.935054
3557.83;2919260192;1.04775
3557.83;2924927126;1.04775
3565.31;2929039106;1.12196
3569.3;2934233911;1.13732
3571.9;2940060909;1.14535
3573.82;2944597180;0.902548
3596.44;2949625588;1.13855
3596.44;2954820395;1.13855
3596.44;2959288822;1.06334
3613.51;2964686019;1.18391
3613.51;2969674152;1.14849
3613.51;2974446328;1.12021
3617.19;2979610176;0.934587
3619.58;2984276433;0.958398
3621.33;2989680812;0.975932
3622.74;2995037858;0.769378
3650.4;2999019562;1.05393
3650.4;3005027259;1.05393
3650.4;3009176688;1.05392
3689.06;3014639378;1.36257
3689.06;3019913661;1.36257
3689.06;3024306528;1.29188
3685.97;3029749600;1.20843
3683.98;3034281478;1.15482
3682.51;3039755225;1.11561
3681.34;3044956007;0.857096
3704.01;3049753875;1.07578
3704.01;3054919702;1.07578
3704.01;3059567439;0.905199
3743.83;3064379510;1.33632
3743.83;3069566339;1.33632
3743.83;3074703241;1.30025
3738.1;3079092895;1.19021
3738.1;3084195178;1.17268
3738.1;3089508373;1.15864
3738.1;3094598640;0.877724
3741.04;3099606712;0.907678
3743.19;3104524599;0.929731
3744.91;3109285800;0.575074
3771.03;3114770240;0.841002
3771.03;3120038537;0.841001
3771.03;3125020942;0.860181
3774.04;3129474907;0.906057
3775.99;3134579153;0.937935
3777.43;3139850629;0.962657
3783.88;3144421160;0.805341
3783.88;3149555016;0.80534
3783.88;3154699296;0.805339
3783.88;3159446484;0.560213
3835.4;3164296123;0.929689
3835.4;3169934628;0.929689
3835.4;3174938283;0.973457
3823.69;3179482183;0.880165
3823.69;3184230071;0.880165
3823.69;3189857001;0.880165
3829.84;3194163637;0.901161
3833.83;3199079466;0.914398
3836.77;3204612121;0.923727
3839.13;3210015925;0.681272
3877.12;3214101027;1.06818
3877.12;3219905771;1.06817
3877.12;3224374785;1.03953
3883.88;3229144431;1.09704
3883.88;3234292464;1.08381
3883.88;3239276877;1.06531
3886.52;3244288191;1.07773
3886.52;3249805479;1.07773
3886.52;3254032004;1.07773
3886.52;3259861831;0.519582
3919.58;3264136407;0.841953
3919.58;3269272654;0.841953
3919.58;3274270938;0.992028
3932.81;3279145646;1.12517
3932.81;3284608419;1.12517
3932.81;3289847868;1.05045
3938.51;3294930593;1.06305
3942.21;3299374066;1.06741
3944.93;3304363949;1.06868
3947.1;3309677304;0.699879
3953.01;3314802025;0.759427
3958.17;3319523717;0.811776
3962.74;3324383169;0.7886
3988.27;3329841141;1.04431
3988.27;3334892256;1.04431
3988.27;3339645074;1.01756
4005.18;3344153847;1.18809
4005.18;3349851249;1.18809
4005.18;3354065981;1.18809
4008.02;3359947587;0.897062
4009.86;3364160206;0.915999
4011.22;3369406516;0.929944
4012.3;3374620715;0.80736
4016.79;3379837543;0.852292
4020.71;3383993086;0.891614
4024.19;3389234520;0.866943
4083.16;3394284122;1.44898
4083.16;3399346051;1.42024
4083.16;3404035451;1.39723
4071.69;3409733897;1.18834
4071.69;3414335390;1.13603
4071.69;3419995292;1.08988
4071.69;3424383635;0.836146
4077.48;3429372747;0.897307
4081.73;3434823321;0.942944
4085.13;3439277563;0.805634
4107.02;3445011457;1.01848
4107.02;3449358914;1.01848
4107.02;3454361852;0.98997
4125.25;3459473182;1.15849
4125.25;3464921484;1.14467
4125.25;3469937872;1.13361
4125.25;3474183410;1.08856
4126.7;3479800790;1.064
4127.76;3484594977;1.03992
4128.6;3489741302;0.470737
4135.81;3494127733;0.535834
4142.13;3500012077;0.594988
4147.75;3504331448;0.78212
4174.48;3509376713;1.04228
4174.48;3514466434;1.04227
4174.48;3519874446;1.04227
4177.17;3524634506;1.00445
4178.91;3529594698;0.975758
4180.19;3534208363;0.952527
4181.22;3539223638;0.756065
4182.08;3544152482;0.763991
4182.83;3549494495;0.770866
4183.48;3554670261;0.583252
4223.43;3559746686;0.990266
4223.43;3564387603;0.990265
4223.43;3569622912;0.990264
4238.57;3574655980;1.12455
4238.57;3579188264;1.11361
4238.57;3583987306;1.10487
4238.57;3589267316;1.031
4247.76;3594919803;1.058
4247.76;3600014254;1.00312
4247.76;3604789040;0.735968
4272.19;3609143539;0.978481
4272.19;3614263659;0.978484
4272.19;3619402030;0.9522
4272.19;3624320146;0.935245
4286.47;3629804702;1.06278
4286.47;3634812343;1.05252
4286.47;3639315462;1.04389
4306.91;3644819932;1.24297
4306.91;3649812795;1.2366
4306.91;3654534307;0.835055
4309.39;3659473492;0.859803
4311;3664684747;0.875841
4312.18;3669085470;0.736099
4329.66;3674275749;0.911942
4329.66;3679773666;0.911942
4329.66;3684976701;0.911941
4329.66;3689541428;0.836315
4350.27;3694669976;1.04563
4350.27;3699819761;1.04563
4350.27;3704034118;0.785353
4366.45;3709296528;0.944765
4366.45;3714376840;0.944765
4366.45;3719233256;0.944765
4386.77;3724702392;1.003
4386.77;3729778400;1.003
4386.77;3734306440;1.003
4386.77;3739668635;0.800781
4401.65;3744313977;0.94759
4401.65;3749352686;0.94759
4401.65;3754802446;0.922734
4401.65;3759064637;0.906635
4401.65;3764950391;0.894783
4401.65;3769803153;0.720929
4401.65;3774844235;0.720929
4401.65;3779838152;0.72093
4401.65;3784505337;0.720931
4401.65;3789804212;0.519341
4413.18;3794359966;0.629725
4423.67;3799847120;0.734207
4433.14;3804512264;0.671119
4440.56;3809037031;0.744451
4447.09;3814120739;0.809054
4452.78;3819271700;0.688133
4472.32;3824265526;0.865321
4472.32;3829559398;0.865312
4472.32;3834411305;0.865306
4472.32;3839835265;0.708525
4472.32;3844650067;0.708518
4500.82;3850099170;1.00799
4500.82;3854316898;1.00799
4499.53;3859133327;0.989824
4498.85;3864185347;0.980544
4498.4;3869906584;0.974655
4519.72;3874075098;1.18546
4519.72;3879091833;1.18546
4519.72;3884110517;1.18546
4519.72;3889512049;1.06696
4519.72;3894549863;0.96053
4519.72;3899436351;0.86613
4519.72;3904394368;0.791811
4519.72;3910001380;0.726424
4519.72;3914349133;0.669468
4519.72;3919720711;0.47722
4519.72;3924417988;0.477229
4519.72;3929335806;0.477235
4519.72;3934788103;0.477243
4519.72;3939994250;0.47725
4519.72;3944808554;0.203321
4519.72;3949733039;0.203321
4519.72;3955031556;0.20603
4531.75;3959151114;0.330487
4542.48;3964549324;0.441577
4552;3969221910;0.323526
4560.42;3974713429;0.407873
4567.84;3979918034;0.482237
4574.37;3984530143;0.547679
4607.66;3990020579;0.885379
4607.65;3994232926;0.885371
4607.65;3999327694;0.885365
4607.65;4004766767;0.885357
4607.65;4009922085;0.885352
4607.65;4014932640;0.885346
4607.65;4019994319;0.885342
4607.65;4024372696;0.885337
4607.65;4029389583;0.885335
4607.65;4034558155;0.885332
4668.37;4039637731;1.48755
4668.37;4044312657;1.48755
4668.37;4049988857;1.48755
4668.37;4054853394;1.36765
4668.37;4059958325;1.26083
4668.37;4063968326;1.16616
4668.37;4069393231;1.08258
4668.37;4074579486;1.00899
4668.37;4079570543;0.944341
4668.37;4084954643;0.628014
4668.37;4089491456;0.628022
4668.37;4095018505;0.628028
4668.37;4099084705;0.628035
4668.37;4104468854;0.62804
4679.65;4109134518;0.744333
4689.8;4114135439;0.848873
4698.84;4119134007;0.941979
4706.83;4124439481;1.02428
4713.85;4129734115;1.0966
4720;4134595697;0.531815
4725.35;4139767301;0.586945
4730.01;4144306644;0.634873
4734.05;4149182318;0.67646
4737.55;4155154907;0.712494
4740.58;4159736339;0.743684
4743.2;4164911669;0.770656
4745.46;4169469666;0.793962
4747.42;4174567626;0.814085
4749.1;4179831413;0.83144
4750.55;4184517056;0.846391
