Distance;Time;Velocity Kalman
0;703746;4.50173e-05
0.000690534;4140423;5.1905e-05
0.0012207;9467099;5.87968e-05
0.00156326;14756433;5.87968e-05
0.00225087;19788909;6.56915e-05
0.00276214;24449709;7.08008e-05
0.00312653;29214812;7.25882e-05
0.0038136;34598540;7.6272e-05
0.00450173;39483734;8.13029e-05
0.00488281;44897617;8.50297e-05
0.00537664;49268495;8.6936e-05
0.00606433;53975171;9.1902e-05
0.0064455;59821449;9.08256e-05
0.00713041;64768154;9.57143e-05
0.00781631;69256457;9.76562e-05
0.00820327;74766670;9.96201e-05
0.00888685;79894106;9.96201e-05
0.00937958;84311746;0.000102568
0.00957143;89851682;9.76562e-05
0.0102568;94858852;0.000102568
0.0106446;99582478;9.96201e-05
0.0113282;104904725;0.000101605
0.0120126;109332478;0.000104497
0.012207;114990520;9.96201e-05
0.012891;119563062;0.000101605
0.0132827;124575526;0.000101605
0.0139652;129840055;0.000101605
0.0144539;134196130;9.96201e-05
0.0148445;139632316;9.96201e-05
0.0155274;144004207;0.000101605
0.0157239;149276607;9.68288e-05
0.0164065;154885354;9.96201e-05
0.0168014;159469520;9.68288e-05
0.0172858;164115231;9.48071e-05
0.0176812;169691325;9.48071e-05
0.0181651;174101131;9.28056e-05
0.0185611;179525281;9.21287e-05
0.0190445;184406857;9.48071e-05
0.0192422;189928743;9.00677e-05
0.019924;194440246;9.28056e-05
0.020122;199928506;8.80262e-05
0.020321;204735584;8.33303e-05
0.0210018;209097409;8.80262e-05
0.0212009;214624563;8.33303e-05
0.0216832;219300605;8.40071e-05
0.0216832;224606618;7.7204e-05
0.0220809;229011047;7.66228e-05
0.0225629;234749293;7.7204e-05
0.0227614;239405104;7.2465e-05
0.0229609;244979908;7.2465e-05
0.0234426;249399892;7.04209e-05
0.0236413;254918496;6.8403e-05
0.0238409;259378090;6.57369e-05
0.0243223;264703986;6.64134e-05
0.0245212;269039124;6.36641e-05
0.024721;274339233;6.16183e-05
0.024721;279745089;5.69429e-05
0.0252021;284934810;5.96023e-05
0.0254012;289341795;5.48638e-05
0.025601;295011998;5.48638e-05
0.0258016;299187407;5.48638e-05
0.0260819;304610919;5.08024e-05
0.0262811;309934284;5.08024e-05
0.0264811;314371353;4.81521e-05
0.0264811;319643487;4.81521e-05
0.0266818;324932160;4.60644e-05
0.0266818;329290692;4.15039e-05
0.0271611;334216235;4.40131e-05
0.0271611;339868468;4.20035e-05
0.0273612;344455596;3.93665e-05
0.0273612;349306901;3.72664e-05
0.027562;354869572;3.72664e-05
0.027562;359351598;3.27549e-05
0.0277634;364336801;3.27549e-05
0.0280411;369678144;3.32067e-05
0.0280411;374900300;3.32067e-05
0.0282413;379186979;3.05907e-05
0.0282413;384755602;2.84714e-05
77.8851;389101906;0.778618
77.8851;394725182;0.778617
77.8851;399156318;0.778613
96.7861;404799404;0.967622
109.03;409166551;1.09006
118.046;414951690;1.18022
137.81;419260537;1.37786
154.5;424533886;1.54476
169.031;429079122;1.69006
181.832;434668076;1.81807
204.212;439184729;2.04187
224.173;444649006;2.24149
241.807;449855013;2.41782
267.702;454196105;2.67678
290.485;459475623;2.90461
310.335;463888511;3.10309
337.249;469345896;3.37224
360.684;474613286;3.60658
380.971;479922445;3.80946
398.454;484573326;3.206
422.17;489923935;3.44316
442.776;494682335;3.64923
460.645;499038152;3.63895
483.907;504440411;3.74914
504.252;509724474;3.86244
522.039;514884379;3.84265
544.685;519456721;3.90218
564.65;524669114;3.95651
582.256;529111563;4.00453
597.785;534561099;3.93596
617.895;540013603;3.9374
635.794;544797672;3.94
651.732;549934319;3.84036
671.879;554431524;3.81396
689.956;559835402;3.79622
706.187;564270734;3.68938
726.307;569853555;3.65627
744.49;574127593;3.63527
760.934;579564461;3.62493
775.81;584293879;3.53661
794.348;589730218;3.51602
811.223;594388314;3.50617
826.592;599244788;3.42731
845.363;604658775;3.41164
862.548;609043113;3.40571
878.288;614899011;3.33668
897.207;619160324;3.32627
914.615;624620602;3.32433
930.636;629105233;3.3293
945.382;634188269;3.27566
963.15;639736271;3.27437
979.576;644509573;3.27927
994.761;649808064;3.22965
1012.79;654127912;3.2292
1029.53;659558139;3.23424
1045.06;664923419;3.18832
1063.28;669405416;3.18872
1080.25;674651119;3.19399
1096.05;679174051;3.20322
1110.76;684031780;3.1649
1128.06;689439467;3.16911
1144.21;694135372;3.17695
1159.29;699242863;3.14004
1176.84;704594755;3.1437
1193.28;709984517;3.15066
1208.67;714616193;3.11529
1226.42;719064312;3.11872
1243.08;724490153;3.12512
1258.71;729078010;3.13394
1273.36;734466704;3.10278
1290.32;739958129;3.10807
1306.26;745016002;3.1156
1321.23;749076135;3.08501
1338.43;754368548;3.08963
1354.63;759682553;3.09628
1369.87;764383814;3.06644
1387.26;769822408;3.07067
1403.67;774191494;3.07673
1419.14;779500060;3.0843
1433.7;784202021;3.05695
1450.38;789603635;3.06217
1466.12;794342265;3.06877
1480.97;800030251;3.0417
1497.87;804417928;3.04639
1513.85;809775498;3.05233
1528.94;814560973;3.02567
1546.04;819912501;3.03005
1562.22;824170126;3.03554
1577.51;829692071;3.04194
1594.78;834025055;3.04502
1611.13;839456294;3.04912
1626.6;845062567;3.05404
1641.21;849946925;3.02823
1657.79;854296377;3.03201
1673.48;859538979;3.03653
1688.33;864553591;3.01102
1705.1;869907158;3.01465
1720.99;874244750;3.01892
1736.03;879528578;3.0237
1752.98;884133323;3.02633
1769.04;889542267;3.02954
1784.26;894055020;3.03322
1798.65;899227168;3.00806
1814.93;904555802;3.01114
1830.37;909884156;3.01462
1844.98;914882409;2.98973
1861.47;919634079;2.99277
1877.1;924854171;2.99617
1891.91;929133825;2.97158
1908.57;934518628;2.97468
1924.38;939864281;2.97807
1939.36;944586035;2.98169
1953.53;949669761;2.95768
1969.56;954858093;2.96104
1984.76;959186383;2.96459
1999.16;964880250;2.94081
2015.39;969326461;2.9442
2030.79;974549086;2.94776
2045.38;979000213;2.92423
2061.79;984351969;2.9277
2077.36;989720250;2.93131
2092.13;994304395;2.93501
2106.1;999542064;2.91186
2121.9;1004820253;2.9155
2136.89;1009032343;2.91922
2151.08;1014731771;2.89628
2167.08;1019967285;2.89999
2182.27;1024893253;2.90378
2196.66;1029222558;2.88105
2210.27;1034692777;2.85909
2225.7;1040045765;2.86364
2240.34;1044595158;2.86821
2254.19;1049775196;2.84643
2269.85;1054045330;2.85104
2284.71;1059351705;2.85567
2298.78;1064708597;2.83406
2314.65;1069025418;2.83875
2329.71;1074235210;2.84344
2343.98;1079685794;2.82202
2360.03;1084159667;2.82677
2375.27;1089528283;2.83153
2389.72;1094035723;2.83628
2403.39;1099372001;2.81502
2418.86;1104614030;2.81982
2433.53;1110006178;2.82461
2447.42;1113935567;2.8035
2463.09;1119357436;2.80835
2477.96;1124738128;2.81318
2492.06;1129222023;2.81799
2505.39;1134892701;2.79699
2520.51;1139306410;2.80184
2534.85;1144881263;2.80667
2548.42;1149554179;2.78579
2563.77;1154740878;2.79067
2578.32;1159035181;2.79552
2592.12;1164080142;2.77476
2607.66;1169324939;2.77966
2622.42;1174616928;2.78453
2636.41;1178978310;2.76388
2649.65;1184208389;2.74387
2664.65;1189630986;2.74941
2678.88;1194347840;2.75492
2692.35;1199571624;2.735
2707.57;1204886655;2.74054
2722.02;1209347099;2.74604
2735.71;1214136399;2.72619
2751.13;1219460498;2.73172
2765.77;1224732095;2.7372
2779.65;1229198918;2.74264
2792.79;1234669597;2.72282
2807.67;1240031884;2.72827
2821.78;1244552612;2.73367
2835.15;1249411713;2.71391
2850.25;1254734019;2.71931
2864.58;1259073530;2.72466
2878.15;1264742385;2.70495
2893.45;1268972071;2.71031
2907.97;1274199795;2.71562
2921.73;1279522003;2.72088
2937.2;1284930139;2.72553
2951.88;1289368727;2.73014
2965.81;1294985348;2.7347
2979.01;1299062657;2.71437
2993.91;1304547197;2.71892
3008.04;1309949023;2.72343
3021.44;1314220995;2.70315
3036.53;1319467345;2.70765
3050.86;1324745000;2.71211
3064.44;1329111117;2.71653
3077.29;1334551355;2.69625
3091.84;1340048581;2.70066
3105.65;1344612132;2.70503
3118.72;1349128872;2.68479
3133.49;1354446738;2.68916
3147.5;1359786366;2.69348
3160.77;1364615511;2.6733
3175.73;1369851104;2.67763
3189.92;1374068367;2.68193
3203.37;1379351786;2.66181
3218.49;1384779612;2.6661
3232.85;1389103412;2.67037
3246.46;1394639232;2.67459
3259.35;1399262155;2.6545
3273.91;1404492443;2.65873
3287.73;1409738935;2.66292
3300.82;1414794681;2.64289
3315.56;1418966197;2.64709
3329.56;1424239698;2.65125
3342.82;1429652568;2.65538
3357.73;1434038640;2.65891
3371.89;1439646068;2.66242
3385.31;1444331227;2.66589
3398.02;1449440572;2.64534
3412.38;1454932574;2.64882
3426;1459467202;2.65227
3438.9;1464529014;2.63179
3453.44;1469005050;2.63526
3467.24;1474260609;2.63871
3480.32;1479334485;2.61832
3495.02;1484645846;2.62178
3508.98;1489968537;2.62523
3522.22;1494554982;2.62866
3534.74;1499499238;2.60834
3548.9;1504835673;2.61178
3562.34;1509343904;2.61521
3575.06;1514446451;2.59499
3589.4;1519784694;2.59843
3603.01;1524099561;2.60187
3615.9;1529870564;2.58175
3630.41;1534314821;2.58521
3644.17;1539578283;2.58866
3657.22;1544193430;2.59209
3669.58;1549843448;2.57205
3683.55;1554188188;2.57551
3696.79;1559395400;2.57895
3709.34;1564143914;2.55902
3723.49;1569555100;2.56248
3736.91;1574905993;2.56594
3749.63;1579295903;2.54612
3761.67;1584653469;2.5269
3775.31;1589992115;2.53096
3788.24;1594690750;2.53502
3800.49;1599214001;2.51589
3814.33;1604432926;2.51997
3827.46;1609772460;2.52403
3839.9;1614479804;2.505
3853.91;1619833244;2.50907
3867.21;1624149379;2.51313
3879.82;1629944888;2.49419
3894;1634526663;2.49826
3907.45;1639866461;2.50232
3920.21;1644383281;2.50636
3932.29;1649891058;2.48749
3945.94;1654159106;2.49154
3958.89;1659424924;2.49556
3971.16;1664294231;2.47677
3984.99;1669613567;2.48079
3998.11;1674865423;2.4848
4010.54;1679806413;2.48879
4024.53;1684227038;2.4922
4037.8;1689966797;2.49559
4050.39;1694467193;2.49897
4062.3;1699573883;2.47971
4075.76;1704160364;2.48308
4088.54;1709699138;2.48644
4100.64;1714773277;2.46726
4114.27;1719049084;2.47062
4127.22;1724445645;2.47396
4139.48;1728999723;2.45486
4151.09;1734894408;2.43634
4164.24;1739335928;2.44025
4176.71;1744371678;2.44415
4188.51;1749550268;2.4257
4201.85;1754123379;2.4296
4214.51;1759437767;2.43348
4226.5;1764064030;2.4151
4240.01;1769534651;2.41898
4252.83;1774932131;2.42285
4264.98;1779371781;2.40454
4276.48;1784878916;2.3868
4289.51;1789212536;2.39122
4301.86;1794802950;2.39562
4313.56;1799347510;2.37794
4326.77;1804729076;2.38232
4339.3;1809143969;2.38668
4351.18;1814443676;2.36905
4364.55;1819746596;2.37339
4377.25;1824192495;2.37771
4389.28;1829296855;2.38201
4402.81;1834791340;2.38572
4415.65;1839128241;2.38942
4427.82;1844865512;2.3931
4439.35;1849839225;2.37497
4452.37;1854332960;2.37861
4464.72;1859746729;2.38224
4476.42;1864159746;2.36415
4487.49;1869579534;2.34661
4500.05;1874879995;2.35075
4511.96;1879029225;2.35487
4525.34;1884455966;2.35841
4538.05;1889770204;2.36193
4550.1;1894363574;2.36543
4561.51;1899963444;2.34741
4574.39;1904221225;2.35088
4586.61;1909422842;2.35433
4598.19;1914927177;2.33636
4611.23;1919547353;2.33978
4623.6;1924907593;2.34319
4635.33;1928978063;2.32526
4648.51;1934359572;2.32864
4661.02;1939747630;2.33202
4672.88;1944308025;2.33537
4684.11;1949013088;2.31748
4698.86;1954370401;2.34139
4712.89;1959692176;2.36474
4726.24;1964049308;2.38754
4740.96;1969471999;2.40913
4754.98;1974867281;2.43017
4768.31;1979410846;2.42963
4780.96;1984835592;2.4291
4792.95;1989024087;2.42857
4806.35;1994570440;2.44846
4819.07;1999131606;2.44687
4831.14;2004410139;2.44531
4842.56;2009265181;2.44377
4855.4;2014822679;2.4417
4867.57;2019337969;2.43968
4879.1;2024945333;2.43771
4892.03;2029510912;2.43522
4904.3;2034081456;2.4328
4915.93;2039635312;2.43043
4928.94;2044201979;2.44825
4941.29;2049595695;2.42433
4952.99;2054424693;2.40104
4966.08;2058965840;2.39839
4978.5;2064417120;2.37534
4990.27;2069759876;2.35291
5001.42;2074462615;2.33112
5013.94;2079754017;2.32988
5025.83;2084040488;2.32874
5037.08;2089725570;2.30729
5049.7;2094384016;2.30631
5061.68;2099717700;2.30543
5073.03;2104660303;2.30465
5085.73;2109183773;2.3034
5097.79;2114573778;2.30226
5109.22;2119712636;2.30121
5122;2124351305;2.2997
5134.13;2130133957;2.2983
5145.62;2134515864;2.297
5156.5;2139699631;2.27567
5168.74;2144446550;2.27454
5180.35;2149919900;2.27352
5191.33;2154253657;2.25257
5203.67;2159798466;2.25172
5215.37;2164205206;2.25098
5226.45;2169681128;2.25034
5238.87;2174922540;2.24924
5250.65;2179273292;2.24826
5261.82;2184877510;2.24738
5274.31;2189227163;2.24604
5286.16;2194699050;2.24482
5297.4;2199611260;2.24371
5309.95;2204091129;2.24214
5321.86;2209594817;2.24069
5333.15;2214210694;2.23934
5343.84;2219823624;2.21844
5355.85;2224088279;2.21727
5367.24;2229533365;2.21622
5378.03;2234197405;2.21527
5390.13;2239643215;2.21387
5401.6;2244168681;2.21258
5412.47;2249181264;2.21141
5424.64;2254482244;2.20978
5436.19;2259881042;2.20828
5447.14;2264466567;2.20689
5459.37;2269878395;2.20505
5470.98;2274147798;2.20333
5481.99;2279806876;2.20173
5494.27;2284270517;2.19968
5505.94;2289783792;2.19776
5516.99;2294455223;2.19596
5527.45;2299963963;2.17507
5539.2;2304525960;2.17345
5550.35;2309159072;2.17195
5560.9;2314064202;2.17057
5572.73;2319337426;2.16874
5583.95;2324635058;2.16705
5594.57;2329810727;2.16547
5606.47;2334142916;2.16345
5617.76;2339439668;2.16156
5628.45;2344081251;2.1598
5638.57;2349085246;2.13923
5649.96;2354415806;2.13764
5660.75;2359888461;2.13618
5670.97;2364928794;2.11601
5682.46;2369304779;2.11473
5693.34;2374549608;2.11358
5703.65;2379174996;2.0938
5715.22;2384577944;2.09283
5726.19;2390221245;2.09198
5736.58;2394769669;2.09124
5746.4;2399261526;2.07198
5757.49;2404615125;2.07141
5767.99;2409159388;2.07097
5777.93;2414247352;2.05208
5789.13;2419637122;2.05179
5799.73;2424923785;2.05161
5809.78;2429445160;2.03308
5819.27;2434909817;2.01515
5828.23;2439160785;1.9978
5836.67;2444679586;1.98104
5844.6;2449429457;1.94647
5819.71;2454897568;1.58953
5819.7;2459513911;1.48732
5819.7;2463956138;1.37246
5828.51;2469314790;1.35167
5834.22;2474649678;1.30563
5838.42;2479129845;1.23199
5847.89;2484596355;1.21705
5855.89;2489848944;1.19316
5862.86;2494356505;1.16457
5869;2499416806;1.1151
5880.07;2504845358;1.12077
5889.95;2509493315;1.1202
5898.69;2514313449;1.09567
5911.94;2519603935;1.12208
5923.62;2524850084;1.13837
5933.8;2529877256;1.14526
5948.02;2534189223;1.19789
5960.42;2539620847;1.23751
5971.17;2544256385;1.26569
5980.45;2549262713;1.60746
5993.42;2554672412;1.73719
6004.71;2559305442;1.85009
6014.52;2564728728;1.86006
6027.64;2569084863;1.93428
6039.15;2574368135;2.0073
6049.22;2579220935;2.0133
6062.31;2584818974;2.06416
6073.86;2589229499;2.11005
6084.07;2594774949;2.15075
6093.09;2599496528;2.13021
6104.9;2604940505;2.14952
6115.43;2609401044;2.16744
6124.83;2614285390;2.12884
6136.76;2619521968;2.13149
6147.49;2624696539;2.13691
6157.13;2629903642;2.09112
6169.11;2634234552;2.08689
6179.95;2639542427;2.08774
6189.76;2644831946;2.09306
6201.73;2649148460;2.08306
6212.62;2654509766;2.07915
6222.55;2659946946;2.08035
6231.59;2664243060;2.0395
6242.67;2669600445;2.03525
6252.82;2674940806;2.03598
6262.12;2678978305;1.9981
6273.31;2684440393;1.99444
6283.61;2689749080;1.99538
6293.09;2694293198;2.00003
6301.83;2699094761;1.96924
6312.35;2704468678;1.96919
6322.09;2710086497;1.97263
6331.09;2714906809;1.94329
6341.78;2719447395;1.94289
6351.7;2724837360;1.94566
6360.91;2729841603;1.91797
6371.7;2734185096;1.91754
6381.75;2739507918;1.91999
6391.12;2744094487;1.89394
6399.84;2749910837;1.87219
6410.08;2754218609;1.87534
6419.65;2759481858;1.88056
6428.58;2764788031;1.85914
6438.96;2769049677;1.86146
6448.69;2774363526;1.86569
6457.79;2779111030;1.84482
6468.27;2784467478;1.84664
6478.11;2789902684;1.8502
6487.35;2794637409;1.85519
6496.01;2799921124;1.83654
6506;2804463428;1.83917
6515.41;2809015149;1.84314
6524.24;2814100601;1.82465
6534.36;2819401929;1.82666
6543.9;2824671186;1.82991
6552.87;2829591332;1.81171
6563.09;2834932843;1.81333
6572.73;2839194979;1.81606
6581.81;2844637444;1.81971
6590.37;2849942569;1.80289
6600.15;2854114942;1.80497
6609.37;2859338434;1.80791
6618.08;2864849895;1.79116
6627.96;2869050820;1.7928
6637.31;2874339519;1.79522
6646.13;2879612279;1.77863
6656.11;2884121237;1.77998
6665.55;2889580279;1.78202
6674.47;2894303566;1.78463
6682.89;2899306044;1.76889
6692.45;2904750477;1.77049
6701.5;2909099835;1.77261
6710.05;2914195505;1.7569
6719.71;2919532812;1.7582
6728.87;2924793526;1.75996
6737.52;2929169033;1.74436
6745.7;2934939724;1.72974
6754.98;2939374052;1.7317
6763.77;2944208468;1.73399
6772.08;2949700903;1.71932
6781.47;2954149192;1.72097
6790.37;2959823430;1.72292
6798.79;2964858437;1.70828
6808.28;2969265692;1.70971
6817.28;2974563188;1.71142
6825.79;2979544591;1.69683
6835.36;2984953462;1.69812
6844.43;2989214523;1.69966
6853.03;2994806174;1.70138
6861.16;2999199063;1.68709
6870.34;3004579584;1.68843
6879.04;3009093296;1.68994
6887.28;3014317113;1.67567
6896.55;3019616899;1.67687
6905.34;3024883028;1.67824
6913.67;3029772426;1.67972
6923.02;3034158098;1.68039
6931.89;3039539562;1.68121
6940.29;3044120679;1.68214
6948.24;3049660438;1.66769
6957.21;3053997462;1.6684
6965.71;3059387762;1.66923
6973.76;3064091075;1.65484
6982.82;3069514157;1.65549
6991.42;3074814974;1.65624
6999.55;3079204545;1.64193
7008.69;3084796577;1.64254
7017.36;3089134940;1.64325
7025.57;3094729510;1.64405
7033.33;3099602125;1.62991
7042.1;3104981013;1.63057
7050.41;3109809820;1.63131
7058.28;3114409358;1.61725
7067.13;3119124176;1.61789
7075.53;3124514885;1.61861
7083.48;3129742110;1.60464
7092.42;3134136108;1.60527
7100.89;3139454495;1.60598
7108.91;3145087601;1.60675
7116.5;3149727344;1.59294
7125.08;3154081406;1.59363
7133.2;3159412411;1.59438
7140.89;3164939387;1.58066
7149.55;3169307278;1.58134
7157.76;3174628408;1.58209
7165.53;3179863633;1.56846
7174.27;3184208130;1.56914
7182.56;3189629443;1.56989
7190.4;3194410640;1.5707
7197.82;3199490284;1.55723
7206.21;3203981415;1.55797
7214.15;3209466677;1.55878
7221.67;3214126737;1.5454
7230.14;3219533131;1.54613
7238.18;3224858993;1.54693
7245.78;3229645951;1.53365
7254.33;3234031983;1.53438
7262.43;3239374234;1.53518
7270.11;3244756953;1.53604
7278.72;3249048702;1.5364
7286.88;3254372915;1.53684
7294.62;3259851523;1.53733
7301.94;3264646866;1.52393
7310.2;3269860851;1.52435
7318.02;3274028295;1.52484
7325.42;3279611198;1.51153
7333.75;3284996446;1.51196
7341.65;3289548391;1.51245
7349.12;3294109252;1.51301
7356.19;3299605145;1.49985
7364.19;3304200319;1.50034
7371.76;3309707537;1.50089
7378.93;3314719184;1.48782
7387.01;3319980946;1.4883
7394.66;3324408696;1.48884
7401.91;3329838537;1.47587
7410.07;3334294086;1.47635
7417.8;3339680641;1.47689
7425.12;3344374814;1.46401
7432.04;3349685523;1.45155
7439.87;3354108150;1.45244
7447.28;3359760091;1.4534
7454.3;3364472958;1.44102
7462.21;3369936983;1.4419
7469.71;3374337973;1.44284
7476.8;3379820048;1.43054
7484.79;3384296656;1.43141
7492.36;3389601933;1.43234
7499.53;3394063833;1.43333
7506.3;3399214846;1.42117
7513.97;3404538111;1.42207
7521.23;3408990449;1.42303
7528.1;3414089969;1.41094
7535.84;3419509840;1.41181
7543.19;3424724945;1.41274
7550.14;3429104224;1.40071
7556.7;3434093123;1.38908
7564.15;3439551713;1.39032
7571.2;3444203390;1.39161
7577.87;3449082032;1.38003
7585.4;3454466512;1.38122
7592.54;3459952124;1.38247
7599.3;3464560018;1.37093
7606.91;3469934665;1.37208
7614.13;3474318905;1.37328
7620.97;3479889626;1.36179
7628.65;3484299669;1.36288
7635.93;3489652753;1.36404
7642.83;3494047253;1.36525
7649.35;3499730663;1.35385
7656.72;3504017819;1.35495
7663.71;3509590979;1.35609
7670.32;3514683298;1.34473
7677.76;3519306137;1.34576
7684.82;3524609458;1.34684
7691.5;3529917804;1.34799
7699.01;3534311991;1.34862
7706.13;3539635126;1.34932
7712.88;3544945695;1.35007
7719.25;3549642559;1.3385
7726.46;3553978017;1.33912
7733.28;3559381656;1.33981
7739.74;3564801120;1.32826
7747.01;3569096585;1.32882
7753.91;3574371423;1.32945
7760.44;3578996891;1.31793
7767.77;3584386271;1.31844
7774.73;3589841702;1.31901
7781.32;3594473865;1.31963
7787.54;3599921913;1.30821
7794.58;3604485210;1.30872
7801.24;3610059396;1.30928
7807.55;3614944647;1.2979
7814.65;3619282199;1.29834
7821.39;3624545932;1.29885
7827.76;3629661274;1.2875
7834.92;3633978172;1.28789
7841.71;3639324530;1.28834
7848.14;3644882563;1.28886
7854.22;3649399839;1.27761
7861.08;3654999253;1.27801
7867.59;3659489235;1.27846
7873.74;3664592314;1.26725
7880.67;3669803146;1.26759
7887.24;3674045141;1.268
7893.46;3679185225;1.25683
7900.44;3684839283;1.25711
7907.06;3689400734;1.25747
7913.33;3694586519;1.25789
7920.36;3699234899;1.25782
7927.03;3704856103;1.25783
7933.34;3709273421;1.2579
7939.31;3714479158;1.24659
7946.04;3719797001;1.24654
7952.42;3724155886;1.24657
7958.45;3729584107;1.2353
7965.23;3734952195;1.23521
7971.66;3739286056;1.23519
7977.74;3744933764;1.23525
7983.49;3749106603;1.2241
7989.99;3754608267;1.22404
7996.14;3759039830;1.22405
8001.96;3764930690;1.21295
8008.52;3769249649;1.21284
8014.74;3774535118;1.21281
8020.62;3779119970;1.20177
8027.22;3784565013;1.20162
8033.49;3789910593;1.20156
8039.42;3794159824;1.19058
8046.07;3799533777;1.1904
8052.37;3804820141;1.1903
8058.34;3809345291;1.19029
8063.98;3814701054;1.17944
8070.35;3818995679;1.17931
8076.37;3824186251;1.17926
8082.08;3829815389;1.16847
8088.49;3834080567;1.1683
8094.56;3839358345;1.16821
8100.31;3844891889;1.16821
8105.74;3849545340;1.15755
8111.89;3854938355;1.15742
8117.7;3859519329;1.15737
8123.2;3864606836;1.14677
8129.4;3869877630;1.1466
8135.27;3874192590;1.14652
8140.82;3879540016;1.13597
8147.07;3884802080;1.13577
8152.98;3889109253;1.13565
8158.58;3894667411;1.12517
8163.88;3899238425;1.11504
8169.85;3904667520;1.11515
8175.52;3909251748;1.11534
8180.87;3914452258;1.10526
8186.91;3919052856;1.10532
8192.62;3924360316;1.10547
8198.03;3929616194;1.09544
8204.11;3934131300;1.09547
8209.87;3939474090;1.09557
8215.32;3944036359;1.09576
8220.47;3949918001;1.08586
8226.29;3954181208;1.08591
8231.8;3959704399;1.08604
8237.01;3964280495;1.07617
8242.88;3969618279;1.07617
8248.45;3974898017;1.07625
8253.71;3979738395;1.06642
8259.62;3984005637;1.06637
8265.22;3989392582;1.06639
8270.52;3994111531;1.0665
8275.53;3999344894;1.0568
8281.19;4004962598;1.05676
8286.55;4009590024;1.05681
8291.62;4014707205;1.04713
8297.33;4019037935;1.04704
8302.73;4024380970;1.04702
8307.85;4029568440;1.03739
8313.59;4034971673;1.03723
8319.04;4039281980;1.03716
8324.19;4044834361;1.03717
8329.06;4049353271;1.02765
8334.55;4054806363;1.02751
8339.76;4059293602;1.02746
8344.68;4064938285;1.01796
8350.22;4069215886;1.01776
8355.47;4074402798;1.01765
8360.44;4079381515;1.00818
8366.01;4084731037;1.00792
8371.3;4089238007;1.00774
8376.3;4094656079;1.00765
8381.9;4099047084;1.00708
8387.21;4104458576;1.0066
8392.24;4109873248;1.00621
8396.99;4114573121;0.996658
8402.34;4119908107;0.996114
8407.41;4124229822;0.995659
8412.21;4129932971;0.986139
8417.59;4134208194;0.985537
8422.69;4139583074;0.985029
8427.52;4144438782;0.984607
8432.08;4149929677;0.975208
8437.22;4154380220;0.974631
8442.09;4159987321;0.974151
8446.7;4164098891;0.964784
8451.89;4169523280;0.964151
8456.8;4174777933;0.963612
8461.44;4179178571;0.954285
8466.66;4184748251;0.953601
8471.6;4189191482;0.953009
8476.27;4194509973;0.943727
8481.51;4199820905;0.942993
8486.48;4204205559;0.942358
8491.17;4209589624;0.941812
8495.61;4214410261;0.932667
8500.61;4219749329;0.931977
8505.34;4224055044;0.931379
8509.82;4229526457;0.922274
8514.84;4234951875;0.92153
8519.61;4239350458;0.920882
8524.11;4244721452;0.92033
8529.15;4249159502;0.919316
8533.93;4254507016;0.918398
8538.46;4259127060;0.917577
8542.73;4264621960;0.908435
8547.54;4269039067;0.907465
8552.1;4274324384;0.906593
8556.41;4279891923;0.897496
8561.25;4284351555;0.896481
8565.83;4289644166;0.895564
8570.16;4294120667;0.886518
8574.25;4299559896;0.877782
8578.88;4305069894;0.877033
8583.25;4309830647;0.876382
8587.38;4314430654;0.867687
8592.03;4319056252;0.866884
8596.44;4324314626;0.866186
8600.6;4329720704;0.857536
8605.27;4334148296;0.856688
8609.7;4339450667;0.855939
8613.89;4344926596;0.84734
8617.84;4349560847;0.839044
8622.3;4354951726;0.838454
8626.53;4359456636;0.837961
8630.51;4364953481;0.8297
8635.01;4369357749;0.829052
8639.26;4374668039;0.828501
8643.28;4379933468;0.82028
8647.79;4384285698;0.819573
8652.06;4389746627;0.81897
8656.1;4394310403;0.818461
8659.91;4399243256;0.810375
8664.22;4404756031;0.809703
8668.29;4409313168;0.809128
8672.14;4414319767;0.801069
8676.47;4419786455;0.80033
8680.57;4424087808;0.799692
8684.44;4429931165;0.791662
8688.79;4434228451;0.79086
8692.9;4439495053;0.79016
8696.79;4444967139;0.789559
8701.15;4449188526;0.788498
8705.28;4454704765;0.787542
8709.18;4459204656;0.786692
8712.87;4464974596;0.778624
8717.02;4469261015;0.777603
8720.94;4474560502;0.776681
8724.65;4479218080;0.768643
8728.82;4484570755;0.767551
8732.76;4489089796;0.766572
8736.48;4494789824;0.765685
8740;4499354086;0.757777
8743.96;4504745974;0.756723
8747.71;4509082139;0.755768
8751.26;4514348579;0.747885
8755.24;4519660000;0.746764
8759.01;4524981096;0.745745
8762.58;4528944046;0.737889
8766.57;4534423542;0.736703
8770.36;4539753313;0.735627
8773.93;4544303651;0.727806
8777.31;4549573334;0.720267
8781.11;4555063400;0.719297
8784.71;4559964025;0.718438
8788.11;4564815917;0.71092
8791.93;4569102167;0.709885
8795.55;4574381466;0.708956
8798.96;4579899394;0.70147
8802.79;4584314635;0.700369
8806.42;4589732277;0.699378
8809.84;4594229982;0.698493
8813.08;4599861547;0.691136
8816.72;4604124436;0.69007
8820.17;4609803997;0.689109
8823.42;4614272995;0.681774
8827.08;4619587403;0.680635
8830.54;4624856814;0.679606
8833.8;4629930645;0.672297
8837.47;4634435875;0.671087
8840.93;4639766197;0.669987
8844.21;4644227321;0.668999
8847.29;4649339731;0.66182
8850.78;4654797625;0.660644
8854.07;4659376797;0.659579
8857.17;4664226101;0.652415
8860.67;4669637494;0.651168
8863.97;4674934701;0.650028
8867.08;4679223543;0.642886
8870.58;4684791346;0.641568
8873.88;4689146820;0.640362
8877;4694743904;0.639265
8879.95;4699372391;0.632255
8883.26;4704865280;0.630968
8886.4;4709639964;0.629795
8889.36;4715090791;0.6228
8892.68;4719690932;0.621441
8895.82;4724964559;0.620195
8898.79;4729101311;0.613224
8902.11;4734457384;0.611795
8905.25;4739723233;0.61048
8908.22;4744137604;0.609276
8911.02;4749676134;0.602436
8914.17;4754983501;0.601042
8917.15;4759671122;0.599763
8919.96;4764019304;0.592941
8923.11;4769390046;0.591474
8926.09;4774694333;0.59012
8928.91;4779079046;0.58332
8932.06;4784376499;0.581782
8935.04;4789808271;0.58036
8937.85;4794239797;0.579051
8940.5;4799046544;0.572393
8943.49;4804688812;0.57089
8946.31;4809216453;0.569507
8948.97;4814120363;0.562861
8951.95;4819377653;0.561289
8954.77;4824731983;0.559832
8957.43;4829208431;0.553209
8960.41;4834484545;0.551566
8963.23;4839709452;0.55004
8965.88;4843913480;0.548634
8968.85;4849165007;0.546787
8971.66;4854537952;0.54506
8974.3;4859084353;0.543457
8976.8;4864346986;0.536871
8979.6;4869600528;0.535075
8982.25;4874878860;0.5334
8984.74;4879951071;0.526838
8987.54;4884550107;0.524973
8990.18;4889823325;0.523235
8992.67;4894300068;0.521614
8995.01;4899736408;0.515198
8997.65;4904090666;0.513387
9000.14;4909756789;0.511697
9002.48;4914679489;0.505302
9005.11;4919048430;0.50342
9007.6;4924275161;0.501664
9009.94;4929735527;0.495299
9012.56;4934982922;0.493352
9015.04;4939319662;0.491534
9017.37;4944877973;0.485203
9019.98;4949134904;0.483199
9022.44;4954549524;0.481321
9024.76;4959067997;0.479573
9026.94;4964915964;0.4734
9029.39;4969102118;0.471458
9031.71;4974326590;0.469641
9033.89;4979055786;0.463502
9036.32;4984339575;0.461492
9038.63;4989537401;0.459615
9040.79;4994849329;0.457867
9043.21;4999109527;0.455684
9045.5;5004442144;0.453637
9047.65;5009962775;0.451715
9049.68;5014551344;0.445656
9051.95;5019847366;0.443543
9054.1;5024065487;0.441557
9056.11;5029323596;0.435526
9058.37;5034816962;0.43335
9060.5;5039157657;0.431307
9062.51;5044545429;0.425312
9064.74;5049143014;0.423078
9066.85;5054539348;0.420978
9068.84;5059179682;0.419013
9070.71;5064693582;0.413185
9072.81;5069028874;0.411022
9074.79;5074311266;0.408992
9076.64;5079434398;0.403197
9078.72;5084837662;0.400973
9080.68;5089144783;0.398887
9082.53;5094551758;0.393127
9084.26;5099073053;0.387593
9086.21;5104601799;0.385538
9088.04;5109324369;0.383616
9089.76;5114166288;0.378107
9091.7;5119825443;0.375988
9093.51;5124209096;0.374001
9095.22;5129210130;0.368525
9097.13;5134745363;0.366339
9098.94;5139088445;0.36429
9100.63;5144523712;0.358845
9102.22;5149045976;0.353624
9104;5154550619;0.351598
9105.68;5159122510;0.349702
9107.26;5164706409;0.344501
9109.03;5169029906;0.342404
9110.69;5174306602;0.34044
9112.25;5179275845;0.335264
9113.99;5184627699;0.333093
9115.63;5189915447;0.331064
9117.18;5194239007;0.329168
9118.62;5200012884;0.324148
9120.24;5204348695;0.322036
9121.77;5209898751;0.320065
9123.2;5214855722;0.315058
9124.8;5219325345;0.312872
9126.31;5224626976;0.310821
9127.72;5229842123;0.305837
9129.29;5234254373;0.303576
9130.77;5239484240;0.301458
9132.16;5243993926;0.299469
9133.71;5249343501;0.29706
9135.16;5254710395;0.294792
9136.53;5259172588;0.292662
9137.8;5264428595;0.287776
9139.23;5269763766;0.285428
9140.57;5274072027;0.283219
9141.83;5279828016;0.278354
9143.23;5284216371;0.27593
9144.54;5289484934;0.273647
9145.77;5293915317;0.271503
9147.14;5299181117;0.268938
9148.42;5304561666;0.266513
9149.62;5309157317;0.264228
9150.75;5314275168;0.259473
9152;5319609818;0.256973
9153.18;5324984078;0.254613
9154.28;5329841664;0.249875
9155.5;5334212839;0.247298
9156.65;5339649821;0.244869
9157.72;5344238842;0.240152
9158.73;5349157168;0.235639
9159.84;5354447378;0.233186
9160.89;5359066039;0.23088
9161.87;5364200812;0.22638
9162.96;5369690320;0.223853
9163.97;5374999667;0.221468
9164.93;5378967983;0.216985
9165.98;5384417835;0.214383
9166.96;5389721187;0.211927
9167.88;5394895602;0.207464
9168.9;5399126538;0.204793
9169.85;5404494490;0.202272
9170.74;5410025388;0.199892
9171.56;5414509655;0.195597
9172.48;5419851286;0.192992
9173.33;5424028400;0.190536
9174.13;5429742313;0.186258
9175.01;5434302605;0.183579
9175.83;5439617116;0.181048
9176.59;5444091534;0.178659
9177.3;5449037310;0.174545
9178.08;5454547307;0.171927
9178.81;5459020686;0.169459
9179.49;5464217426;0.165354
9180.24;5469693326;0.162661
9180.94;5474147594;0.160113
9181.58;5479472173;0.156026
9182.29;5484991443;0.153251
9182.95;5489219415;0.150629
9183.56;5494659439;0.146563
9184.12;5499749257;0.142677
9184.74;5504283626;0.140011
9185.31;5509995503;0.137496
9185.84;5514296122;0.133621
9186.42;5520035275;0.130876
9186.96;5524673387;0.12828
9187.45;5529124937;0.124421
9187.99;5534637391;0.121597
9188.48;5539954818;0.118926
9188.94;5544519122;0.1164
9189.35;5549670626;0.112705
9189.81;5554125629;0.109946
9190.23;5559757282;0.107339
9190.61;5564348595;0.10365
9191.02;5569683897;0.100807
9191.39;5574964417;0.0981153
9191.73;5579631838;0.0944431
9192.1;5583989758;0.0915242
9192.43;5589464199;0.0887549
9192.73;5594849289;0.0861374
9193.05;5599124153;0.083114
9193.34;5604561853;0.0802451
9193.59;5609131697;0.0775342
9193.82;5614803407;0.0740145
9194.06;5619073981;0.0710622
9194.28;5624335424;0.0682651
9194.46;5629318398;0.0647631
9194.66;5634602949;0.0617322
9194.83;5639877952;0.0588578
9194.97;5644140128;0.0561354
9195.11;5649537735;0.0530076
9195.23;5654869307;0.0500369
9195.33;5659531149;0.0472222
9195.41;5664575090;0.0438889
9195.48;5669903735;0.0408371
9195.53;5674302472;0.0379432
9195.56;5679554141;0.0346179
9195.59;5684946633;0.0315409
9195.59;5689201164;0.0286226
9195.59;5693867538;0.0253714
9195.57;5699172076;0.0223608
9195.55;5704553616;0.019504
9195.5;5709044046;0.0168067
9195.45;5714092365;0.0138558
9195.39;5719546484;0.0111401
9195.32;5724808023;0.00857284
9195.24;5729508304;0.00584628
9195.16;5734907502;0.0033523
9195.07;5739138060;0.000993779
9194.97;5744757044;0.00143446
9194.87;5749051273;0.00364372
9194.76;5754387105;0.00571878
9194.64;5760012794;0.00766845
9194.51;5764238591;0.00960932
9194.39;5769635662;0.0113475
9194.26;5774116692;0.012965
9194.13;5779126388;0.0145527
9194;5784621283;0.0159451
9193.86;5789242582;0.0172317
9193.72;5794818303;0.0184987
9193.58;5799099639;0.0196633
9193.44;5804530789;0.0206504
9193.29;5809112917;0.0215439
9193.15;5814656200;0.0224319
9193.01;5819967917;0.0231519
9192.86;5824533611;0.0237892
9192.72;5829720979;0.0244304
9192.58;5834221444;0.0249138
9192.43;5839528062;0.0253266
9192.29;5844453236;0.0257476
9192.15;5849951792;0.0260242
9192.02;5854372176;0.0262356
9191.88;5859967288;0.0263916
9191.74;5864490914;0.0265706
9191.6;5869767612;0.0266112
9191.47;5874223190;0.0265997
9191.34;5879316171;0.0266227
9191.21;5884672523;0.0265191
9191.09;5889069731;0.0263685
9190.96;5894291510;0.0261753
9190.84;5899682109;0.0259469
9190.73;5905168647;0.0256798
9190.61;5910000840;0.0253781
9190.49;5914820772;0.0251279
9190.39;5919120346;0.0247639
9190.28;5924402752;0.0243755
9190.17;5929868425;0.0240351
9190.08;5934275452;0.0235905
9189.98;5939575085;0.0231274
9189.88;5944072439;0.0227227
9189.79;5949482058;0.0222157
9189.71;5954795191;0.0216923
9189.62;5959541846;0.0211493
9189.54;5964426460;0.0206795
9189.46;5969792533;0.0201128
9189.38;5974322691;0.0195325
9189.31;5979039704;0.0190254
9189.24;5984393844;0.0184269
9189.18;5989684303;0.0178215
9189.12;5994085371;0.0172914
9189.05;5999074337;0.0167517
9189;6004638207;0.016128
9188.94;6009160054;0.0154989
9188.89;6014196124;0.0149525
9188.85;6019550664;0.0143207
9188.8;6024817026;0.0136889
9188.76;6029524832;0.0131398
9188.73;6034929687;0.0125094
9188.69;6039176931;0.0118789
9188.66;6044920690;0.0113346
9188.64;6049307362;0.0107095
9188.61;6054616119;0.0100933
9188.59;6059183298;0.00947848
9188.56;6064488985;0.00895301
9188.55;6069845220;0.00835114
9188.53;6074415169;0.00775386
9188.52;6079819149;0.00724473
9188.51;6084367771;0.00665981
9188.51;6089647970;0.0060841
9188.5;6094061522;0.00551886
9188.5;6099459712;0.00496094
9188.5;6104745599;0.00441119
9188.5;6109331287;0.00387086
9188.5;6114936232;0.00341929
9188.51;6119089369;0.00289802
9188.52;6124280941;0.002387
9188.53;6129035144;0.00196181
9188.55;6134231087;0.00147047
9188.56;6139508775;0.000987708
9188.58;6144767725;0.000594551
9188.59;6149003329;0.00021291
9188.61;6154478498;0.000244729
9188.63;6159096412;0.000689386
9188.65;6164066501;0.00104193
9188.68;6169536826;0.001469
9188.71;6174938444;0.00188393
9188.73;6179339240;0.00220047
9188.77;6184623346;0.00259907
9188.8;6189926322;0.00298071
9188.83;6194171196;0.00327296
9188.87;6199518165;0.00363492
9188.9;6204914804;0.00399019
9188.94;6209549216;0.00433038
9188.97;6214402168;0.00458118
9189.01;6219739574;0.00490672
9189.05;6224249851;0.00521781
9189.09;6229455441;0.00543951
9189.14;6234891516;0.00573574
9189.18;6239170928;0.00601773
9189.22;6244687990;0.00629303
9189.27;6249124430;0.00655597
9189.31;6254452340;0.00681284
9189.36;6259092430;0.00705966
9189.4;6264460172;0.00721353
9189.45;6269777615;0.0074434
9189.5;6274286754;0.00766719
9189.55;6279631914;0.00779385
9189.6;6284967234;0.00800069
9189.65;6289182412;0.00819789
9189.7;6294563110;0.00830508
9189.74;6299525784;0.00840326
9189.8;6304970705;0.00858163
9189.85;6309641605;0.00875183
9189.9;6314272753;0.00882699
9189.95;6319933419;0.00898295
9190;6324497974;0.00913138
9190.05;6329558243;0.00919104
9190.11;6334887455;0.00932796
9190.17;6339147998;0.00945817
9190.22;6344898049;0.00949879
9190.28;6349435261;0.00961749
9190.33;6354770827;0.00973137
9190.39;6359280271;0.00983647
9190.44;6364438769;0.00985468
9190.5;6369754578;0.00995098
