Distance;Time;Velocity Kalman
0;632510;0.0782254
0.0927391;5153467;0.0774297
0.254881;10195186;0.0622259
0.425924;14647690;0.0523312
0.581306;19531064;0.0449901
0.490559;24622735;0.035471
0.494652;30308674;0.0274618
0.704126;34771775;0.0204201
0.899966;40078505;0.0156616
1.08016;44905872;0.0114803
1.02956;49409455;0.0102288
0.99134;55376641;0.01198
0.963724;59576589;0.0149037
0.998405;65008061;0.0173656
1.0313;69943474;0.0128074
1.06234;74350592;0.0117797
1.01585;79769680;0.0130912
0.991435;84655594;0.0118136
0.986578;89629424;0.0107596
0.971759;94973844;0.00971759
0.966588;99800164;0.0087741
0.968631;104975942;0.00762655
1.05647;110358608;0.00795167
1.14337;114471797;0.00867485
1.22737;120372210;0.00826285
1.19266;124809263;0.0072338
1.19939;129685255;0.00569813
1.23919;134794307;0.0054567
1.39606;140307894;0.00563851
1.54296;145266994;0.00782393
1.68115;149901525;0.0099241
1.62361;155354923;0.010172
1.56985;159618060;0.00938566
1.51962;164661884;0.00866901
1.53914;170002868;0.00824891
1.55911;174740848;0.00961077
1.57971;179380060;0.0108674
1.40365;184780351;0.0110489
1.23838;190339331;0.00931455
1.08389;195372098;0.00794963
1.00335;199971829;0.00741229
0.931152;205173094;0.00750755
0.868243;210029987;0.00808208
0.843954;214519286;0.00891683
0.826293;219850643;0.00777265
0.81451;225242412;0.0070302
0.795628;229692343;0.00602696
0.778033;234642098;0.00727376
0.762593;240194922;0.00858004
0.721484;244677641;0.0103709
0.683957;249722953;0.0103012
0.648813;254944744;0.0102494
0.58093;259439926;0.010605
0.519594;264551190;0.011696
0.46627;269847942;0.0127361
0.447174;275320359;0.0131377
0.428755;279750407;0.0114176
0.411561;284862227;0.00979174
7.53387;289685912;0.0645691
7.53387;294748826;0.0654664
7.53387;300416485;0.0663217
5.7623;305067713;0.0496208
4.63033;310068068;0.0391308
3.81247;314586760;0.0319325
3.28479;320253020;0.0269523
2.85062;325348979;0.0222813
2.48799;329420511;0.0183212
2.10796;334901661;0.0146789
1.77842;340167229;0.012128
1.49633;345032685;0.0101199
1.49879;349435568;0.00976023
1.54657;354535957;0.0104788
1.62401;359543062;0.0116679
1.48503;365079270;0.0113184
1.38001;370142565;0.0107519
1.30608;375031690;0.0104877
1.56061;379539067;0.0130389
1.79372;384588120;0.0574098
2.00574;390185266;0.0552889
1.74276;394683784;0.0579334
1.51968;400005725;0.0424741
1.33359;404781733;0.0330645
1.26962;410250700;0.0254295
1.21726;415257917;0.0206754
1.17534;420267393;0.0167543
1.63598;424694679;0.00853774
2.05539;429666345;0.000715732
2.43579;434415462;0.00673
2.21724;439859244;0.00805078
2.03816;445062186;0.00593438
1.89571;449449935;0.00398346
11.1824;454807441;0.110951
11.1824;460228893;0.109677
11.1824;465157466;0.108485
19.6221;469635791;0.191342
25.0904;474693257;0.244923
29.1164;479704595;0.284193
39.1727;485277030;0.383517
47.67;490412988;0.468275
55.0733;494544421;0.542231
67.5515;499943632;0.66701
78.7013;504907375;0.779362
88.6062;510099535;0.879168
103.878;514520153;1.03258
117.403;520022194;1.16621
129.251;525408108;1.28325
144.825;530043415;1.43773
158.412;535294883;1.57642
170.181;540006728;1.69665
185.607;544440194;1.85318
199.008;549420319;1.87833
210.61;554823263;1.99435
225.673;559549214;2.14498
238.803;564701336;2.19185
250.233;569917661;2.25146
263.937;575405193;2.34824
275.945;580338286;2.36773
286.467;584559011;2.38799
300.171;590128571;2.45103
312.287;594874691;2.44743
323.001;599831928;2.44311
335.752;604535659;2.4716
347.106;609510027;2.4324
357.221;614524536;2.39831
369.549;619996143;2.4031
380.609;625263253;2.35791
390.536;629295099;2.32128
402.453;634771230;2.32275
413.217;640078208;2.27613
422.943;644668974;2.23939
434.327;650101682;2.2372
444.668;655278989;2.18996
454.066;660313275;2.15263
464.914;664754020;2.14681
474.818;669790542;2.10881
483.863;675245327;2.07918
492.126;679831822;2.0566
499.675;685263849;1.99505
506.569;689463853;1.94284
516.854;694982944;1.93854
526.331;700160313;1.90581
535.065;704634988;1.87963
545.245;710183661;1.88027
554.661;715402913;1.85116
563.373;720310820;1.82768
573.157;724980743;1.82626
582.236;730074464;1.79785
590.658;734854534;1.77443
600.276;740289658;1.77334
609.227;745356420;1.749
617.553;750547809;1.72886
626.896;754555731;1.72831
635.61;760026241;1.70696
643.734;764647111;1.68916
653.142;770128624;1.69279
661.939;775263067;1.69813
670.161;779744412;1.70487
679.283;785194650;1.72714
687.826;790289576;1.70974
695.823;795232804;1.69494
704.777;799724504;1.69715
713.177;804961988;1.67936
721.051;810011196;1.66393
730.146;814363304;1.66776
738.695;820364183;1.65541
746.725;824432622;1.64492
755.555;830038949;1.64901
763.863;834831647;1.6359
771.673;840434903;1.62448
779.006;844932920;1.61454
785.884;849889181;1.58989
792.328;855156146;1.56719
801.106;859721899;1.57373
809.387;864782891;1.56245
817.189;869781067;1.5525
825.834;875324005;1.55673
833.994;879390142;1.54711
841.687;885147355;1.53861
850.278;889601972;1.54455
858.392;894503397;1.53615
866.047;899680184;1.52871
874.467;905140554;1.53416
882.422;910110014;1.52276
889.928;915416851;1.51233
898.471;920226093;1.51746
906.551;924466962;1.50996
914.183;929802313;1.5032
922.619;935334361;1.50947
930.6;939716658;1.51595
938.141;945279548;1.52257
946.626;949694224;1.54298
954.659;954909502;1.53553
962.253;959851044;1.52867
970.71;965331585;1.53521
978.718;969285376;1.52884
986.291;974962974;1.52297
994.702;980402192;1.53016
1002.67;984359586;1.52391
1010.2;989534209;1.51813
1018.59;994960210;1.52545
1026.54;1000267009;1.52071
1034.06;1004737593;1.51635
1042.33;1010178053;1.52404
1050.17;1015313947;1.51701
1057.59;1019605320;1.51037
1065.75;1025324621;1.51571
1073.49;1030337569;1.5087
1080.8;1035064369;1.50207
1089.02;1039622900;1.50885
1096.81;1044640188;1.50188
1104.18;1049916115;1.49525
1112.36;1054388990;1.50108
1120.11;1060407054;1.49401
1127.44;1064452297;1.48727
1135.56;1069870417;1.49272
1143.25;1074307761;1.48554
1150.53;1080182953;1.47868
1158.63;1084971649;1.48433
1166.31;1090249590;1.47726
1173.58;1095279485;1.47049
1181.67;1099811983;1.47616
1189.33;1105048318;1.47004
1196.59;1109595891;1.46419
1204.7;1115021176;1.47121
1212.4;1120438749;1.46653
1219.69;1125309042;1.46206
1227.7;1129733324;1.46901
1235.3;1134715396;1.46279
1242.49;1139888190;1.45681
1250.53;1145316473;1.4635
1258.15;1150505244;1.45796
1265.37;1154524013;1.45264
1273.31;1160017337;1.45872
1280.84;1165261394;1.45284
1287.97;1169755748;1.44719
1295.99;1175259168;1.45459
1303.6;1179521250;1.44964
1310.8;1184975021;1.44489
1318.67;1189464031;1.45085
1326.12;1194506317;1.44456
1333.18;1200099907;1.4385
1341.14;1204793926;1.44549
1348.68;1209887030;1.43976
1355.83;1214597568;1.43424
1363.76;1220006912;1.44068
1371.28;1224987912;1.43581
1378.41;1230321007;1.43112
1386.41;1235391990;1.43923
1394.01;1239936797;1.43477
1401.2;1244640651;1.43048
1409.08;1250110588;1.43714
1416.56;1254353253;1.43251
1423.65;1259392975;1.42806
1431.45;1264875814;1.43477
1438.84;1269887349;1.42853
1445.85;1274924066;1.42251
1453.64;1279422970;1.42837
1461.03;1284451153;1.42362
1468.03;1290162784;1.41905
1475.82;1294549640;1.42641
1483.22;1299476500;1.4208
1490.22;1304751587;1.41538
1497.98;1310285836;1.42158
1505.35;1314947352;1.4159
1512.33;1319563625;1.41042
1520.07;1325300418;1.41657
1527.41;1330440836;1.41
1534.37;1334703456;1.40365
1542.03;1340434710;1.40826
1549.29;1344563068;1.40203
1556.16;1349761492;1.396
1564.03;1355392833;1.40389
1564.03;1359726927;1.32589
1564.03;1365144617;1.2519
1569.62;1369581722;1.23777
1573.24;1374686055;1.19608
1575.91;1379830968;1.14885
1581.96;1385237595;1.13929
1587.06;1390215917;1.11241
1591.51;1394740923;1.08296
1628.7;1400299107;1.38487
1628.7;1404725991;1.30721
1628.7;1409898407;1.23355
1628.7;1415383372;1.16377
1628.7;1419948512;1.08635
1628.7;1424910626;1.0129
1636.7;1430390698;1.02334
1643.47;1434549601;1.01444
1649.38;1440097867;1.00097
1654.63;1444580731;0.984623
1659.27;1449577532;0.952454
1663.37;1455016093;0.993442
1666.95;1459456102;1.02921
1670.03;1464410441;1.00409
1672.66;1469555508;0.994139
1685.5;1474425942;1.09591
1696.87;1479656546;1.14918
1706.87;1485024397;1.19813
1718.77;1489709615;1.27268
1729.18;1494883251;1.0048
1738.27;1499901005;1.09567
1749.47;1504655568;1.20766
1759.27;1509713060;1.30568
1767.84;1515153663;1.39136
1778.1;1519914395;1.49393
1787.11;1525225246;1.50409
1795.04;1530195382;1.51568
1804.43;1534618828;1.55043
1812.73;1539570018;1.58107
1820.08;1544761198;1.60809
1829.09;1550323284;1.65722
1837.13;1555024624;1.7018
1844.29;1559756443;1.74261
1864.45;1564398806;1.91807
1864.45;1569292824;1.7896
1864.44;1574631574;1.67585
1885.35;1580189786;1.78486
1885.35;1584396771;1.66587
1885.35;1590300508;1.5617
1890.74;1594829298;1.52467
1894.22;1600187792;1.44758
1896.79;1604741334;1.37525
1902.72;1610283099;1.34887
1907.73;1615205546;1.29638
1912.09;1619634160;1.24982
1919.2;1625086209;1.24162
1925.54;1630138051;1.21118
1931.17;1635356104;1.18445
1939.88;1640142390;1.19797
1947.58;1645177537;1.18488
1954.32;1650238469;1.172
1962.94;1654881533;1.18647
1970.44;1659955048;1.06053
1976.93;1665357612;1.12545
1986.22;1669821264;1.21825
1994.29;1674834384;1.08945
2001.3;1680401365;1.15949
2010.2;1684862087;1.2485
2017.96;1689859334;1.27224
2024.72;1695029828;1.30495
2033.45;1699452590;1.36655
2041.11;1705401116;1.38388
2047.84;1709749407;1.40107
2056.29;1714699185;1.44198
2063.77;1719974150;1.44573
2070.39;1724969462;1.4485
2078.45;1729580511;1.47285
2085.63;1734712999;1.45767
2092.04;1740046662;1.44472
2099.9;1744592542;1.45587
2106.96;1749537682;1.44034
2113.3;1755380544;1.42873
2121.03;1760093485;1.44113
2128.02;1765324369;1.41819
2134.35;1769876469;1.40065
2141.79;1775356338;1.40505
2148.56;1780315648;1.3837
2154.71;1784909428;1.36764
2162.02;1790339976;1.37306
2168.69;1794954934;1.35254
2174.8;1800326066;1.33696
2182.03;1805142516;1.34192
2188.66;1810209472;1.32377
2194.76;1815344062;1.30998
2202.05;1820001822;1.31662
2208.77;1825302632;1.30322
2214.97;1829716614;1.29341
2222.24;1835163651;1.30195
2228.96;1840397879;1.29063
2235.2;1844595849;1.28239
2242.41;1850171546;1.29108
2249.11;1854491346;1.28076
2255.34;1859923588;1.27313
2262.49;1865394246;1.28139
2269.15;1870309608;1.27363
2275.36;1875086538;1.26809
2282.34;1879611817;1.27628
2288.86;1884843509;1.26843
2294.95;1889869202;1.26257
2302.07;1895329659;1.27274
2308.74;1899601586;1.26721
2314.99;1904437340;1.26333
2321.96;1909937756;1.27199
2328.5;1915054796;1.26454
2334.63;1920409841;1.25865
2341.43;1925043552;1.26459
2347.82;1930121552;1.25587
2353.82;1935202563;1.24861
2360.62;1939614716;1.25424
2367.02;1944609486;1.24613
2373.04;1949709235;1.23931
2379.82;1954448772;1.24487
2386.22;1959822270;1.23732
2392.24;1965359243;1.23091
2399.08;1969829211;1.23711
2405.53;1974924347;1.23187
2411.61;1979450237;1.22754
2418.42;1984918655;1.23471
2424.85;1990023636;1.22778
2430.92;1995305364;1.22175
2437.62;1999939925;1.22626
2443.95;2005307568;1.21993
2449.93;2009538653;1.21438
2455.58;2015012796;1.20949
2460.9;2019950166;1.19471
2465.91;2025054510;1.18088
2472.68;2029470859;1.18857
2479.09;2034734501;1.18475
2485.16;2039561519;1.18146
2491.89;2045298166;1.18857
2498.27;2050442005;1.1845
2504.31;2054703125;1.18092
2510.97;2059442994;1.1873
2517.29;2064625614;1.18213
2523.27;2069901148;1.17742
2529.86;2074442118;1.18253
2536.12;2079775109;1.177
2542.04;2084368821;1.17191
2548.54;2089817893;1.17628
2554.71;2094821120;1.17096
2560.55;2099772310;1.16603
2567.02;2105161133;1.1709
2573.16;2110127784;1.17581
2578.97;2115316232;1.18072
2585.38;2119997782;1.19472
2591.45;2125415384;1.18777
2597.21;2129815811;1.18115
2603.62;2135285217;1.18455
2609.7;2139707501;1.17805
2615.46;2145112441;1.17187
2621.83;2149504456;1.17521
2627.87;2154831304;1.16901
2633.59;2159904414;1.16309
2639.92;2165413649;1.16656
2645.92;2169463714;1.16061
2651.61;2174750428;1.15493
2657.89;2180169109;1.15855
2663.85;2185168747;1.15307
2669.49;2190067164;1.14781
2675.77;2194530724;1.15219
2681.73;2200129747;1.14704
2687.37;2205140812;1.1421
2693.58;2210098819;1.14607
2699.47;2215318719;1.14087
2705.04;2219452302;1.13588
2711.18;2225132494;1.13977
2717.01;2230130146;1.13392
2722.52;2234573433;1.12827
2727.74;2240076371;1.12283
2733.69;2245303170;1.11859
2739.32;2250245629;1.11453
2745.49;2254802140;1.11899
2751.35;2259751352;1.11425
2756.89;2265273870;1.1097
2763;2269707442;1.11397
2768.8;2275358472;1.1091
2774.29;2280453232;1.10441
2780.44;2284992746;1.10953
2786.28;2290247441;1.10515
2791.82;2294710018;1.10092
2797.05;2300027856;1.09686
2802.87;2305311625;1.09291
2808.37;2309645088;1.08911
2816.29;2315089170;1.11316
2816.28;2319401417;1.05176
2816.28;2324948908;0.993541
2816.28;2330380195;0.93842
2816.28;2334361362;0.886313
2816.28;2339562384;0.82682
2848.85;2345017324;1.09528
2848.85;2350162875;1.03359
2848.85;2354856655;0.975062
2853.31;2360387620;0.96424
2856.2;2364623240;0.932042
2858.33;2370027630;0.895368
2862.81;2374452322;0.885236
2866.59;2379800604;0.861482
2869.87;2385204252;0.835993
2875.53;2389658423;0.837213
2880.58;2394674075;0.835381
2885.07;2400404537;0.822087
2891.57;2405176021;0.832001
2897.32;2410227015;0.811241
2902.35;2414825494;0.861432
2909.81;2420238328;0.936052
2916.34;2425359823;1.00129
2922;2429476914;1.05793
2929.16;2434955131;1.1294
2935.37;2439312603;0.865214
2940.75;2444818941;0.919049
2947.93;2450418625;0.990816
2954.19;2454589341;1.0088
2959.65;2460004315;1.03444
2966.33;2464546390;1.07993
2972.18;2469678667;1.09376
2977.32;2475130453;1.10735
2983.9;2479876862;1.14029
2989.73;2485386062;1.14195
2994.88;2489777225;1.14295
3001.28;2495215787;1.16212
3006.99;2500132557;1.15419
3012.08;2504362492;1.14763
3018.44;2509885927;1.1609
3024.14;2514414435;1.14331
3029.27;2520525975;1.12934
3035.36;2525306478;1.13353
3040.86;2529502450;1.11701
3045.83;2534656957;1.10461
3051.8;2540147037;1.11047
3057.23;2545268200;1.09299
3062.17;2550328241;1.07979
3068.26;2554823487;1.08615
3073.84;2560074514;1.07512
3078.94;2564383473;1.06756
3090.2;2569852192;1.12875
3090.19;2574867865;1.06291
3090.19;2579955692;1.00468
3094.35;2585386684;0.994676
3097.03;2590550908;0.957529
3099.01;2594611924;0.920243
3103.62;2600179280;0.915383
3107.51;2604392922;0.890739
3110.9;2609616619;0.867538
3116.18;2615092679;0.869067
3120.89;2619423922;0.855362
3125.07;2625133787;0.84217
3131.36;2629556628;0.855249
3136.91;2634558477;0.851106
3141.77;2640079777;0.84541
3148.22;2644477397;0.860495
3153.84;2649660935;0.855796
3158.71;2655312105;0.848726
3165.43;2659799420;0.864887
3171.27;2664828873;0.81075
3176.33;2670022425;0.861377
3182.86;2674406437;0.926707
3188.55;2679694770;0.942144
3193.51;2685378720;0.964851
3199.8;2689838795;1.00789
3205.31;2695027365;1.01699
3210.15;2700365055;1.02649
3216.37;2704832834;1.05479
3221.87;2709965107;1.05694
3226.74;2715134066;1.05847
3231.05;2719818857;1.05976
3234.87;2725197220;1.03513
3238.25;2729436981;1.01343
3244.3;2734828436;1.02532
3249.73;2739842631;1.01517
3254.62;2744971923;1.00785
3260.45;2750545142;1.01742
3265.72;2755316758;1.00294
3270.49;2760178564;0.992243
3276.37;2764703204;1.00045
3281.73;2769854488;0.988697
3286.61;2775127381;0.980546
3292.36;2779639246;0.988465
3297.62;2785056396;0.978267
3302.44;2790239572;0.971324
3307.86;2794687546;0.977124
3312.84;2800288366;0.964754
3317.42;2805112760;0.955528
3322.95;2809556780;0.962133
3328.05;2814511866;0.970071
3332.77;2819771009;0.979028
3338.14;2825290421;0.998884
3343.11;2830342002;0.988166
3347.72;2834956144;0.979891
3352.97;2839663760;0.983432
3357.84;2844997675;0.973935
3362.37;2850383666;0.966542
3374.33;2854979493;1.03844
3374.33;2860265939;0.979601
3374.33;2864960727;0.926024
3377.12;2869460725;0.905169
3378.93;2874413648;0.865763
3380.27;2879998891;0.826457
3384.41;2884442980;0.819664
3387.9;2889550432;0.80046
3390.95;2894793829;0.781162
3395.67;2900246743;0.782556
3399.88;2905171747;0.769377
3403.62;2909785079;0.755714
3409.1;2915224820;0.763376
3413.94;2919562882;0.758149
3418.18;2924598606;0.750802
3424.09;2930100816;0.763806
3429.25;2935234252;0.762901
3433.72;2939736666;0.758829
3439.47;2945205106;0.771035
3444.47;2950343405;0.701748
3448.79;2955013889;0.745019
3454.49;2959643815;0.801941
3459.46;2964859082;0.82358
3463.79;2970257442;0.848689
3467.56;2974709306;0.872968
3470.83;2979675989;0.864264
3473.68;2984882617;0.85772
3479.55;2990557288;0.885958
3484.76;2995154363;0.890868
3489.38;2999607386;0.894956
3494.88;3005236685;0.912633
3499.8;3010317199;0.907006
3504.19;3014985683;0.902493
3509.76;3019555769;0.915784
3514.76;3024866162;0.906754
3519.27;3029948300;0.900245
3524.58;3035401619;0.908685
3529.38;3039627392;0.899294
3533.74;3045122235;0.892924
3537.68;3049603853;0.889181
3541.26;3054909667;0.867897
3544.5;3060039048;0.85059
3549.87;3064413180;0.861001
3554.8;3070553245;0.872549
3559.32;3075117207;0.884914
3564.4;3079822007;0.90731
3569.08;3085068464;0.895373
3573.38;3090236563;0.886345
3578.42;3094734078;0.890536
3583.08;3100197966;0.882017
3587.38;3105060041;0.87586
3592.16;3109544772;0.879797
3596.6;3114398362;0.868478
3600.71;3120003674;0.859499
3605.53;3124784589;0.862664
3610.01;3129692201;0.854385
3614.19;3134828763;0.848014
3618.89;3140263784;0.851496
3623.27;3145195344;0.855891
3627.35;3149536638;0.861008
3632.08;3154417822;0.875828
3636.49;3159686932;0.866199
3640.62;3164393822;0.858198
3645.21;3169866553;0.858984
3649.51;3174946555;0.851145
3653.54;3179415568;0.844643
3658.18;3184885083;0.848013
3662.54;3189885811;0.841198
3666.63;3195176909;0.835547
3671.78;3199875284;0.844096
3671.78;3204997634;0.796247
3671.77;3210305080;0.751911
3675.14;3214718872;0.744496
3677.32;3219663963;0.718041
3678.93;3224846498;0.689223
3682.38;3230523257;0.682037
3685.3;3235078767;0.664177
3687.84;3240124153;0.64573
3692;3244627733;0.646451
3695.71;3249689560;0.636345
3699;3255326439;0.625136
3704.1;3260026545;0.634813
3708.6;3265108065;0.63396
3712.55;3270054788;0.630412
3717.94;3274528210;0.643978
3722.64;3279743190;0.644569
3726.71;3285208305;0.641743
3731.75;3289654549;0.651249
3736.12;3294570241;0.643486
3739.91;3299779108;0.681316
3745.13;3305237924;0.733537
3749.68;3310206619;0.745409
3753.65;3314431145;0.76327
3758.33;3320143822;0.794067
3762.44;3324557226;0.800588
3766.04;3330037522;0.807404
3770.77;3334465545;0.82936
3774.96;3339920136;0.829653
3778.66;3345332170;0.829584
3783.25;3349884025;0.842506
3787.34;3355232067;0.832444
3790.98;3360127011;0.823815
3795.36;3364773758;0.828053
3799.28;3369831599;0.813449
3802.81;3374754883;0.801689
3807.22;3380198107;0.805045
3811.2;3385242837;0.794518
3814.81;3390523963;0.786849
3819.02;3394712604;0.791117
3822.85;3400309727;0.777175
3826.33;3405337644;0.76645
3830.52;3409925291;0.76868
3834.35;3415139578;0.760139
3837.85;3419600354;0.754122
3842.11;3425343121;0.760736
3846.03;3430419861;0.752547
3849.63;3434561916;0.746684
3853.76;3440179901;0.751021
3857.58;3445321026;0.743325
3861.1;3450178937;0.737677
3865.17;3454615145;0.741925
3868.94;3459683869;0.735885
3872.44;3464884423;0.731549
3876.47;3470494018;0.736623
3880.22;3474315105;0.730006
3883.7;3479970973;0.724962
3887.61;3484702599;0.72805
3891.26;3490142418;0.72244
3894.66;3495326006;0.718154
3898.54;3500018314;0.722163
3902.17;3505295902;0.716529
3905.56;3509752205;0.712085
3909.35;3515302707;0.714931
3912.89;3520037431;0.707801
3916.21;3524684703;0.701839
3924.64;3530115788;0.750235
3924.64;3535136213;0.708884
3924.64;3540153887;0.670727
3926.68;3544603556;0.655987
3928.01;3549599682;0.62854
3928.98;3555248500;0.600602
3931.65;3559960802;0.592324
3933.9;3565259580;0.574506
3935.87;3569515235;0.556645
3939.25;3575060906;0.555563
3942.26;3579330878;0.546569
3944.95;3585025127;0.536903
3949.2;3589451094;0.54545
3952.97;3594405238;0.54434
3956.28;3599947240;0.541149
3960.61;3604703896;0.550575
3964.39;3609793934;0.550484
3967.66;3614576958;0.547784
3971.93;3619988142;0.55733
3975.64;3625016087;0.510051
3978.85;3630286361;0.542155
3994.07;3635189712;0.694471
3994.07;3639650792;0.674026
3994.07;3645028290;0.660783
3996.5;3649581140;0.675339
3998.07;3654828290;0.664355
3999.23;3659597798;0.653373
4002.02;3665184848;0.661587
4004.38;3670244984;0.651358
4006.43;3674869881;0.641672
4009.49;3679443515;0.645491
4012.23;3684684793;0.630277
4014.65;3689981454;0.616791
4018.69;3695384913;0.624143
4022.28;3699297577;0.616676
4025.42;3705398087;0.610296
4029.65;3709985322;0.619904
4033.35;3714532687;0.614236
4036.56;3720368206;0.609248
4039.32;3725117012;0.60481
4041.69;3730198251;0.476204
4043.72;3735393258;0.496489
4048.34;3739995909;0.54273
4052.4;3745196349;0.558948
4055.94;3750170753;0.578657
4060.18;3754628959;0.609492
4063.91;3759907954;0.618905
4067.19;3764384428;0.628159
4071.11;3769858195;0.646824
4074.58;3774945240;0.650847
4077.65;3779654020;0.654222
4081.25;3785089300;0.66603
4084.46;3790283947;0.657725
4087.33;3795484901;0.650548
4091.03;3800138466;0.656155
4094.36;3804474658;0.647058
4097.35;3809601030;0.639984
4103.36;3815121377;0.668267
4103.36;3819741785;0.640628
4103.36;3824643703;0.616912
4117.03;3830076949;0.733179
4117.03;3835316595;0.686935
4117.03;3839872499;0.646427
4119.13;3845346006;0.631961
4120.49;3850394307;0.603145
4121.49;3854382293;0.575854
4123.77;3859820256;0.565829
4125.7;3864770758;0.545886
4127.37;3870028659;0.527965
4128.85;3874762997;0.512032
4130.15;3880217255;0.489009
4131.29;3884754873;0.468278
4135.06;3890323721;0.477378
4138.43;3895477695;0.474036
4141.41;3900068126;0.470548
4145.28;3904740345;0.479319
4148.66;3909917300;0.453358
4151.61;3915183956;0.482834
4155.44;3919947980;0.521163
4158.78;3925394040;0.41762
4161.67;3930396513;0.446606
4174.98;3934830325;0.579478
4174.98;3939837517;0.558486
4174.98;3944882554;0.544895
4184.54;3950310786;0.630454
4184.54;3955007741;0.607679
4184.54;3960376066;0.588452
4186.4;3964964337;0.590334
4187.6;3969957946;0.587654
4188.49;3974902567;0.583554
4201.13;3979471659;0.698407
4201.13;3984711126;0.660671
4201.13;3989966705;0.626989
4202.54;3995408880;0.611384
4203.45;3999749334;0.581894
4204.13;4004859599;0.554763
4215.53;4010336617;0.639166
4215.53;4015316065;0.6009
4215.53;4019757169;0.567569
4217.65;4025200395;0.559916
4219.02;4030203354;0.440471
4220.04;4034857445;0.450598
4231.03;4040462976;0.560597
4231.03;4044943123;0.464941
4231.03;4050238860;0.46494
4233.43;4054738651;0.488979
4234.98;4059876646;0.485998
4236.13;4065110572;0.485462
4238.44;4069573569;0.499709
4240.38;4074799732;0.392598
4242.08;4079833965;0.409544
4244.58;4085261603;0.434527
4246.8;4090366077;0.442683
4248.77;4094390723;0.453259
4252.02;4099790912;0.478993
4254.9;4104805585;0.393937
4257.41;4109926671;0.419147
4270.21;4114745920;0.546888
4270.21;4120088220;0.52572
4270.21;4124688798;0.512016
4277.27;4130239203;0.572838
4277.27;4135350110;0.462655
4277.27;4139657239;0.462655
4279.19;4145207038;0.48189
4280.44;4150352854;0.470264
4281.36;4154321834;0.463845
4283.21;4159798757;0.470884
4284.78;4164969469;0.46345
4286.14;4170061113;0.457594
4288.7;4174443063;0.466196
4290.98;4180405770;0.46408
4293.02;4184445624;0.46216
4295.72;4189861464;0.46956
4298.11;4195088879;0.46105
4300.2;4200408929;0.453259
4303.1;4205155475;0.457082
4305.62;4210337250;0.354271
4307.81;4214459603;0.376137
4309.69;4220086635;0.394958
4311.31;4224439799;0.34082
4312.68;4229417989;0.354564
4316.03;4234807668;0.387922
4318.97;4240080563;0.397973
4321.53;4244407265;0.411147
4324.65;4249900510;0.433116
4327.4;4255089624;0.441924
4329.81;4260283484;0.450363
4332.75;4264730778;0.466071
4335.35;4269737932;0.466505
4337.65;4275133922;0.466689
4340.61;4279661235;0.475966
4343.25;4284914619;0.475313
4345.61;4290100474;0.475021
4348.12;4294493771;0.479206
4350.37;4299699157;0.472745
4352.39;4304575432;0.467697
4354.21;4310065770;0.463987
4355.84;4315218033;0.461484
4357.3;4319925603;0.460028
4358.62;4324670222;0.459454
4361.15;4329851122;0.451293
4363.45;4334663067;0.445053
4365.55;4340084825;0.440459
4367.47;4345030007;0.428535
4369.23;4350446502;0.418685
4371.72;4354492542;0.419431
4374.02;4360020971;0.412916
4376.13;4364551915;0.40795
4383.63;4370045980;0.45976
4383.63;4375229722;0.430215
4383.63;4380191253;0.40386
4385.06;4384686741;0.394611
4385.99;4389841055;0.378833
4386.67;4394942310;0.363188
4397.01;4399604174;0.446855
4397.01;4404940221;0.42879
4397.01;4409781160;0.412564
4397.53;4415224226;0.4029
4397.87;4420094455;0.392988
4398.12;4425295301;0.370134
4406.27;4429781474;0.428675
4406.27;4434652963;0.407676
4406.27;4440322599;0.388509
4408.14;4444895284;0.389622
4409.34;4450054933;0.376643
4410.23;4454430655;0.362496
4411.41;4459997709;0.353034
4412.41;4465040585;0.287888
4413.28;4469537915;0.296577
4414.04;4475379138;0.304208
4422.7;4479957349;0.376407
4422.7;4484396509;0.367126
4424.46;4489917797;0.377983
4425.4;4494840073;0.283861
4426.01;4500059071;0.289976
4435.52;4504476424;0.38609
4435.52;4509321293;0.380557
4435.52;4515460869;0.377001
4440.26;4520070737;0.421622
4440.26;4525341599;0.340056
4440.26;4530052206;0.340057
4447.79;4534465841;0.415442
4447.79;4539743981;0.396801
4447.79;4545201846;0.384725
4448.05;4549656279;0.378234
4448.21;4554808513;0.367998
4448.34;4559517398;0.35925
4449.29;4565016085;0.360227
4450.1;4570132351;0.360809
4450.81;4575253609;0.28115
4458.94;4579650398;0.362477
4458.94;4584598348;0.345091
4458.94;4589796207;0.335873
4460.6;4595460355;0.346803
4461.67;4600017409;0.261568
4462.46;4605314622;0.26948
4463.56;4609953527;0.280488
4464.49;4615180046;0.243575
4465.3;4620490045;0.251414
4466.01;4625257179;0.258315
4466.63;4630295350;0.18832
4467.17;4634529106;0.193736
4479.69;4640091993;0.318976
4479.69;4645286636;0.316537
4479.69;4649678646;0.315005
4480.74;4655225423;0.324471
4481.41;4660289815;0.321901
4481.91;4665082131;0.31902
4489.48;4669531873;0.386724
4489.48;4674687710;0.305473
4489.48;4679896926;0.305474
4489.87;4684542356;0.309355
4490.13;4689613221;0.295335
4490.31;4694663102;0.286488
4498.01;4700387376;0.355447
4498.01;4704778866;0.344432
4498.01;4710205093;0.335152
4498.67;4714641194;0.333772
4499.11;4720334431;0.331027
4499.43;4725137880;0.328011
4500.52;4729538590;0.333541
4501.44;4734466522;0.217939
4502.24;4739510414;0.226146
4503.56;4744944969;0.239185
4504.73;4749894028;0.240586
4505.77;4755069072;0.244298
4506.69;4760010785;0.248515
4507.49;4764326975;0.180177
4508.18;4769833491;0.18707
4518.6;4775491807;0.291284
4518.6;4779722716;0.287363
4518.6;4785230734;0.284856
4518.96;4789711994;0.286676
4519.19;4794666982;0.212561
4519.37;4800140881;0.214342
4519.5;4804463937;0.215771
4520.17;4809568430;0.215359
4520.76;4814689038;0.216699
4528.25;4820134504;0.288356
4528.25;4825112302;0.277358
4528.25;4829969438;0.268101
4533.96;4835614376;0.3172
4533.96;4839916247;0.30405
4533.96;4844494287;0.292298
4533.95;4850112679;0.281796
4533.95;4855225460;0.272576
4533.95;4859976642;0.264563
4539.58;4864391301;0.31476
4539.58;4869457977;0.210783
4539.58;4874914180;0.210784
4539.58;4880387444;0.210785
4540.06;4884480908;0.211516
4540.42;4889971305;0.212473
4541.58;4895388702;0.222289
4542.57;4900335052;0.230701
4543.43;4904709735;0.23259
4544.67;4910130328;0.239147
4545.79;4914378371;0.175422
4546.78;4920089012;0.185367
4548.13;4924688677;0.199003
4549.33;4929657483;0.153852
4550.38;4935128414;0.164378
4551.95;4939669111;0.180264
4553.32;4944721850;0.194313
4554.51;4950086334;0.206504
4556.01;4954573296;0.221336
4557.3;4959738212;0.180513
4558.42;4965234436;0.19134
4559.39;4969863950;0.200714
4560.23;4974827856;0.208807
4560.95;4980086309;0.210493
4564.82;4984470571;0.244704
4564.82;4990536833;0.23293
4564.82;4995315277;0.222985
4564.96;5000026062;0.215705
4565.06;5005369505;0.203974
4565.12;5010396879;0.193402
4565.61;5014898711;0.188354
4566.02;5020479090;0.178891
4566.38;5024871869;0.170507
4567.34;5030289594;0.169668
4568.21;5034319351;0.162776
4568.98;5039947288;0.157112
4570.07;5045399550;0.156495
4571.04;5049481227;0.151274
4571.89;5054974251;0.146822
4573.05;5060377189;0.147268
4574.06;5064304873;0.147779
4574.94;5069604313;0.148284
4576.12;5075175976;0.152815
4577.15;5079560709;0.123943
4578.04;5084634905;0.132844
4578.96;5090290114;0.14173
4579.75;5095401966;0.148064
4580.44;5099912809;0.153931
4581.65;5104624463;0.165307
4582.71;5109684829;0.17108
4583.65;5115072770;0.176336
4584.47;5119571859;0.180997
4585.32;5124724050;0.179876
4586.08;5129928496;0.178746
4587.08;5135328937;0.181039
4587.98;5140329822;0.179107
4588.78;5144733558;0.177471
4589.57;5150157643;0.176897
4590.27;5155298911;0.172484
4590.9;5159888001;0.168808
4591.47;5164463847;0.16582
4591.98;5169809706;0.159177
4592.43;5175087367;0.153531
4593.16;5179676283;0.151764
4593.83;5184765279;0.148907
4594.43;5190111306;0.1468
4595.2;5194496439;0.147616
4595.91;5199965665;0.142635
4596.56;5204784820;0.138488
4597.35;5210257546;0.137005
4598.07;5215303684;0.136009
4598.73;5219674106;0.134127
4599.37;5225092469;0.132924
4599.95;5230298801;0.128764
4600.48;5234918534;0.125261
4600.94;5239654322;0.121978
4601.35;5244800546;0.118413
4601.73;5249672052;0.115344
4602.34;5255234823;0.114998
4602.9;5259455435;0.11487
4603.42;5264984466;0.114922
4603.93;5269568082;0.115612
4604.4;5274581000;0.112926
4604.83;5280144328;0.11058
4605.42;5284549638;0.110384
4605.98;5289521348;0.10817
4606.49;5294689499;0.106249
4606.98;5300100434;0.104646
4607.45;5305056403;0.101263
4607.87;5310469298;0.0982283
4608.44;5314396781;0.0971272
4608.96;5319898763;0.0960073
4609.45;5325047907;0.0950697
4610.02;5329658385;0.0953915
4610.55;5334686184;0.0961637
4611.05;5339894515;0.0969795
4611.45;5344383191;0.0971836
4611.83;5349460708;0.094902
4612.18;5355061567;0.0928186
4612.6;5359543270;0.0918624
4612.99;5364667364;0.0906626
4613.36;5370271824;0.0895943
4613.71;5374813865;0.0888039
4614.05;5379784652;0.0862292
4614.36;5385062028;0.0838328
4614.69;5389497499;0.0820765
4615.01;5395071593;0.0802389
4615.3;5399679936;0.0785264
4615.63;5405332536;0.0775472
4615.94;5410364262;0.0750185
4616.22;5414588996;0.072636
4616.44;5420419876;0.0699098
4616.64;5424583740;0.066266
4616.83;5429720922;0.0628113
4617.06;5435241503;0.0602482
4617.28;5440415237;0.0584435
4617.47;5444629971;0.0567504
4617.69;5450067540;0.0554657
4617.89;5455199621;0.0532782
4618.07;5460386235;0.0512004
4618.23;5464859231;0.049081
4618.38;5469806921;0.0469062
4618.51;5475080331;0.0448388
4618.62;5479734810;0.0428099
4618.71;5485249687;0.0404384
4618.78;5490155775;0.0381957
4618.89;5494793259;0.0364997
4618.99;5500202192;0.0341577
4619.07;5504822046;0.0319208
4619.14;5510368934;0.0295808
4619.2;5514422231;0.0278841
4619.25;5520400911;0.0262754
4619.27;5525128919;0.0245856
4619.28;5530192187;0.0222669
4619.29;5535307820;0.0201086
4619.32;5539780838;0.0185565
4619.35;5544814379;0.0167714
4619.38;5550158514;0.0151302
4619.4;5554622607;0.0136744
4619.42;5559849552;0.0121432
4619.43;5564846860;0.0106892
4619.36;5569534883;0.0085762
4619.29;5574747809;0.0069487
4619.21;5579805957;0.00550328
4619.23;5585309199;0.00527445
4619.25;5589284636;0.00480638
4619.27;5595024510;0.00452946
4619.18;5599671636;0.00360255
4619.08;5605136199;0.00235997
4618.99;5610322376;0.00242612
4618.92;5614758072;0.00333278
4618.84;5619785358;0.00428144
4618.77;5625013050;0.00528156
4618.71;5629471897;0.00595119
4618.65;5635001446;0.00699537
4618.58;5640099462;0.00797803
4618.53;5644671815;0.00882101
4618.48;5649908628;0.00963383
4618.43;5654398343;0.0103932
4618.32;5659993721;0.0116707
4618.2;5665348103;0.0121365
4618.09;5669804303;0.0125579
4617.96;5675373620;0.0131477
4617.83;5679767752;0.0147607
4617.7;5685259822;0.0163002
4617.58;5689755761;0.0175104
4617.46;5694910606;0.0176245
4617.34;5700142409;0.0177432
4617.2;5704610093;0.0179957
4617.07;5709832008;0.0185767
4616.93;5715053405;0.0191335
4616.85;5719660222;0.0191362
4616.78;5725125293;0.019329
4616.7;5729673074;0.0194874
4616.59;5735203590;0.0199324
4616.48;5739471480;0.0205457
4616.37;5745038664;0.0211256
4616.22;5749516983;0.0220923
4616.08;5754693217;0.0224457
4615.93;5759504801;0.0227697
4615.88;5765019907;0.0221005
4615.83;5770262080;0.0212812
4615.78;5775139101;0.0204662
4615.72;5779593132;0.0198481
4615.65;5784625686;0.0192978
4615.58;5790127189;0.0187402
4615.52;5795150823;0.0182094
4615.45;5799425582;0.0175154
4615.39;5805393992;0.0168218
4615.28;5809868766;0.0164961
4615.18;5814958186;0.0168078
4615.08;5820118887;0.0171938
4615.07;5824564681;0.0166814
4615.05;5829502968;0.0158875
4615.04;5834589077;0.0151344
4614.83;5840143928;0.0164726
4614.62;5845221584;0.0173558
4614.42;5850326090;0.0182278
4614.42;5854749739;0.0169561
4614.43;5859725940;0.0160639
4614.43;5864928063;0.0152053
4614.35;5869366766;0.0152872
4614.27;5874778996;0.0155715
4614.2;5880468621;0.0158491
4614.22;5885065053;0.0153693
4614.23;5890022249;0.0150893
4614.25;5895271616;0.0149033
4614.16;5899972790;0.0155342
4614.07;5905209896;0.0148467
4613.98;5910335847;0.0142001
4614;5914838658;0.0121837
4614.02;5920299622;0.0113629
4614.04;5924974108;0.0106362
4614.03;5929365877;0.0106717
4614.02;5935216028;0.0086582
4614.01;5940329621;0.00670645
4613.94;5944774156;0.00520143
4613.88;5949724776;0.00586854
4613.83;5954416398;0.00651796
4613.82;5959994231;0.00634081
4613.81;5965156375;0.00545499
4613.8;5969583666;0.00487435
4613.73;5975137781;0.00486788
4613.67;5979627596;0.00580035
4613.61;5984618044;0.0067186
4613.58;5990094894;0.00722658
4613.54;5995140951;0.00664146
4613.5;6000135110;0.00606809
4613.48;6004605959;0.00566634
4613.45;6009541454;0.00579373
4613.43;6014487763;0.00603479
4613.35;6019897378;0.00695533
4613.27;6024778118;0.00763428
4613.19;6029926410;0.00829413
4613.22;6034774670;0.00784875
4613.26;6040080073;0.00709011
4613.29;6044746493;0.00657996
4613.22;6050203461;0.00669871
4613.16;6055500073;0.00682016
4613.1;6059489431;0.00713907
4613.05;6064964117;0.00746149
4613.01;6070139750;0.00726906
4612.97;6074518588;0.00708677
4612.98;6080082999;0.00642889
4612.98;6085178641;0.00592087
4612.99;6089590412;0.00547313
4613.01;6094986774;0.00506564
4613.02;6099934882;0.00468076
4613.04;6105008615;0.00431227
4613.07;6110584824;0.00352787
4613.11;6115470073;0.00237474
4613.15;6120345519;0.00137827
4613.12;6124853345;0.000795757
4613.1;6129963140;0.00209554
4613.08;6134944995;0.00343528
4613.06;6139582309;0.00332107
4613.05;6144650578;0.00201307
4613.03;6149961155;0.0013258
4613.1;6155459690;0.000720331
4613.17;6159712592;0.00152074
4613.23;6165187307;0.0025619
4613.19;6169869312;0.00234564
4613.15;6174816549;0.00171557
4613.11;6179939162;0.00130291
4613.07;6185359082;0.001296
4613.03;6190639254;0.00179627
4612.99;6195385459;0.00250089
4613.04;6199934717;0.00240304
4613.09;6205212457;0.00104159
4613.14;6209406629;0.000423022
4613.14;6214917173;0.0014621
4613.14;6220045007;0.00199981
4613.13;6225183300;0.00253927
4613.17;6229555866;0.00266736
4613.2;6234550139;0.00160983
4613.24;6239530422;0.00210471
4613.27;6245035474;0.00305819
4613.31;6249308716;0.00273075
4613.34;6254395301;0.00241487
4613.37;6259844958;0.00217972
4613.39;6264807860;0.00227315
4613.41;6270112342;0.00268661
4613.41;6274898550;0.00311148
4613.42;6280215536;0.00352233
4613.42;6284495561;0.00391962
4613.46;6289941706;0.00470354
4613.51;6295005722;0.00464674
4613.55;6299943177;0.00458883
4613.56;6304484512;0.00423314
4613.58;6309469571;0.00438966
4613.59;6314584101;0.00454559
4613.57;6320201215;0.00437942
4613.55;6325201279;0.00412528
4613.53;6330312538;0.00424005
4613.61;6334756877;0.00481573
4613.69;6339750532;0.00496514
4613.77;6345013667;0.00516285
4613.68;6349437182;0.00428544
4613.6;6354373505;0.00385607
4613.51;6359464988;0.00377144
4613.43;6365147007;0.00402588
4613.35;6369545505;0.00515119
4613.28;6375105515;0.00633548
4613.2;6379789423;0.00753126
4613.13;6384871330;0.00806013
4613.06;6390177907;0.00869451
4613.07;6394726298;0.00895592
4613.09;6400258311;0.00941801
4613.11;6405078467;0.00987266
4613.09;6409549018;0.0106807
4613.07;6414527005;0.0105792
4613.05;6419820254;0.0104749
4612.99;6425285945;0.0100787
4612.94;6430356179;0.010948
4612.89;6435174874;0.0118778
4612.87;6439722968;0.0123932
4612.85;6445210318;0.011267
4612.83;6450173994;0.0101687
4612.77;6454659346;0.00995531
4612.71;6459920558;0.00974471
4612.66;6465406009;0.00953708
4612.67;6470051395;0.00886042
4612.68;6475163460;0.00823491
4612.69;6480272961;0.00766689
4612.71;6484732994;0.00652701
4612.74;6489774341;0.0058468
4612.77;6494869308;0.00520551
4612.69;6500315642;0.00513553
4612.63;6505346098;0.00497658
4612.56;6509394919;0.00515079
4612.53;6514839066;0.00526916
4612.5;6520313494;0.00518727
4612.47;6525298522;0.00523844
4612.53;6529832730;0.00450376
4612.58;6534964753;0.00390291
4612.63;6540068591;0.00336725
4612.66;6544528655;0.00276065
4612.68;6549716695;0.00274894
4612.71;6555256404;0.00303291
4612.78;6559859964;0.0043485
4612.85;6565194517;0.00555389
4612.92;6570073746;0.00673133
4612.96;6574514140;0.00719987
4613;6579573213;0.00699573
4613.03;6584733063;0.00679702
4612.94;6590248090;0.00601197
4612.86;6594959587;0.00529211
4612.77;6599988905;0.00458729
4612.88;6604881497;0.00505186
4612.99;6610011081;0.00559823
4613.1;6614988383;0.00644193
4613.13;6619594227;0.00690468
4613.16;6624945313;0.00676567
4613.19;6630115469;0.00663663
4613.22;6634505402;0.00619673
4613.25;6639996876;0.00615461
