######################################
30

1.4205364785747514
0.9706033917618843
0.08
5.346074712899337
4.36861423622402
0.3343071997395401
######################################
35

2.206990396697648
1.4862549271337944
0.28
7.40901177534052
7.258401081597303
0.30617477820620737
######################################
40

2.7274958715925557
1.9247906160425763
0.21
9.784824593747544
8.255255849002245
0.34176396025193384
######################################
45

3.436831945031112
2.157876788003377
0.21
11.34249083310656
9.067696786041479
0.45121416050041285
######################################