{
"label":"SEGA - MD",
"icon":"genesis_plus_gx.png",
"iconsel":"",
"launch":"launch.sh",
"rompath":"../../Roms/MD",
"imgpath":"../../Roms/MD/Imgs",
"useswap":1,
"shortname":0,
"hidebios":0,
"extlist":"gen|md|smd|32x|zip|bin|sms|rom|gg|sg"
}