{
"label":"SEGA - MD-CD",
"icon":"picodrive.png",
"iconsel":"",
"launch":"launch.sh",
"rompath":"../../Roms/MD",
"imgpath":"../../Roms/MD/Imgs",
"useswap":1,
"shortname":0,
"hidebios":0,
"extlist":"gen|md|smd|32x|zip|bin|chd"
}