{
"label":"WSC",
"icon":"ic-WSC.png",
"iconsel":"",
"launch":"launch.sh",
"rompath":"../../Roms/WS",
"imgpath":"../../Roms/WS/Imgs",
"useswap":0,
"shortname":0,
"hidebios":0,
"extlist":"wsc|ws|zip"
}
