<?xml version="1.0" encoding="UTF-8" standalone="no"?>
<svg
   width="512"
   height="512"
   viewBox="0 0 135.46666 135.46667"
   version="1.1"
   id="svg1798"
   inkscape:version="1.1.2 (0a00cf5339, 2022-02-04, custom)"
   sodipodi:docname="recbox-workflow-daily.svg"
   inkscape:export-filename="/home/recbox/Pictures/recbox/recbox-theming.png"
   inkscape:export-xdpi="96"
   inkscape:export-ydpi="96"
   xmlns:inkscape="http://www.inkscape.org/namespaces/inkscape"
   xmlns:sodipodi="http://sodipodi.sourceforge.net/DTD/sodipodi-0.dtd"
   xmlns="http://www.w3.org/2000/svg"
   xmlns:svg="http://www.w3.org/2000/svg"
   xmlns:rdf="http://www.w3.org/1999/02/22-rdf-syntax-ns#"
   xmlns:cc="http://creativecommons.org/ns#"
   xmlns:dc="http://purl.org/dc/elements/1.1/">
  <defs
     id="defs1792" />
  <sodipodi:namedview
     id="base"
     pagecolor="#ffffff"
     bordercolor="#666666"
     borderopacity="1.0"
     inkscape:pageopacity="0.0"
     inkscape:pageshadow="2"
     inkscape:zoom="0.79508709"
     inkscape:cx="13.834962"
     inkscape:cy="195.57606"
     inkscape:document-units="px"
     inkscape:current-layer="g3068"
     inkscape:document-rotation="0"
     showgrid="false"
     units="px"
     inkscape:window-width="1366"
     inkscape:window-height="736"
     inkscape:window-x="-2"
     inkscape:window-y="111"
     inkscape:window-maximized="0"
     showguides="false"
     inkscape:pagecheckerboard="0" />
  <metadata
     id="metadata1795">
    <rdf:RDF>
      <cc:Work
         rdf:about="">
        <dc:format>image/svg+xml</dc:format>
        <dc:type
           rdf:resource="http://purl.org/dc/dcmitype/StillImage" />
      </cc:Work>
    </rdf:RDF>
  </metadata>
  <g
     inkscape:label="Layer 1"
     inkscape:groupmode="layer"
     id="layer1">
    <g
       id="g3068">
      <g
         id="g3120">
        <rect
           style="fill:#e03838;fill-opacity:1;stroke-width:0.395189"
           id="rect838"
           width="119.0625"
           height="119.0625"
           x="8.2020826"
           y="8.2020826"
           ry="3.4719627" />
        <path
           id="rect984"
           style="fill:#c60000;fill-opacity:1;stroke-width:0.39519"
           d="M 122.6075,8.2020832 V 119.13588 c 0,1.92347 -1.54815,3.47162 -3.47162,3.47162 H 8.2020832 v 1.18494 c 0,1.92347 1.5486721,3.47214 3.4721398,3.47214 H 123.79244 c 1.92347,0 3.47214,-1.54867 3.47214,-3.47214 V 11.674223 c 0,-1.9234677 -1.54867,-3.4721398 -3.47214,-3.4721398 z" />
        <g
           id="g2832">
          <g
             id="g948">
            <path
               id="rect1944"
               style="fill:#e6e6e6;fill-opacity:1;stroke-width:0.39519"
               d="m 11.674223,8.2020832 c -1.9234677,0 -3.4721398,1.5486721 -3.4721398,3.4721398 v 7.422285 H 127.26458 v -7.422285 c 0,-1.9234677 -1.54867,-3.4721398 -3.47214,-3.4721398 z" />
            <g
               id="g2147"
               style="fill:#808080">
              <g
                 id="g2110"
                 transform="translate(1.4082925,17.827962)"
                 style="fill:#808080">
                <circle
                   style="fill:#808080;fill-opacity:1;stroke-width:0.117088"
                   id="circle2051"
                   cx="104.41283"
                   cy="-4.1786661"
                   r="2.8939464" />
                <rect
                   style="fill:#808080;fill-opacity:1;stroke-width:0.286579"
                   id="rect2106"
                   width="14.562676"
                   height="5.7880249"
                   x="109.13467"
                   y="-7.0726786"
                   ry="2.7786508" />
              </g>
              <g
                 id="g2138"
                 transform="translate(-5.49309,28.252756)"
                 style="fill:#808080;fill-opacity:1">
                <rect
                   style="fill:#808080;fill-opacity:1;stroke-width:0.156756"
                   id="rect2125"
                   width="7.1098671"
                   height="7.1098671"
                   x="15.687373"
                   y="-18.158394"
                   ry="1.5144747" />
                <rect
                   style="fill:#808080;fill-opacity:1;stroke-width:0.156756"
                   id="rect2127"
                   width="7.1098671"
                   height="7.1098671"
                   x="25.295868"
                   y="-18.158394"
                   ry="1.5144747" />
                <rect
                   style="fill:#808080;fill-opacity:1;stroke-width:0.156756"
                   id="rect2129"
                   width="7.1098671"
                   height="7.1098671"
                   x="34.904362"
                   y="-18.158394"
                   ry="1.5144747" />
              </g>
            </g>
          </g>
          <g
             id="g2454">
            <g
               id="g2434">
              <rect
                 style="fill:#e6e6e6;stroke-width:0.167265"
                 id="rect1350"
                 width="42.65826"
                 height="60.452831"
                 x="19.414066"
                 y="8.493125"
                 transform="matrix(0,1,1,0,0,0)"
                 ry="1.1366625" />
              <rect
                 style="fill:#f2f2f2;stroke-width:0.134794"
                 id="rect2147"
                 width="42.65826"
                 height="39.259941"
                 x="19.414066"
                 y="29.686016"
                 transform="matrix(0,1,1,0,0,0)"
                 ry="0.7381838" />
            </g>
            <g
               id="g2430">
              <g
                 id="g2145"
                 transform="translate(44.824279,-14.168643)">
                <rect
                   style="fill:#808080;stroke-width:0.264583"
                   id="rect1736"
                   width="12.759749"
                   height="2.823885"
                   x="-32.66555"
                   y="37.379166"
                   ry="1.1366632" />
                <rect
                   style="fill:#808080;stroke-width:0.264583"
                   id="rect1931"
                   width="12.759749"
                   height="2.823885"
                   x="-32.66555"
                   y="48.126316"
                   ry="1.1366632" />
                <rect
                   style="fill:#808080;stroke-width:0.264583"
                   id="rect1935"
                   width="12.759749"
                   height="2.823885"
                   x="-32.66555"
                   y="58.87347"
                   ry="1.1366632" />
                <rect
                   style="fill:#808080;stroke-width:0.264583"
                   id="rect1937"
                   width="12.759749"
                   height="2.823885"
                   x="-32.66555"
                   y="69.620628"
                   ry="1.1366632" />
              </g>
              <g
                 id="g2334"
                 transform="translate(81.886343,-0.65002728)">
                <g
                   id="g2316">
                  <rect
                     style="fill:#999999;stroke-width:0.21752"
                     id="rect2207"
                     width="13.116549"
                     height="9.8937874"
                     x="-30.460258"
                     y="50.560314"
                     ry="1.1372794" />
                  <rect
                     style="fill:#999999;stroke-width:0.21752"
                     id="rect2307"
                     width="13.116549"
                     height="9.8937874"
                     x="-30.460258"
                     y="22.332346"
                     ry="1.1372794" />
                  <rect
                     style="fill:#999999;stroke-width:0.21752"
                     id="rect2311"
                     width="13.116549"
                     height="9.8937874"
                     x="-30.460258"
                     y="36.446331"
                     ry="1.1372794" />
                </g>
                <g
                   id="g2324"
                   transform="translate(-17.336744)">
                  <rect
                     style="fill:#999999;stroke-width:0.21752"
                     id="rect2318"
                     width="13.116549"
                     height="9.8937874"
                     x="-30.460258"
                     y="50.560314"
                     ry="1.1372794" />
                  <rect
                     style="fill:#999999;stroke-width:0.21752"
                     id="rect2320"
                     width="13.116549"
                     height="9.8937874"
                     x="-30.460258"
                     y="22.332346"
                     ry="1.1372794" />
                  <rect
                     style="fill:#999999;stroke-width:0.21752"
                     id="rect2322"
                     width="13.116549"
                     height="9.8937874"
                     x="-30.460258"
                     y="36.446331"
                     ry="1.1372794" />
                </g>
              </g>
            </g>
          </g>
          <g
             id="g2783">
            <g
               id="g1348"
               transform="translate(7.9290297,37.37432)">
              <rect
                 style="fill:#e6e6e6;stroke-width:0.232094"
                 id="rect1719"
                 width="55.19453"
                 height="89.958336"
                 x="28.973936"
                 y="23.665071"
                 transform="matrix(0,1,1,0,0,0)"
                 ry="3.1618512" />
              <g
                 id="g1890"
                 transform="translate(2.3513924,7.6602567)">
                <path
                   id="rect1751"
                   style="fill:#d5d5d5;fill-opacity:1;stroke-width:0.296303"
                   d="m 24.475694,21.313428 c -1.751658,0 -3.162267,1.41061 -3.162267,3.162271 V 36.178114 H 111.27176 V 24.475699 c 0,-1.751661 -1.41009,-3.162271 -3.16175,-3.162271 z" />
                <path
                   id="path1756"
                   style="fill:#c2c2c2;fill-opacity:1;stroke-width:0.296303"
                   d="m 108.1095,21.313428 c 1.75165,0 3.16226,1.41061 3.16226,3.162271 v 4.760163 H 21.31343 v -4.760163 c 0,-1.751661 1.41009,-3.162272 3.16175,-3.162271 z" />
              </g>
              <g
                 id="g1209"
                 style="fill:#808080">
                <circle
                   style="fill:#808080;fill-opacity:1;stroke-width:0.0842746"
                   id="circle1774"
                   cx="-28.134476"
                   cy="32.934902"
                   r="2.0829306"
                   transform="scale(-1,1)" />
                <circle
                   style="fill:#808080;fill-opacity:1;stroke-width:0.0842746"
                   id="circle1807"
                   cx="109.1535"
                   cy="32.934902"
                   r="2.0829306" />
              </g>
            </g>
            <g
               id="g2764"
               transform="translate(106.85639,-11.177616)">
              <rect
                 style="fill:#4d4d4d;stroke-width:0.169977"
                 id="rect2478"
                 width="10.685178"
                 height="10.685178"
                 x="-59.563065"
                 y="99.365364"
                 ry="0.73023158" />
              <rect
                 style="fill:#4d4d4d;stroke-width:0.169977"
                 id="rect2660"
                 width="10.685178"
                 height="10.685178"
                 x="-43.604912"
                 y="99.365356"
                 ry="0.73023158" />
              <rect
                 style="fill:#4d4d4d;stroke-width:0.169977"
                 id="rect2662"
                 width="10.685178"
                 height="10.685178"
                 x="-59.563065"
                 y="115.32352"
                 ry="0.73023158" />
              <rect
                 style="fill:#4d4d4d;stroke-width:0.169977"
                 id="rect2664"
                 width="10.685178"
                 height="10.685178"
                 x="-43.604912"
                 y="115.32352"
                 ry="0.73023158" />
              <rect
                 style="fill:#4d4d4d;stroke-width:0.169977"
                 id="rect2668"
                 width="10.685178"
                 height="10.685178"
                 x="-27.646759"
                 y="99.365356"
                 ry="0.73023158" />
              <rect
                 style="fill:#4d4d4d;stroke-width:0.169977"
                 id="rect2670"
                 width="10.685178"
                 height="10.685178"
                 x="-27.646759"
                 y="115.32352"
                 ry="0.73023158" />
              <rect
                 style="fill:#4d4d4d;stroke-width:0.169977"
                 id="rect2672"
                 width="10.685178"
                 height="10.685178"
                 x="-11.688606"
                 y="99.365356"
                 ry="0.73023158" />
              <rect
                 style="fill:#4d4d4d;stroke-width:0.169977"
                 id="rect2674"
                 width="10.685178"
                 height="10.685178"
                 x="-11.688606"
                 y="115.32352"
                 ry="0.73023158" />
            </g>
          </g>
        </g>
      </g>
    </g>
  </g>
</svg>
