<?xml version="1.0" encoding="UTF-8" standalone="no"?>
<svg
   width="24"
   height="24"
   viewBox="0 0 6.3499997 6.3500002"
   version="1.1"
   id="svg1798"
   inkscape:version="1.1.2 (0a00cf5339, 2022-02-04)"
   sodipodi:docname="recbox-studio-backup.svg"
   inkscape:export-filename="/home/recbox/Pictures/recbox/recbox-theming.png"
   inkscape:export-xdpi="96"
   inkscape:export-ydpi="96"
   xmlns:inkscape="http://www.inkscape.org/namespaces/inkscape"
   xmlns:sodipodi="http://sodipodi.sourceforge.net/DTD/sodipodi-0.dtd"
   xmlns="http://www.w3.org/2000/svg"
   xmlns:svg="http://www.w3.org/2000/svg"
   xmlns:rdf="http://www.w3.org/1999/02/22-rdf-syntax-ns#"
   xmlns:cc="http://creativecommons.org/ns#"
   xmlns:dc="http://purl.org/dc/elements/1.1/">
  <defs
     id="defs1792" />
  <sodipodi:namedview
     id="base"
     pagecolor="#ffffff"
     bordercolor="#666666"
     borderopacity="1.0"
     inkscape:pageopacity="0.0"
     inkscape:pageshadow="2"
     inkscape:zoom="13.96966"
     inkscape:cx="21.188776"
     inkscape:cy="14.137782"
     inkscape:document-units="px"
     inkscape:current-layer="layer1"
     inkscape:document-rotation="0"
     showgrid="false"
     units="px"
     inkscape:window-width="1366"
     inkscape:window-height="736"
     inkscape:window-x="0"
     inkscape:window-y="32"
     inkscape:window-maximized="1"
     showguides="false"
     inkscape:pagecheckerboard="0" />
  <metadata
     id="metadata1795">
    <rdf:RDF>
      <cc:Work
         rdf:about="">
        <dc:format>image/svg+xml</dc:format>
        <dc:type
           rdf:resource="http://purl.org/dc/dcmitype/StillImage" />
      </cc:Work>
    </rdf:RDF>
  </metadata>
  <g
     inkscape:label="Layer 1"
     inkscape:groupmode="layer"
     id="layer1">
    <g
       id="g1058"
       transform="matrix(0.046875,0,0,0.046875,2.5992202e-6,2.5992202e-6)">
      <rect
         style="fill:#e03838;fill-opacity:1;stroke-width:0.360867"
         id="rect838"
         width="119.0625"
         height="99.279594"
         x="8.2020836"
         y="27.984995"
         ry="2.8950765" />
      <g
         id="g1223">
        <rect
           style="fill:#843333;fill-opacity:1;stroke-width:0.305307"
           id="rect1010"
           width="75.065514"
           height="112.71324"
           x="8.2020836"
           y="14.551343"
           ry="3.0744557" />
        <g
           id="g1210">
          <rect
             style="fill:#f2f2f2;stroke-width:0.170089"
             id="rect1012"
             width="81.192146"
             height="41.644669"
             x="28.922203"
             y="33.965744"
             ry="0"
             transform="rotate(-11.200136)" />
          <g
             id="g1199">
            <g
               id="g1193">
              <path
                 id="rect1042"
                 style="fill:#e03838;fill-opacity:1;stroke-width:1.36391"
                 d="m 41.941406,105.76953 c -0.757735,0 -1.497355,0.0774 -2.210937,0.22266 0.713565,-0.14527 1.453202,-0.22071 2.210937,-0.22071 h 16.041016 c -6.06189,0 -10.941406,4.87953 -10.941406,10.94141 V 463.91602 H 481 V 116.71289 c 0,-6.06188 -4.87953,-10.94336 -10.94141,-10.94336 z"
                 transform="scale(0.26458333)" />
              <path
                 id="rect895"
                 style="fill:#a74040;fill-opacity:1;stroke-width:0.360868"
                 d="m 8.2020832,122.74445 v 1.62522 c 0,1.60387 1.2910413,2.89491 2.8949138,2.89491 H 124.36967 c 1.60387,0 2.89491,-1.29104 2.89491,-2.89491 v -1.62522 z" />
            </g>
            <path
               id="rect840"
               style="fill:#511b1b;fill-opacity:1;stroke-width:0.360868"
               d="m 11.096998,27.985369 c -1.6038721,0 -2.8949144,1.29104 -2.8949144,2.894912 v 93.489379 c 0,1.60388 1.2910423,2.89492 2.8949144,2.89492 h 4.244187 c -1.603875,0 -2.894915,-1.29104 -2.894915,-2.89492 V 30.880281 c 0,-1.603872 1.29104,-2.894912 2.894915,-2.894912 z" />
          </g>
          <g
             id="g1040"
             transform="matrix(0.79574737,0,0,0.79574737,105.88951,67.041887)">
            <path
               id="path1013"
               style="fill:#e6e6e6;fill-opacity:1;stroke-width:0.999999"
               d="m -165.08398,-83.277344 a 122.80815,122.80815 0 0 0 -122.79883,122.806641 122.80815,122.80815 0 0 0 0.0566,3.738281 l 20.83008,-12.02539 A 102.26035,102.26035 0 0 1 -165.07422,-62.730469 102.26035,102.26035 0 0 1 -62.814453,39.529297 102.26035,102.26035 0 0 1 -165.07422,141.79102 102.26035,102.26035 0 0 1 -254.43945,89.236328 l -17.79883,10.275391 A 122.80815,122.80815 0 0 0 -165.07422,162.33789 122.80815,122.80815 0 0 0 -42.265625,39.529297 122.80815,122.80815 0 0 0 -165.07422,-83.277344 a 122.80815,122.80815 0 0 0 -0.01,0 z"
               transform="scale(0.26458333)" />
            <path
               id="path1025"
               style="fill:#e6e6e6;fill-opacity:1;stroke-width:0.200651"
               d="M -75.433524,17.404787 -60.682769,2.5155098 -81.814592,1.1251186 Z"
               sodipodi:nodetypes="cccc" />
          </g>
        </g>
      </g>
    </g>
  </g>
</svg>
