EESchema Schematic File Version 4
EELAYER 30 0
EELAYER END
$Descr A4 11693 8268
encoding utf-8
Sheet 1 1
Title ""
Date ""
Rev ""
Comp ""
Comment1 ""
Comment2 ""
Comment3 ""
Comment4 ""
$EndDescr
$Comp
L power:GND #PWR0101
U 1 1 61F7E869
P 2000 2100
F 0 "#PWR0101" H 2000 1850 50  0001 C CNN
F 1 "GND" H 2005 1927 50  0000 C CNN
F 2 "" H 2000 2100 50  0001 C CNN
F 3 "" H 2000 2100 50  0001 C CNN
	1    2000 2100
	1    0    0    -1  
$EndComp
$Comp
L Connector_Generic:Conn_01x02 J2
U 1 1 61F7F73B
P 1800 2000
F 0 "J2" H 1718 2217 50  0000 C CNN
F 1 "Battery" H 1850 2100 50  0000 C CNN
F 2 "Pin_Headers:Pin_Header_Straight_1x02_Pitch2.54mm" H 1800 2000 50  0001 C CNN
F 3 "~" H 1800 2000 50  0001 C CNN
	1    1800 2000
	-1   0    0    -1  
$EndComp
$Comp
L Switch:SW_SPST SW1
U 1 1 61F800FE
P 2400 2000
F 0 "SW1" H 2400 2235 50  0000 C CNN
F 1 "on/off" H 2400 2144 50  0000 C CNN
F 2 "Pin_Headers:Pin_Header_Straight_1x02_Pitch2.54mm" H 2400 2000 50  0001 C CNN
F 3 "~" H 2400 2000 50  0001 C CNN
	1    2400 2000
	1    0    0    -1  
$EndComp
Wire Wire Line
	2000 2000 2150 2000
Wire Wire Line
	2600 2000 2850 2000
$Comp
L power:GND #PWR0122
U 1 1 61FCA4B0
P 2850 2100
F 0 "#PWR0122" H 2850 1850 50  0001 C CNN
F 1 "GND" H 2855 1927 50  0000 C CNN
F 2 "" H 2850 2100 50  0001 C CNN
F 3 "" H 2850 2100 50  0001 C CNN
	1    2850 2100
	1    0    0    -1  
$EndComp
$Comp
L power:GND #PWR0123
U 1 1 61FCC284
P 2800 2900
F 0 "#PWR0123" H 2800 2650 50  0001 C CNN
F 1 "GND" H 2805 2727 50  0000 C CNN
F 2 "" H 2800 2900 50  0001 C CNN
F 3 "" H 2800 2900 50  0001 C CNN
	1    2800 2900
	1    0    0    -1  
$EndComp
Wire Wire Line
	2150 2000 2150 3200
Wire Wire Line
	2150 3200 2800 3200
Connection ~ 2150 2000
Wire Wire Line
	2150 2000 2200 2000
$Comp
L Device:R R1
U 1 1 61FCD235
P 2150 3350
F 0 "R1" H 2220 3396 50  0000 L CNN
F 1 "2k7" H 2220 3305 50  0000 L CNN
F 2 "Resistors_THT:R_Axial_DIN0207_L6.3mm_D2.5mm_P7.62mm_Horizontal" V 2080 3350 50  0001 C CNN
F 3 "~" H 2150 3350 50  0001 C CNN
	1    2150 3350
	1    0    0    -1  
$EndComp
Connection ~ 2150 3200
$Comp
L Device:R R2
U 1 1 61FCD60F
P 2150 3650
F 0 "R2" H 2220 3696 50  0000 L CNN
F 1 "1k" H 2220 3605 50  0000 L CNN
F 2 "Resistors_THT:R_Axial_DIN0207_L6.3mm_D2.5mm_P7.62mm_Horizontal" V 2080 3650 50  0001 C CNN
F 3 "~" H 2150 3650 50  0001 C CNN
	1    2150 3650
	1    0    0    -1  
$EndComp
$Comp
L power:GND #PWR0125
U 1 1 61FCD7D6
P 2150 3800
F 0 "#PWR0125" H 2150 3550 50  0001 C CNN
F 1 "GND" H 2155 3627 50  0000 C CNN
F 2 "" H 2150 3800 50  0001 C CNN
F 3 "" H 2150 3800 50  0001 C CNN
	1    2150 3800
	1    0    0    -1  
$EndComp
Wire Wire Line
	2150 3500 3000 3500
Connection ~ 2150 3500
Text Label 3000 3500 0    50   ~ 0
VBatt
Wire Wire Line
	4300 2000 4300 2100
NoConn ~ 3850 3200
$Comp
L breakouts:USB-BattCharger B1
U 1 1 61FC0F18
P 3350 3050
F 0 "B1" H 3325 3425 50  0000 C CNN
F 1 "USB-BattCharger" H 3325 3334 50  0000 C CNN
F 2 "breakouts:USB-BattCharger" H 3350 3050 50  0001 C CNN
F 3 "" H 3350 3050 50  0001 C CNN
	1    3350 3050
	1    0    0    -1  
$EndComp
NoConn ~ 3850 2900
$Comp
L Connector_Generic:Conn_01x06 J1
U 1 1 6201D621
P 4500 1900
F 0 "J1" H 4580 1892 50  0000 L CNN
F 1 "connect" H 4580 1801 50  0000 L CNN
F 2 "Pin_Headers:Pin_Header_Straight_2x03_Pitch2.54mm" H 4500 1900 50  0001 C CNN
F 3 "~" H 4500 1900 50  0001 C CNN
	1    4500 1900
	1    0    0    -1  
$EndComp
Wire Wire Line
	4300 1900 4300 1800
Connection ~ 4300 1800
Text Label 4300 2200 2    50   ~ 0
VBatt
Wire Wire Line
	4300 1800 4300 1700
$Comp
L power:GND #PWR0102
U 1 1 62027F64
P 4300 1650
F 0 "#PWR0102" H 4300 1400 50  0001 C CNN
F 1 "GND" H 4305 1477 50  0000 C CNN
F 2 "" H 4300 1650 50  0001 C CNN
F 3 "" H 4300 1650 50  0001 C CNN
	1    4300 1650
	-1   0    0    1   
$EndComp
Wire Wire Line
	4300 1650 4300 1700
Connection ~ 4300 1700
$Comp
L breakouts:SX1308-StepUp U1
U 1 1 61FEB9C4
P 3250 2050
F 0 "U1" H 3275 2325 50  0000 C CNN
F 1 "SX1308-StepUp" H 3275 2234 50  0000 C CNN
F 2 "breakouts:SX1308" H 3250 2050 50  0001 C CNN
F 3 "" H 3250 2050 50  0001 C CNN
	1    3250 2050
	1    0    0    -1  
$EndComp
Wire Wire Line
	4300 2000 3700 2000
Connection ~ 4300 2000
Wire Wire Line
	3700 2100 3950 2100
Wire Wire Line
	3950 2100 3950 1900
Wire Wire Line
	3950 1900 4300 1900
Connection ~ 4300 1900
$EndSCHEMATC
