(module SX1308 (layer F.Cu) (tedit 61FEB1AE)
  (fp_text reference REF** (at 0 6.75) (layer F.SilkS)
    (effects (font (size 1 1) (thickness 0.15)))
  )
  (fp_text value SX1308 (at 0 -7) (layer F.Fab)
    (effects (font (size 1 1) (thickness 0.15)))
  )
  (fp_line (start -11.5 8) (end 11.5 8) (layer F.SilkS) (width 0.15))
  (fp_line (start -11.5 -8) (end -11.5 8) (layer F.SilkS) (width 0.15))
  (fp_line (start 11.5 8) (end 11.5 -8) (layer F.SilkS) (width 0.15))
  (fp_line (start 11.5 -8) (end -11.5 -8) (layer F.SilkS) (width 0.15))
  (fp_text user VIn (at -9 -2.25) (layer F.SilkS)
    (effects (font (size 1 1) (thickness 0.15)))
  )
  (fp_text user VOut (at 9 -2.25) (layer F.SilkS)
    (effects (font (size 1 1) (thickness 0.15)))
  )
  (pad 1 thru_hole rect (at -9 -5.25) (size 4 4) (drill 1.5) (layers *.Cu *.Mask))
  (pad 2 thru_hole rect (at -9 5.25) (size 4 4) (drill 1.5) (layers *.Cu *.Mask))
  (pad 3 thru_hole rect (at 9 5.25) (size 4 4) (drill 1.5) (layers *.Cu *.Mask))
  (pad 4 thru_hole rect (at 9 -5.25) (size 4 4) (drill 1.5) (layers *.Cu *.Mask))
)
