EESchema Schematic File Version 4
EELAYER 30 0
EELAYER END
$Descr A4 11693 8268
encoding utf-8
Sheet 1 1
Title ""
Date ""
Rev ""
Comp ""
Comment1 ""
Comment2 ""
Comment3 ""
Comment4 ""
$EndDescr
$Comp
L MCU_Module:WeMos_D1_mini U2
U 1 1 62001681
P 7350 4000
F 0 "U2" H 7100 3250 50  0000 C CNN
F 1 "WeMos_D1_mini" H 7750 3250 50  0000 C CNN
F 2 "wemos_d1_mini:D1_mini_board" H 7350 2850 50  0001 C CNN
F 3 "https://wiki.wemos.cc/products:d1:d1_mini#documentation" H 5500 2850 50  0001 C CNN
	1    7350 4000
	1    0    0    -1  
$EndComp
$Comp
L Switch:SW_SPST SW10
U 1 1 62004AFD
P 10250 1650
F 0 "SW10" V 10204 1748 50  0000 L CNN
F 1 "Shift" V 10295 1748 50  0000 L CNN
F 2 "Pin_Headers:Pin_Header_Straight_1x02_Pitch2.54mm" H 10250 1650 50  0001 C CNN
F 3 "~" H 10250 1650 50  0001 C CNN
	1    10250 1650
	0    1    1    0   
$EndComp
$Comp
L 74xx:74HC165 U1
U 1 1 6200B0CF
P 5500 4000
F 0 "U1" H 5300 3150 50  0000 C CNN
F 1 "74HC165" H 5700 3150 50  0000 C CNN
F 2 "Housings_DIP:DIP-16_W7.62mm_Socket" H 5500 4000 50  0001 C CNN
F 3 "https://assets.nexperia.com/documents/data-sheet/74HC_HCT165.pdf" H 5500 4000 50  0001 C CNN
	1    5500 4000
	1    0    0    -1  
$EndComp
Text Label 5000 4600 2    50   ~ 0
CLK
Text Label 6000 3500 0    50   ~ 0
DATA
Text Label 7750 4200 0    50   ~ 0
DATA
Text Label 7750 4100 0    50   ~ 0
CLK
Text Label 7750 4400 0    50   ~ 0
PL
Text Label 7750 3800 0    50   ~ 0
CTRL
Text Label 7750 3700 0    50   ~ 0
Shift
Text Label 5000 4400 2    50   ~ 0
PL
$Comp
L power:GND #PWR0101
U 1 1 6200F8F7
P 5500 5000
F 0 "#PWR0101" H 5500 4750 50  0001 C CNN
F 1 "GND" H 5505 4827 50  0000 C CNN
F 2 "" H 5500 5000 50  0001 C CNN
F 3 "" H 5500 5000 50  0001 C CNN
	1    5500 5000
	1    0    0    -1  
$EndComp
$Comp
L power:GND #PWR0102
U 1 1 6200FAB9
P 7350 4800
F 0 "#PWR0102" H 7350 4550 50  0001 C CNN
F 1 "GND" H 7355 4627 50  0000 C CNN
F 2 "" H 7350 4800 50  0001 C CNN
F 3 "" H 7350 4800 50  0001 C CNN
	1    7350 4800
	1    0    0    -1  
$EndComp
$Comp
L Device:LED D1
U 1 1 62010754
P 8100 4000
F 0 "D1" H 8093 3745 50  0000 C CNN
F 1 "Status" H 8093 3836 50  0000 C CNN
F 2 "LEDs:LED_D3.0mm" H 8100 4000 50  0001 C CNN
F 3 "~" H 8100 4000 50  0001 C CNN
	1    8100 4000
	-1   0    0    1   
$EndComp
$Comp
L Device:R R9
U 1 1 62010C65
P 8400 4000
F 0 "R9" V 8193 4000 50  0000 C CNN
F 1 "220" V 8284 4000 50  0000 C CNN
F 2 "Resistors_THT:R_Axial_DIN0207_L6.3mm_D2.5mm_P7.62mm_Horizontal" V 8330 4000 50  0001 C CNN
F 3 "~" H 8400 4000 50  0001 C CNN
	1    8400 4000
	0    1    1    0   
$EndComp
$Comp
L power:GND #PWR0103
U 1 1 620118E5
P 8550 4100
F 0 "#PWR0103" H 8550 3850 50  0001 C CNN
F 1 "GND" H 8555 3927 50  0000 C CNN
F 2 "" H 8550 4100 50  0001 C CNN
F 3 "" H 8550 4100 50  0001 C CNN
	1    8550 4100
	1    0    0    -1  
$EndComp
Wire Wire Line
	7750 4000 7950 4000
Wire Wire Line
	8550 4100 8550 4000
$Comp
L Device:LED D3
U 1 1 62019ADF
P 9850 1600
F 0 "D3" V 9889 1482 50  0000 R CNN
F 1 "Shift" V 9798 1482 50  0000 R CNN
F 2 "LEDs:LED_D3.0mm" H 9850 1600 50  0001 C CNN
F 3 "~" H 9850 1600 50  0001 C CNN
	1    9850 1600
	0    -1   -1   0   
$EndComp
$Comp
L Device:R R12
U 1 1 62019AE5
P 9850 1900
F 0 "R12" V 9643 1900 50  0000 C CNN
F 1 "220" V 9734 1900 50  0000 C CNN
F 2 "Resistors_THT:R_Axial_DIN0207_L6.3mm_D2.5mm_P7.62mm_Horizontal" V 9780 1900 50  0001 C CNN
F 3 "~" H 9850 1900 50  0001 C CNN
	1    9850 1900
	-1   0    0    1   
$EndComp
$Comp
L Device:R R13
U 1 1 62019E0B
P 10250 1300
F 0 "R13" H 10320 1346 50  0000 L CNN
F 1 "3k3" H 10320 1255 50  0000 L CNN
F 2 "Resistors_THT:R_Axial_DIN0207_L6.3mm_D2.5mm_P7.62mm_Horizontal" V 10180 1300 50  0001 C CNN
F 3 "~" H 10250 1300 50  0001 C CNN
	1    10250 1300
	1    0    0    -1  
$EndComp
Wire Wire Line
	10250 1450 9850 1450
Connection ~ 10250 1450
Connection ~ 9850 1450
Wire Wire Line
	9850 1450 9700 1450
Text Label 9700 1450 2    50   ~ 0
Shift
$Comp
L power:GND #PWR0104
U 1 1 6201BE98
P 9850 2050
F 0 "#PWR0104" H 9850 1800 50  0001 C CNN
F 1 "GND" H 9855 1877 50  0000 C CNN
F 2 "" H 9850 2050 50  0001 C CNN
F 3 "" H 9850 2050 50  0001 C CNN
	1    9850 2050
	1    0    0    -1  
$EndComp
$Comp
L power:GND #PWR0105
U 1 1 6201C234
P 10250 2050
F 0 "#PWR0105" H 10250 1800 50  0001 C CNN
F 1 "GND" H 10255 1877 50  0000 C CNN
F 2 "" H 10250 2050 50  0001 C CNN
F 3 "" H 10250 2050 50  0001 C CNN
	1    10250 2050
	1    0    0    -1  
$EndComp
Wire Wire Line
	10250 1850 10250 2050
$Comp
L power:+3V3 #PWR0106
U 1 1 6201CB12
P 7450 3200
F 0 "#PWR0106" H 7450 3050 50  0001 C CNN
F 1 "+3V3" H 7465 3373 50  0000 C CNN
F 2 "" H 7450 3200 50  0001 C CNN
F 3 "" H 7450 3200 50  0001 C CNN
	1    7450 3200
	1    0    0    -1  
$EndComp
$Comp
L power:+3V3 #PWR0107
U 1 1 6201CF10
P 5500 3100
F 0 "#PWR0107" H 5500 2950 50  0001 C CNN
F 1 "+3V3" H 5515 3273 50  0000 C CNN
F 2 "" H 5500 3100 50  0001 C CNN
F 3 "" H 5500 3100 50  0001 C CNN
	1    5500 3100
	1    0    0    -1  
$EndComp
$Comp
L power:+3V3 #PWR0108
U 1 1 6201E3A0
P 10250 1150
F 0 "#PWR0108" H 10250 1000 50  0001 C CNN
F 1 "+3V3" H 10265 1323 50  0000 C CNN
F 2 "" H 10250 1150 50  0001 C CNN
F 3 "" H 10250 1150 50  0001 C CNN
	1    10250 1150
	1    0    0    -1  
$EndComp
$Comp
L Switch:SW_SPST SW9
U 1 1 6202564F
P 9100 1650
F 0 "SW9" V 9054 1748 50  0000 L CNN
F 1 "CTRL" V 9145 1748 50  0000 L CNN
F 2 "Pin_Headers:Pin_Header_Straight_1x02_Pitch2.54mm" H 9100 1650 50  0001 C CNN
F 3 "~" H 9100 1650 50  0001 C CNN
	1    9100 1650
	0    1    1    0   
$EndComp
$Comp
L Device:LED D2
U 1 1 62025655
P 8700 1600
F 0 "D2" V 8739 1482 50  0000 R CNN
F 1 "CTRL" V 8648 1482 50  0000 R CNN
F 2 "LEDs:LED_D3.0mm" H 8700 1600 50  0001 C CNN
F 3 "~" H 8700 1600 50  0001 C CNN
	1    8700 1600
	0    -1   -1   0   
$EndComp
$Comp
L Device:R R10
U 1 1 6202565B
P 8700 1900
F 0 "R10" V 8493 1900 50  0000 C CNN
F 1 "220" V 8584 1900 50  0000 C CNN
F 2 "Resistors_THT:R_Axial_DIN0207_L6.3mm_D2.5mm_P7.62mm_Horizontal" V 8630 1900 50  0001 C CNN
F 3 "~" H 8700 1900 50  0001 C CNN
	1    8700 1900
	-1   0    0    1   
$EndComp
$Comp
L Device:R R11
U 1 1 62025661
P 9100 1300
F 0 "R11" H 9170 1346 50  0000 L CNN
F 1 "3k3" H 9170 1255 50  0000 L CNN
F 2 "Resistors_THT:R_Axial_DIN0207_L6.3mm_D2.5mm_P7.62mm_Horizontal" V 9030 1300 50  0001 C CNN
F 3 "~" H 9100 1300 50  0001 C CNN
	1    9100 1300
	1    0    0    -1  
$EndComp
Wire Wire Line
	9100 1450 8700 1450
Connection ~ 9100 1450
Connection ~ 8700 1450
Wire Wire Line
	8700 1450 8550 1450
Text Label 8550 1450 2    50   ~ 0
CTRL
$Comp
L power:GND #PWR0109
U 1 1 6202566C
P 8700 2050
F 0 "#PWR0109" H 8700 1800 50  0001 C CNN
F 1 "GND" H 8705 1877 50  0000 C CNN
F 2 "" H 8700 2050 50  0001 C CNN
F 3 "" H 8700 2050 50  0001 C CNN
	1    8700 2050
	1    0    0    -1  
$EndComp
$Comp
L power:GND #PWR0110
U 1 1 62025672
P 9100 2050
F 0 "#PWR0110" H 9100 1800 50  0001 C CNN
F 1 "GND" H 9105 1877 50  0000 C CNN
F 2 "" H 9100 2050 50  0001 C CNN
F 3 "" H 9100 2050 50  0001 C CNN
	1    9100 2050
	1    0    0    -1  
$EndComp
Wire Wire Line
	9100 1850 9100 2050
$Comp
L power:+3V3 #PWR0111
U 1 1 62025679
P 9100 1150
F 0 "#PWR0111" H 9100 1000 50  0001 C CNN
F 1 "+3V3" H 9115 1323 50  0000 C CNN
F 2 "" H 9100 1150 50  0001 C CNN
F 3 "" H 9100 1150 50  0001 C CNN
	1    9100 1150
	1    0    0    -1  
$EndComp
$Comp
L Switch:SW_SPST SW1
U 1 1 62034830
P 1050 1850
F 0 "SW1" V 1004 1948 50  0000 L CNN
F 1 "DOWN" V 1095 1948 50  0000 L CNN
F 2 "Buttons_Switches_THT:SW_PUSH_6mm" H 1050 1850 50  0001 C CNN
F 3 "~" H 1050 1850 50  0001 C CNN
	1    1050 1850
	0    1    1    0   
$EndComp
$Comp
L Device:R R1
U 1 1 62034836
P 1050 1500
F 0 "R1" H 1120 1546 50  0000 L CNN
F 1 "3k3" H 1120 1455 50  0000 L CNN
F 2 "Resistors_THT:R_Axial_DIN0207_L6.3mm_D2.5mm_P7.62mm_Horizontal" V 980 1500 50  0001 C CNN
F 3 "~" H 1050 1500 50  0001 C CNN
	1    1050 1500
	1    0    0    -1  
$EndComp
$Comp
L power:GND #PWR0112
U 1 1 6203483E
P 1050 2250
F 0 "#PWR0112" H 1050 2000 50  0001 C CNN
F 1 "GND" H 1055 2077 50  0000 C CNN
F 2 "" H 1050 2250 50  0001 C CNN
F 3 "" H 1050 2250 50  0001 C CNN
	1    1050 2250
	1    0    0    -1  
$EndComp
Wire Wire Line
	1050 2050 1050 2250
$Comp
L power:+3V3 #PWR0113
U 1 1 62034845
P 1050 1350
F 0 "#PWR0113" H 1050 1200 50  0001 C CNN
F 1 "+3V3" H 1065 1523 50  0000 C CNN
F 2 "" H 1050 1350 50  0001 C CNN
F 3 "" H 1050 1350 50  0001 C CNN
	1    1050 1350
	1    0    0    -1  
$EndComp
Wire Wire Line
	1050 1650 1400 1650
Connection ~ 1050 1650
Text Label 1400 1650 0    50   ~ 0
SW1
$Comp
L Switch:SW_SPST SW3
U 1 1 6203A3D9
P 1850 1850
F 0 "SW3" V 1804 1948 50  0000 L CNN
F 1 "RIGHT" V 1895 1948 50  0000 L CNN
F 2 "Buttons_Switches_THT:SW_PUSH_6mm" H 1850 1850 50  0001 C CNN
F 3 "~" H 1850 1850 50  0001 C CNN
	1    1850 1850
	0    1    1    0   
$EndComp
$Comp
L Device:R R3
U 1 1 6203A3DF
P 1850 1500
F 0 "R3" H 1920 1546 50  0000 L CNN
F 1 "3k3" H 1920 1455 50  0000 L CNN
F 2 "Resistors_THT:R_Axial_DIN0207_L6.3mm_D2.5mm_P7.62mm_Horizontal" V 1780 1500 50  0001 C CNN
F 3 "~" H 1850 1500 50  0001 C CNN
	1    1850 1500
	1    0    0    -1  
$EndComp
$Comp
L power:GND #PWR0114
U 1 1 6203A3E5
P 1850 2250
F 0 "#PWR0114" H 1850 2000 50  0001 C CNN
F 1 "GND" H 1855 2077 50  0000 C CNN
F 2 "" H 1850 2250 50  0001 C CNN
F 3 "" H 1850 2250 50  0001 C CNN
	1    1850 2250
	1    0    0    -1  
$EndComp
Wire Wire Line
	1850 2050 1850 2250
$Comp
L power:+3V3 #PWR0115
U 1 1 6203A3EC
P 1850 1350
F 0 "#PWR0115" H 1850 1200 50  0001 C CNN
F 1 "+3V3" H 1865 1523 50  0000 C CNN
F 2 "" H 1850 1350 50  0001 C CNN
F 3 "" H 1850 1350 50  0001 C CNN
	1    1850 1350
	1    0    0    -1  
$EndComp
Wire Wire Line
	1850 1650 2200 1650
Connection ~ 1850 1650
Text Label 2200 1650 0    50   ~ 0
SW2
$Comp
L Switch:SW_SPST SW5
U 1 1 6203D831
P 2650 1850
F 0 "SW5" V 2604 1948 50  0000 L CNN
F 1 "LEFT" V 2695 1948 50  0000 L CNN
F 2 "Buttons_Switches_THT:SW_PUSH_6mm" H 2650 1850 50  0001 C CNN
F 3 "~" H 2650 1850 50  0001 C CNN
	1    2650 1850
	0    1    1    0   
$EndComp
$Comp
L Device:R R5
U 1 1 6203D837
P 2650 1500
F 0 "R5" H 2720 1546 50  0000 L CNN
F 1 "3k3" H 2720 1455 50  0000 L CNN
F 2 "Resistors_THT:R_Axial_DIN0207_L6.3mm_D2.5mm_P7.62mm_Horizontal" V 2580 1500 50  0001 C CNN
F 3 "~" H 2650 1500 50  0001 C CNN
	1    2650 1500
	1    0    0    -1  
$EndComp
$Comp
L power:GND #PWR0116
U 1 1 6203D83D
P 2650 2250
F 0 "#PWR0116" H 2650 2000 50  0001 C CNN
F 1 "GND" H 2655 2077 50  0000 C CNN
F 2 "" H 2650 2250 50  0001 C CNN
F 3 "" H 2650 2250 50  0001 C CNN
	1    2650 2250
	1    0    0    -1  
$EndComp
Wire Wire Line
	2650 2050 2650 2250
$Comp
L power:+3V3 #PWR0117
U 1 1 6203D844
P 2650 1350
F 0 "#PWR0117" H 2650 1200 50  0001 C CNN
F 1 "+3V3" H 2665 1523 50  0000 C CNN
F 2 "" H 2650 1350 50  0001 C CNN
F 3 "" H 2650 1350 50  0001 C CNN
	1    2650 1350
	1    0    0    -1  
$EndComp
Wire Wire Line
	2650 1650 3000 1650
Connection ~ 2650 1650
Text Label 3000 1650 0    50   ~ 0
SW3
$Comp
L Switch:SW_SPST SW7
U 1 1 6203D84D
P 3450 1850
F 0 "SW7" V 3404 1948 50  0000 L CNN
F 1 "UP" V 3495 1948 50  0000 L CNN
F 2 "Buttons_Switches_THT:SW_PUSH_6mm" H 3450 1850 50  0001 C CNN
F 3 "~" H 3450 1850 50  0001 C CNN
	1    3450 1850
	0    1    1    0   
$EndComp
$Comp
L Device:R R7
U 1 1 6203D853
P 3450 1500
F 0 "R7" H 3520 1546 50  0000 L CNN
F 1 "3k3" H 3520 1455 50  0000 L CNN
F 2 "Resistors_THT:R_Axial_DIN0207_L6.3mm_D2.5mm_P7.62mm_Horizontal" V 3380 1500 50  0001 C CNN
F 3 "~" H 3450 1500 50  0001 C CNN
	1    3450 1500
	1    0    0    -1  
$EndComp
$Comp
L power:GND #PWR0118
U 1 1 6203D859
P 3450 2250
F 0 "#PWR0118" H 3450 2000 50  0001 C CNN
F 1 "GND" H 3455 2077 50  0000 C CNN
F 2 "" H 3450 2250 50  0001 C CNN
F 3 "" H 3450 2250 50  0001 C CNN
	1    3450 2250
	1    0    0    -1  
$EndComp
Wire Wire Line
	3450 2050 3450 2250
$Comp
L power:+3V3 #PWR0119
U 1 1 6203D860
P 3450 1350
F 0 "#PWR0119" H 3450 1200 50  0001 C CNN
F 1 "+3V3" H 3465 1523 50  0000 C CNN
F 2 "" H 3450 1350 50  0001 C CNN
F 3 "" H 3450 1350 50  0001 C CNN
	1    3450 1350
	1    0    0    -1  
$EndComp
Wire Wire Line
	3450 1650 3800 1650
Connection ~ 3450 1650
Text Label 3800 1650 0    50   ~ 0
SW4
$Comp
L Switch:SW_SPST SW2
U 1 1 62042D43
P 1050 3400
F 0 "SW2" V 1004 3498 50  0000 L CNN
F 1 "A" V 1095 3498 50  0000 L CNN
F 2 "Buttons_Switches_THT:SW_PUSH_6mm" H 1050 3400 50  0001 C CNN
F 3 "~" H 1050 3400 50  0001 C CNN
	1    1050 3400
	0    1    1    0   
$EndComp
$Comp
L Device:R R2
U 1 1 62042D49
P 1050 3050
F 0 "R2" H 1120 3096 50  0000 L CNN
F 1 "3k3" H 1120 3005 50  0000 L CNN
F 2 "Resistors_THT:R_Axial_DIN0207_L6.3mm_D2.5mm_P7.62mm_Horizontal" V 980 3050 50  0001 C CNN
F 3 "~" H 1050 3050 50  0001 C CNN
	1    1050 3050
	1    0    0    -1  
$EndComp
$Comp
L power:GND #PWR0120
U 1 1 62042D4F
P 1050 3800
F 0 "#PWR0120" H 1050 3550 50  0001 C CNN
F 1 "GND" H 1055 3627 50  0000 C CNN
F 2 "" H 1050 3800 50  0001 C CNN
F 3 "" H 1050 3800 50  0001 C CNN
	1    1050 3800
	1    0    0    -1  
$EndComp
Wire Wire Line
	1050 3600 1050 3800
$Comp
L power:+3V3 #PWR0121
U 1 1 62042D56
P 1050 2900
F 0 "#PWR0121" H 1050 2750 50  0001 C CNN
F 1 "+3V3" H 1065 3073 50  0000 C CNN
F 2 "" H 1050 2900 50  0001 C CNN
F 3 "" H 1050 2900 50  0001 C CNN
	1    1050 2900
	1    0    0    -1  
$EndComp
Wire Wire Line
	1050 3200 1400 3200
Connection ~ 1050 3200
Text Label 1400 3200 0    50   ~ 0
SW5
$Comp
L Switch:SW_SPST SW4
U 1 1 62042D5F
P 1850 3400
F 0 "SW4" V 1804 3498 50  0000 L CNN
F 1 "B" V 1895 3498 50  0000 L CNN
F 2 "Buttons_Switches_THT:SW_PUSH_6mm" H 1850 3400 50  0001 C CNN
F 3 "~" H 1850 3400 50  0001 C CNN
	1    1850 3400
	0    1    1    0   
$EndComp
$Comp
L Device:R R4
U 1 1 62042D65
P 1850 3050
F 0 "R4" H 1920 3096 50  0000 L CNN
F 1 "3k3" H 1920 3005 50  0000 L CNN
F 2 "Resistors_THT:R_Axial_DIN0207_L6.3mm_D2.5mm_P7.62mm_Horizontal" V 1780 3050 50  0001 C CNN
F 3 "~" H 1850 3050 50  0001 C CNN
	1    1850 3050
	1    0    0    -1  
$EndComp
$Comp
L power:GND #PWR0122
U 1 1 62042D6B
P 1850 3800
F 0 "#PWR0122" H 1850 3550 50  0001 C CNN
F 1 "GND" H 1855 3627 50  0000 C CNN
F 2 "" H 1850 3800 50  0001 C CNN
F 3 "" H 1850 3800 50  0001 C CNN
	1    1850 3800
	1    0    0    -1  
$EndComp
Wire Wire Line
	1850 3600 1850 3800
$Comp
L power:+3V3 #PWR0123
U 1 1 62042D72
P 1850 2900
F 0 "#PWR0123" H 1850 2750 50  0001 C CNN
F 1 "+3V3" H 1865 3073 50  0000 C CNN
F 2 "" H 1850 2900 50  0001 C CNN
F 3 "" H 1850 2900 50  0001 C CNN
	1    1850 2900
	1    0    0    -1  
$EndComp
Wire Wire Line
	1850 3200 2200 3200
Connection ~ 1850 3200
Text Label 2200 3200 0    50   ~ 0
SW6
$Comp
L Switch:SW_SPST SW6
U 1 1 62042D7B
P 2650 3400
F 0 "SW6" V 2604 3498 50  0000 L CNN
F 1 "C" V 2695 3498 50  0000 L CNN
F 2 "Buttons_Switches_THT:SW_PUSH_6mm" H 2650 3400 50  0001 C CNN
F 3 "~" H 2650 3400 50  0001 C CNN
	1    2650 3400
	0    1    1    0   
$EndComp
$Comp
L Device:R R6
U 1 1 62042D81
P 2650 3050
F 0 "R6" H 2720 3096 50  0000 L CNN
F 1 "3k3" H 2720 3005 50  0000 L CNN
F 2 "Resistors_THT:R_Axial_DIN0207_L6.3mm_D2.5mm_P7.62mm_Horizontal" V 2580 3050 50  0001 C CNN
F 3 "~" H 2650 3050 50  0001 C CNN
	1    2650 3050
	1    0    0    -1  
$EndComp
$Comp
L power:GND #PWR0124
U 1 1 62042D87
P 2650 3800
F 0 "#PWR0124" H 2650 3550 50  0001 C CNN
F 1 "GND" H 2655 3627 50  0000 C CNN
F 2 "" H 2650 3800 50  0001 C CNN
F 3 "" H 2650 3800 50  0001 C CNN
	1    2650 3800
	1    0    0    -1  
$EndComp
Wire Wire Line
	2650 3600 2650 3800
$Comp
L power:+3V3 #PWR0125
U 1 1 62042D8E
P 2650 2900
F 0 "#PWR0125" H 2650 2750 50  0001 C CNN
F 1 "+3V3" H 2665 3073 50  0000 C CNN
F 2 "" H 2650 2900 50  0001 C CNN
F 3 "" H 2650 2900 50  0001 C CNN
	1    2650 2900
	1    0    0    -1  
$EndComp
Wire Wire Line
	2650 3200 3000 3200
Connection ~ 2650 3200
Text Label 3000 3200 0    50   ~ 0
SW7
$Comp
L Switch:SW_SPST SW8
U 1 1 62042D97
P 3450 3400
F 0 "SW8" V 3404 3498 50  0000 L CNN
F 1 "D" V 3495 3498 50  0000 L CNN
F 2 "Buttons_Switches_THT:SW_PUSH_6mm" H 3450 3400 50  0001 C CNN
F 3 "~" H 3450 3400 50  0001 C CNN
	1    3450 3400
	0    1    1    0   
$EndComp
$Comp
L Device:R R8
U 1 1 62042D9D
P 3450 3050
F 0 "R8" H 3520 3096 50  0000 L CNN
F 1 "3k3" H 3520 3005 50  0000 L CNN
F 2 "Resistors_THT:R_Axial_DIN0207_L6.3mm_D2.5mm_P7.62mm_Horizontal" V 3380 3050 50  0001 C CNN
F 3 "~" H 3450 3050 50  0001 C CNN
	1    3450 3050
	1    0    0    -1  
$EndComp
$Comp
L power:GND #PWR0126
U 1 1 62042DA3
P 3450 3800
F 0 "#PWR0126" H 3450 3550 50  0001 C CNN
F 1 "GND" H 3455 3627 50  0000 C CNN
F 2 "" H 3450 3800 50  0001 C CNN
F 3 "" H 3450 3800 50  0001 C CNN
	1    3450 3800
	1    0    0    -1  
$EndComp
Wire Wire Line
	3450 3600 3450 3800
$Comp
L power:+3V3 #PWR0127
U 1 1 62042DAA
P 3450 2900
F 0 "#PWR0127" H 3450 2750 50  0001 C CNN
F 1 "+3V3" H 3465 3073 50  0000 C CNN
F 2 "" H 3450 2900 50  0001 C CNN
F 3 "" H 3450 2900 50  0001 C CNN
	1    3450 2900
	1    0    0    -1  
$EndComp
Wire Wire Line
	3450 3200 3800 3200
Connection ~ 3450 3200
Text Label 3800 3200 0    50   ~ 0
SW8
$Comp
L power:GND #PWR0128
U 1 1 62045BC1
P 4550 4950
F 0 "#PWR0128" H 4550 4700 50  0001 C CNN
F 1 "GND" H 4555 4777 50  0000 C CNN
F 2 "" H 4550 4950 50  0001 C CNN
F 3 "" H 4550 4950 50  0001 C CNN
	1    4550 4950
	1    0    0    -1  
$EndComp
$Comp
L Device:C C1
U 1 1 6204671C
P 4550 4800
F 0 "C1" H 4435 4754 50  0000 R CNN
F 1 "100nF" H 4435 4845 50  0000 R CNN
F 2 "Capacitors_THT:C_Disc_D4.3mm_W1.9mm_P5.00mm" H 4588 4650 50  0001 C CNN
F 3 "~" H 4550 4800 50  0001 C CNN
	1    4550 4800
	-1   0    0    1   
$EndComp
$Comp
L power:+3V3 #PWR0129
U 1 1 6204782A
P 4550 4650
F 0 "#PWR0129" H 4550 4500 50  0001 C CNN
F 1 "+3V3" H 4565 4823 50  0000 C CNN
F 2 "" H 4550 4650 50  0001 C CNN
F 3 "" H 4550 4650 50  0001 C CNN
	1    4550 4650
	1    0    0    -1  
$EndComp
Text Label 5000 3500 2    50   ~ 0
SW1
Text Label 5000 3600 2    50   ~ 0
SW2
Text Label 5000 3700 2    50   ~ 0
SW3
Text Label 5000 3800 2    50   ~ 0
SW4
Text Label 5000 3900 2    50   ~ 0
SW5
Text Label 5000 4000 2    50   ~ 0
SW6
Text Label 5000 4100 2    50   ~ 0
SW7
Text Label 5000 4200 2    50   ~ 0
SW8
NoConn ~ 6000 3400
NoConn ~ 5000 3400
NoConn ~ 6950 3600
NoConn ~ 6950 3900
NoConn ~ 6950 4000
NoConn ~ 7750 3500
NoConn ~ 7750 3600
NoConn ~ 7750 3900
NoConn ~ 7750 4300
NoConn ~ 7250 3200
$EndSCHEMATC
