EESchema Schematic File Version 4
EELAYER 30 0
EELAYER END
$Descr A4 11693 8268
encoding utf-8
Sheet 1 1
Title ""
Date ""
Rev ""
Comp ""
Comment1 ""
Comment2 ""
Comment3 ""
Comment4 ""
$EndDescr
$Comp
L arduino:Arduino_Nano_Socket XA1
U 1 1 61F7D201
P 3500 2800
F 0 "XA1" H 3500 4037 60  0000 C CNN
F 1 "Arduino_Nano_Socket" H 3500 3931 60  0000 C CNN
F 2 "Arduino:Arduino_Nano_Socket" H 5300 6550 60  0001 C CNN
F 3 "https://store.arduino.cc/arduino-nano" H 5300 6550 60  0001 C CNN
	1    3500 2800
	1    0    0    -1  
$EndComp
$Comp
L Connector_Generic:Conn_01x04 J1
U 1 1 61F81BE0
P 750 1900
F 0 "J1" H 668 2217 50  0000 C CNN
F 1 "cam" H 668 2126 50  0000 C CNN
F 2 "Pin_Headers:Pin_Header_Straight_1x04_Pitch2.54mm" H 750 1900 50  0001 C CNN
F 3 "~" H 750 1900 50  0001 C CNN
	1    750  1900
	-1   0    0    -1  
$EndComp
$Comp
L power:GND #PWR0102
U 1 1 61F822C5
P 950 2100
F 0 "#PWR0102" H 950 1850 50  0001 C CNN
F 1 "GND" H 955 1927 50  0000 C CNN
F 2 "" H 950 2100 50  0001 C CNN
F 3 "" H 950 2100 50  0001 C CNN
	1    950  2100
	1    0    0    -1  
$EndComp
$Comp
L power:+5V #PWR0103
U 1 1 61F82B65
P 950 1800
F 0 "#PWR0103" H 950 1650 50  0001 C CNN
F 1 "+5V" H 965 1973 50  0000 C CNN
F 2 "" H 950 1800 50  0001 C CNN
F 3 "" H 950 1800 50  0001 C CNN
	1    950  1800
	1    0    0    -1  
$EndComp
Wire Wire Line
	950  1900 2200 1900
Wire Wire Line
	2200 2000 950  2000
$Comp
L Connector_Generic:Conn_01x03 J3
U 1 1 61F83EE3
P 7450 1100
F 0 "J3" H 7530 1142 50  0000 L CNN
F 1 "Conn_01x03" H 7530 1051 50  0000 L CNN
F 2 "Pin_Headers:Pin_Header_Straight_1x03_Pitch2.54mm" H 7450 1100 50  0001 C CNN
F 3 "~" H 7450 1100 50  0001 C CNN
	1    7450 1100
	1    0    0    -1  
$EndComp
$Comp
L power:+5V #PWR0104
U 1 1 61F84335
P 6700 1100
F 0 "#PWR0104" H 6700 950 50  0001 C CNN
F 1 "+5V" H 6715 1273 50  0000 C CNN
F 2 "" H 6700 1100 50  0001 C CNN
F 3 "" H 6700 1100 50  0001 C CNN
	1    6700 1100
	1    0    0    -1  
$EndComp
$Comp
L power:GND #PWR0105
U 1 1 61F84A47
P 6700 1200
F 0 "#PWR0105" H 6700 950 50  0001 C CNN
F 1 "GND" H 6705 1027 50  0000 C CNN
F 2 "" H 6700 1200 50  0001 C CNN
F 3 "" H 6700 1200 50  0001 C CNN
	1    6700 1200
	1    0    0    -1  
$EndComp
Text Label 7250 1000 2    50   ~ 0
IO0
Wire Wire Line
	6700 1100 7250 1100
Wire Wire Line
	6700 1200 7250 1200
$Comp
L Connector_Generic:Conn_01x03 J4
U 1 1 61F86EC3
P 7450 1850
F 0 "J4" H 7530 1892 50  0000 L CNN
F 1 "Conn_01x03" H 7530 1801 50  0000 L CNN
F 2 "Pin_Headers:Pin_Header_Straight_1x03_Pitch2.54mm" H 7450 1850 50  0001 C CNN
F 3 "~" H 7450 1850 50  0001 C CNN
	1    7450 1850
	1    0    0    -1  
$EndComp
$Comp
L power:+5V #PWR0106
U 1 1 61F86EC9
P 6700 1850
F 0 "#PWR0106" H 6700 1700 50  0001 C CNN
F 1 "+5V" H 6715 2023 50  0000 C CNN
F 2 "" H 6700 1850 50  0001 C CNN
F 3 "" H 6700 1850 50  0001 C CNN
	1    6700 1850
	1    0    0    -1  
$EndComp
$Comp
L power:GND #PWR0107
U 1 1 61F86ECF
P 6700 1950
F 0 "#PWR0107" H 6700 1700 50  0001 C CNN
F 1 "GND" H 6705 1777 50  0000 C CNN
F 2 "" H 6700 1950 50  0001 C CNN
F 3 "" H 6700 1950 50  0001 C CNN
	1    6700 1950
	1    0    0    -1  
$EndComp
Text Label 7250 1750 2    50   ~ 0
IO1
Wire Wire Line
	6700 1850 7250 1850
Wire Wire Line
	6700 1950 7250 1950
$Comp
L Connector_Generic:Conn_01x03 J5
U 1 1 61F87C64
P 7450 2550
F 0 "J5" H 7530 2592 50  0000 L CNN
F 1 "Conn_01x03" H 7530 2501 50  0000 L CNN
F 2 "Pin_Headers:Pin_Header_Straight_1x03_Pitch2.54mm" H 7450 2550 50  0001 C CNN
F 3 "~" H 7450 2550 50  0001 C CNN
	1    7450 2550
	1    0    0    -1  
$EndComp
$Comp
L power:+5V #PWR0108
U 1 1 61F87C6A
P 6700 2550
F 0 "#PWR0108" H 6700 2400 50  0001 C CNN
F 1 "+5V" H 6715 2723 50  0000 C CNN
F 2 "" H 6700 2550 50  0001 C CNN
F 3 "" H 6700 2550 50  0001 C CNN
	1    6700 2550
	1    0    0    -1  
$EndComp
$Comp
L power:GND #PWR0109
U 1 1 61F87C70
P 6700 2650
F 0 "#PWR0109" H 6700 2400 50  0001 C CNN
F 1 "GND" H 6705 2477 50  0000 C CNN
F 2 "" H 6700 2650 50  0001 C CNN
F 3 "" H 6700 2650 50  0001 C CNN
	1    6700 2650
	1    0    0    -1  
$EndComp
Text Label 7250 2450 2    50   ~ 0
IO2
Wire Wire Line
	6700 2550 7250 2550
Wire Wire Line
	6700 2650 7250 2650
$Comp
L Connector_Generic:Conn_01x03 J6
U 1 1 61F886E6
P 7450 3300
F 0 "J6" H 7530 3342 50  0000 L CNN
F 1 "Conn_01x03" H 7530 3251 50  0000 L CNN
F 2 "Pin_Headers:Pin_Header_Straight_1x03_Pitch2.54mm" H 7450 3300 50  0001 C CNN
F 3 "~" H 7450 3300 50  0001 C CNN
	1    7450 3300
	1    0    0    -1  
$EndComp
$Comp
L power:+5V #PWR0110
U 1 1 61F886EC
P 6700 3300
F 0 "#PWR0110" H 6700 3150 50  0001 C CNN
F 1 "+5V" H 6715 3473 50  0000 C CNN
F 2 "" H 6700 3300 50  0001 C CNN
F 3 "" H 6700 3300 50  0001 C CNN
	1    6700 3300
	1    0    0    -1  
$EndComp
$Comp
L power:GND #PWR0111
U 1 1 61F886F2
P 6700 3400
F 0 "#PWR0111" H 6700 3150 50  0001 C CNN
F 1 "GND" H 6705 3227 50  0000 C CNN
F 2 "" H 6700 3400 50  0001 C CNN
F 3 "" H 6700 3400 50  0001 C CNN
	1    6700 3400
	1    0    0    -1  
$EndComp
Text Label 7250 3200 2    50   ~ 0
IO3
Wire Wire Line
	6700 3300 7250 3300
Wire Wire Line
	6700 3400 7250 3400
$Comp
L Connector_Generic:Conn_01x03 J7
U 1 1 61F8A049
P 8950 1100
F 0 "J7" H 9030 1142 50  0000 L CNN
F 1 "Conn_01x03" H 9030 1051 50  0000 L CNN
F 2 "Pin_Headers:Pin_Header_Straight_1x03_Pitch2.54mm" H 8950 1100 50  0001 C CNN
F 3 "~" H 8950 1100 50  0001 C CNN
	1    8950 1100
	1    0    0    -1  
$EndComp
$Comp
L power:+5V #PWR0112
U 1 1 61F8A04F
P 8200 1100
F 0 "#PWR0112" H 8200 950 50  0001 C CNN
F 1 "+5V" H 8215 1273 50  0000 C CNN
F 2 "" H 8200 1100 50  0001 C CNN
F 3 "" H 8200 1100 50  0001 C CNN
	1    8200 1100
	1    0    0    -1  
$EndComp
$Comp
L power:GND #PWR0113
U 1 1 61F8A055
P 8200 1200
F 0 "#PWR0113" H 8200 950 50  0001 C CNN
F 1 "GND" H 8205 1027 50  0000 C CNN
F 2 "" H 8200 1200 50  0001 C CNN
F 3 "" H 8200 1200 50  0001 C CNN
	1    8200 1200
	1    0    0    -1  
$EndComp
Text Label 8750 1000 2    50   ~ 0
IO4
Wire Wire Line
	8200 1100 8750 1100
Wire Wire Line
	8200 1200 8750 1200
$Comp
L Connector_Generic:Conn_01x03 J8
U 1 1 61F8DDD5
P 8950 1800
F 0 "J8" H 9030 1842 50  0000 L CNN
F 1 "Conn_01x03" H 9030 1751 50  0000 L CNN
F 2 "Pin_Headers:Pin_Header_Straight_1x03_Pitch2.54mm" H 8950 1800 50  0001 C CNN
F 3 "~" H 8950 1800 50  0001 C CNN
	1    8950 1800
	1    0    0    -1  
$EndComp
$Comp
L power:+5V #PWR0114
U 1 1 61F8DDDB
P 8200 1800
F 0 "#PWR0114" H 8200 1650 50  0001 C CNN
F 1 "+5V" H 8215 1973 50  0000 C CNN
F 2 "" H 8200 1800 50  0001 C CNN
F 3 "" H 8200 1800 50  0001 C CNN
	1    8200 1800
	1    0    0    -1  
$EndComp
$Comp
L power:GND #PWR0115
U 1 1 61F8DDE1
P 8200 1900
F 0 "#PWR0115" H 8200 1650 50  0001 C CNN
F 1 "GND" H 8205 1727 50  0000 C CNN
F 2 "" H 8200 1900 50  0001 C CNN
F 3 "" H 8200 1900 50  0001 C CNN
	1    8200 1900
	1    0    0    -1  
$EndComp
Text Label 8750 1700 2    50   ~ 0
IO5
Wire Wire Line
	8200 1800 8750 1800
Wire Wire Line
	8200 1900 8750 1900
$Comp
L Connector_Generic:Conn_01x03 J9
U 1 1 61F8E734
P 8950 2550
F 0 "J9" H 9030 2592 50  0000 L CNN
F 1 "Conn_01x03" H 9030 2501 50  0000 L CNN
F 2 "Pin_Headers:Pin_Header_Straight_1x03_Pitch2.54mm" H 8950 2550 50  0001 C CNN
F 3 "~" H 8950 2550 50  0001 C CNN
	1    8950 2550
	1    0    0    -1  
$EndComp
$Comp
L power:+5V #PWR0116
U 1 1 61F8E73A
P 8200 2550
F 0 "#PWR0116" H 8200 2400 50  0001 C CNN
F 1 "+5V" H 8215 2723 50  0000 C CNN
F 2 "" H 8200 2550 50  0001 C CNN
F 3 "" H 8200 2550 50  0001 C CNN
	1    8200 2550
	1    0    0    -1  
$EndComp
$Comp
L power:GND #PWR0117
U 1 1 61F8E740
P 8200 2650
F 0 "#PWR0117" H 8200 2400 50  0001 C CNN
F 1 "GND" H 8205 2477 50  0000 C CNN
F 2 "" H 8200 2650 50  0001 C CNN
F 3 "" H 8200 2650 50  0001 C CNN
	1    8200 2650
	1    0    0    -1  
$EndComp
Text Label 8750 2450 2    50   ~ 0
IO6
Wire Wire Line
	8200 2550 8750 2550
Wire Wire Line
	8200 2650 8750 2650
$Comp
L Connector_Generic:Conn_01x03 J10
U 1 1 61F8F416
P 8950 3250
F 0 "J10" H 9030 3292 50  0000 L CNN
F 1 "Conn_01x03" H 9030 3201 50  0000 L CNN
F 2 "Pin_Headers:Pin_Header_Straight_1x03_Pitch2.54mm" H 8950 3250 50  0001 C CNN
F 3 "~" H 8950 3250 50  0001 C CNN
	1    8950 3250
	1    0    0    -1  
$EndComp
$Comp
L power:+5V #PWR0118
U 1 1 61F8F41C
P 8200 3250
F 0 "#PWR0118" H 8200 3100 50  0001 C CNN
F 1 "+5V" H 8215 3423 50  0000 C CNN
F 2 "" H 8200 3250 50  0001 C CNN
F 3 "" H 8200 3250 50  0001 C CNN
	1    8200 3250
	1    0    0    -1  
$EndComp
$Comp
L power:GND #PWR0119
U 1 1 61F8F422
P 8200 3350
F 0 "#PWR0119" H 8200 3100 50  0001 C CNN
F 1 "GND" H 8205 3177 50  0000 C CNN
F 2 "" H 8200 3350 50  0001 C CNN
F 3 "" H 8200 3350 50  0001 C CNN
	1    8200 3350
	1    0    0    -1  
$EndComp
Text Label 8750 3150 2    50   ~ 0
IO7
Wire Wire Line
	8200 3250 8750 3250
Wire Wire Line
	8200 3350 8750 3350
$Comp
L power:GND #PWR0120
U 1 1 61F94677
P 1900 3300
F 0 "#PWR0120" H 1900 3050 50  0001 C CNN
F 1 "GND" H 1905 3127 50  0000 C CNN
F 2 "" H 1900 3300 50  0001 C CNN
F 3 "" H 1900 3300 50  0001 C CNN
	1    1900 3300
	1    0    0    -1  
$EndComp
$Comp
L power:+5V #PWR0121
U 1 1 61F94FBD
P 2050 3600
F 0 "#PWR0121" H 2050 3450 50  0001 C CNN
F 1 "+5V" H 2065 3773 50  0000 C CNN
F 2 "" H 2050 3600 50  0001 C CNN
F 3 "" H 2050 3600 50  0001 C CNN
	1    2050 3600
	1    0    0    -1  
$EndComp
Wire Wire Line
	2050 3600 2200 3600
Wire Wire Line
	2200 3400 2200 3300
Wire Wire Line
	2200 3300 1900 3300
Connection ~ 2200 3300
Text GLabel 4800 1900 2    50   Input ~ 0
IO0
Text GLabel 4800 2000 2    50   Input ~ 0
IO1
Text GLabel 4800 2100 2    50   Input ~ 0
IO2
Text GLabel 4800 2200 2    50   Input ~ 0
IO3
Text GLabel 4800 2300 2    50   Input ~ 0
IO4
Text GLabel 4800 2400 2    50   Input ~ 0
IO5
Text GLabel 4800 2500 2    50   Input ~ 0
IO6
Text GLabel 4800 2600 2    50   Input ~ 0
IO7
Text Label 2200 3000 2    50   ~ 0
VBatt
NoConn ~ 5250 1600
$Comp
L Connector_Generic:Conn_01x06 J2
U 1 1 61FC1BBF
P 1550 5100
F 0 "J2" H 1468 5517 50  0000 C CNN
F 1 "Powercon" H 1468 5426 50  0000 C CNN
F 2 "Pin_Headers:Pin_Header_Straight_2x03_Pitch2.54mm" H 1550 5100 50  0001 C CNN
F 3 "~" H 1550 5100 50  0001 C CNN
	1    1550 5100
	-1   0    0    -1  
$EndComp
Wire Wire Line
	1750 5100 1750 5000
Wire Wire Line
	1750 5000 1750 4900
Connection ~ 1750 5000
$Comp
L power:GND #PWR0101
U 1 1 61FC3309
P 1800 5000
F 0 "#PWR0101" H 1800 4750 50  0001 C CNN
F 1 "GND" H 1805 4827 50  0000 C CNN
F 2 "" H 1800 5000 50  0001 C CNN
F 3 "" H 1800 5000 50  0001 C CNN
	1    1800 5000
	1    0    0    -1  
$EndComp
Wire Wire Line
	1750 5000 1800 5000
Wire Wire Line
	1750 5200 1750 5300
Text Label 1750 5400 0    50   ~ 0
VBatt
Wire Wire Line
	1750 5300 1950 5300
Connection ~ 1750 5300
$Comp
L power:+5V #PWR0122
U 1 1 61FC568F
P 1950 5300
F 0 "#PWR0122" H 1950 5150 50  0001 C CNN
F 1 "+5V" H 1965 5473 50  0000 C CNN
F 2 "" H 1950 5300 50  0001 C CNN
F 3 "" H 1950 5300 50  0001 C CNN
	1    1950 5300
	1    0    0    -1  
$EndComp
$EndSCHEMATC
