<svg width="392" height="140" viewBox="0 0 392 140" fill="none" xmlns="http://www.w3.org/2000/svg">
<g clip-path="url(#clip0_2573_5761)">
<path d="M38.7189 28.2348C38.8089 31.6077 38.6905 34.9831 38.364 38.3414C36.6268 47.9401 29.2436 52.2905 20.1767 51.8065C8.32183 51.1753 3.43045 42.5629 4.11318 32.1158C4.20587 30.9498 4.73531 29.8617 5.59535 29.0688C6.4554 28.276 7.58271 27.8369 8.75244 27.8392C9.92316 27.8531 11.0465 28.3033 11.9028 29.1017C12.7591 29.9002 13.287 30.9895 13.3827 32.1564C13.5134 33.4869 13.3642 34.8449 13.5004 36.1754C13.5216 37.1908 13.7508 38.1909 14.1739 39.1142C14.597 40.0374 15.2049 40.864 15.9602 41.5428C16.7155 42.2217 17.6022 42.7385 18.5651 43.0612C19.5281 43.3838 20.5468 43.5055 21.5587 43.4187C22.5746 43.4739 23.5908 43.3176 24.5432 42.9595C25.4956 42.6015 26.3636 42.0496 27.0915 41.3388C27.8195 40.6279 28.3917 39.7736 28.7723 38.83C29.1529 37.8864 29.3335 36.8741 29.3024 35.8571C29.4644 30.4155 29.4366 24.9628 29.271 19.523C29.3221 18.0155 28.8915 16.531 28.0418 15.2849C27.192 14.0387 25.9675 13.0956 24.5455 12.5927C23.9818 12.4488 23.4544 12.1889 22.9968 11.8296C22.5393 11.4703 22.1615 11.0195 21.888 10.506C21.6145 9.99249 21.4514 9.42756 21.4086 8.84736C21.3658 8.26716 21.4444 7.68445 21.6395 7.13639C21.8445 6.57291 22.1613 6.05668 22.5709 5.61884C22.9805 5.18101 23.4748 4.83055 24.0234 4.58865C24.572 4.34675 25.1639 4.2184 25.7635 4.21125C26.363 4.20411 26.9578 4.31833 27.5121 4.54709C30.7802 5.45226 33.6541 7.4193 35.6809 10.1381C37.7077 12.857 38.7721 16.173 38.7063 19.5636C38.7744 22.2522 38.7189 24.9389 38.7189 28.2348Z" fill="#2F2F2F"/>
<path d="M113.713 34.4453C113.713 30.3415 113.702 26.2397 113.713 22.1377C113.629 21.2754 113.793 20.4072 114.186 19.6349C114.579 18.8627 115.183 18.2184 115.929 17.7777C116.675 17.3371 117.531 17.1183 118.397 17.147C119.263 17.1758 120.103 17.451 120.818 17.9401C121.333 18.2539 121.917 18.435 122.519 18.4671C123.121 18.4993 123.721 18.3814 124.267 18.1241C130.275 16.0704 136.547 17.8537 139.465 22.4009C140.832 24.6427 141.528 27.229 141.471 29.8539C141.532 35.5973 141.508 41.3407 141.484 47.0841C141.55 47.7006 141.477 48.3244 141.27 48.9088C141.063 49.4933 140.726 50.0235 140.286 50.4602C139.845 50.8968 139.312 51.2286 138.726 51.4311C138.14 51.6335 137.516 51.7014 136.9 51.6295C136.284 51.714 135.657 51.6578 135.065 51.4651C134.474 51.2724 133.935 50.9482 133.487 50.517C133.039 50.0858 132.694 49.5586 132.479 48.9752C132.264 48.3918 132.185 47.7673 132.246 47.1485C132.207 41.6278 132.226 36.1071 132.246 30.5863C132.246 28.4848 131.959 26.4421 129.892 25.4023C128.877 25.0204 127.79 24.8694 126.71 24.9604C125.629 25.0515 124.583 25.3823 123.646 25.9286C122.568 26.3666 122.976 27.3216 122.973 28.0651C122.94 34.1066 122.954 40.1481 122.954 46.1897C122.954 50.0689 121.653 51.6148 118.387 51.6313C115.074 51.6497 113.716 50.1057 113.716 46.2946C113.712 42.3442 113.711 38.3945 113.713 34.4453Z" fill="#302F2F"/>
<path d="M12.6663 0.00171631C13.671 -0.0607514 14.6672 0.220398 15.4909 0.798962C16.3146 1.37753 16.917 2.21905 17.1991 3.18531C17.5189 4.15897 17.4493 5.21868 17.005 6.14223C16.5607 7.06579 15.776 7.78148 14.8157 8.13928C10.5518 9.65196 9.36478 12.865 9.41263 16.9246C9.42183 17.7453 9.46818 18.5716 9.39825 19.385C9.36814 19.9852 9.21769 20.5734 8.95616 21.1146C8.69463 21.6557 8.3273 22.139 7.87564 22.5355C7.42399 22.9321 6.89742 23.2339 6.32698 23.4233C5.75654 23.6126 5.15372 23.6856 4.55457 23.6378C3.95533 23.6532 3.35905 23.5459 2.80284 23.3224C2.24662 23.0989 1.74218 22.7639 1.32022 22.3382C0.89825 21.9124 0.567837 21.4049 0.349325 20.8467C0.130814 20.2885 0.0288741 19.6914 0.0496562 19.0924C-0.355321 14.8329 0.519885 10.5495 2.56337 6.79032C3.63722 4.97924 5.10143 3.43028 6.84904 2.25597C8.59665 1.08167 10.5837 0.311596 12.6663 0.00171631Z" fill="#0F570D"/>
<path d="M73.8745 30.2514C73.8138 19.9773 66.0481 14.6793 56.3666 18.2181C55.9226 18.4404 55.4258 18.5356 54.9311 18.493C54.4365 18.4505 53.9634 18.2719 53.564 17.977C52.8682 17.4295 52.0272 17.098 51.145 17.0238C50.2628 16.9495 49.3782 17.1357 48.6008 17.5592C47.8233 17.9827 47.1869 18.6249 46.7709 19.4064C46.3548 20.1879 46.1774 21.0742 46.26 21.9556C46.2343 34.9416 46.2343 47.9276 46.26 60.9136C46.205 61.5324 46.2898 62.1556 46.5085 62.7371C46.7272 63.3186 47.0738 63.8433 47.523 64.2725C47.9721 64.7017 48.5123 65.0242 49.1031 65.2162C49.6939 65.4082 50.3205 65.4649 50.9361 65.3818C51.5351 65.4314 52.1373 65.3488 52.7009 65.1402C53.2645 64.9315 53.7757 64.6018 54.1979 64.1741C54.6201 63.7464 54.9431 63.2313 55.1445 62.6651C55.346 62.0989 55.421 61.4953 55.3638 60.8971C55.3877 57.5423 55.3638 54.1875 55.3638 50.4076C57.866 51.4381 60.5853 51.829 63.2765 51.5449C65.6477 51.4914 67.9312 50.636 69.7537 49.118C71.5762 47.6 72.8303 45.509 73.3116 43.1865C74.0204 38.9133 74.2093 34.5701 73.8745 30.2514ZM64.7047 39.3091C64.615 40.2958 64.2663 41.2413 63.6943 42.0503C63.1223 42.8592 62.3473 43.5029 61.447 43.9164C60.5467 44.3298 59.553 44.4985 58.5667 44.4053C57.5803 44.312 56.6361 43.9602 55.8292 43.3853C55.1594 42.9473 55.3891 42.3345 55.3817 41.7861C55.3505 39.3938 55.3692 37.0107 55.3692 34.6239C55.3692 32.3107 55.4407 29.9957 55.3395 27.6862C55.2932 27.452 55.2955 27.2108 55.3462 26.9775C55.397 26.7443 55.4953 26.5239 55.6347 26.3301C55.7741 26.1364 55.9517 25.9733 56.1567 25.8511C56.3618 25.7288 56.5899 25.6501 56.8266 25.6196C57.7524 25.3474 58.6962 25.1413 59.6512 25.0031C62.7797 24.7252 64.574 26.1532 64.7065 29.2356C64.8409 32.5922 64.8683 35.9617 64.6953 39.3091H64.7047Z" fill="#2F2F2F"/>
<path d="M90.6636 38.3011C93.476 38.7192 96.3395 38.6513 99.129 38.1005C103.779 37.1546 106.479 34.5066 107.042 30.2059C107.719 24.9741 105.741 20.6845 101.584 18.7467C99.3727 17.7302 96.9793 17.1701 94.5468 17.1002C92.1142 17.0304 89.6924 17.4521 87.4266 18.34C85.1526 19.0336 83.1793 20.4741 81.8254 22.4283C80.4716 24.3826 79.8165 26.7364 79.9663 29.1091C79.9497 30.8997 79.9663 32.6902 79.9663 34.4808C79.9663 36.4959 79.9168 38.511 79.9793 40.5224C79.9449 42.5549 80.5179 44.5513 81.625 46.2561C82.7322 47.9609 84.323 49.2964 86.1938 50.0916C88.7766 51.1889 91.5505 51.7654 94.3567 51.7878C97.1629 51.8102 99.9461 51.2782 102.546 50.2223C105.859 49.0813 107.195 46.9098 106.374 44.6353C105.553 42.3608 102.916 41.6909 99.6366 42.9957C97.4225 43.9188 95.0009 44.2302 92.6252 43.8974C92.121 43.8685 91.6277 43.7394 91.174 43.5177C90.7203 43.296 90.3155 42.986 89.983 42.606C89.6504 42.226 89.3968 41.7836 89.2372 41.3045C89.0776 40.8254 89.0152 40.3192 89.0534 39.8157C89.0332 38.6103 89.2264 38.0987 90.6636 38.3011ZM89.3423 27.1695C89.8167 26.0174 90.7173 25.0929 91.8565 24.5883C92.9956 24.0836 94.2855 24.0379 95.4574 24.4607C95.9158 24.5568 96.3493 24.7464 96.7311 25.0176C97.113 25.2889 97.4351 25.6358 97.6769 26.037C97.9186 26.4381 98.0751 26.8848 98.1365 27.3491C98.1979 27.8134 98.1627 28.2853 98.0336 28.7355C97.741 31.0303 96.2138 31.8732 92.6602 31.702L92.2132 31.6781C88.9504 31.4775 88.2087 30.3126 89.3423 27.1695Z" fill="#2F2F2F"/>
<path d="M152.667 49.2573C152.687 49.8585 152.94 50.4284 153.372 50.8473C153.803 51.2663 154.38 51.5017 154.982 51.5042C155.278 51.5075 155.572 51.4515 155.846 51.3397C156.12 51.228 156.369 51.0626 156.578 50.8533C156.787 50.644 156.953 50.395 157.064 50.121C157.176 49.8469 157.232 49.5533 157.229 49.2573V4.38659C157.224 3.79215 156.986 3.22342 156.566 2.80308C156.145 2.38273 155.576 2.14446 154.982 2.13965C154.384 2.15406 153.814 2.39342 153.385 2.80992C152.956 3.22642 152.699 3.78944 152.667 4.38659V49.2573ZM170.098 19.2981C169.872 18.7103 169.495 18.1928 169.005 17.7981C168.515 17.4034 167.928 17.1457 167.306 17.0512C166.782 17.0512 166.28 17.2592 165.91 17.6295C165.54 17.9998 165.332 18.5021 165.332 19.0257C165.331 19.447 165.475 19.8556 165.74 20.1833C166.71 21.7251 167.141 23.545 166.966 25.358V49.1892C166.948 49.4829 166.995 49.7768 167.104 50.0502C167.213 50.3235 167.38 50.5696 167.595 50.7711C167.809 50.9725 168.065 51.1243 168.345 51.2157C168.624 51.3071 168.921 51.3359 169.213 51.3C169.5 51.3288 169.79 51.2945 170.063 51.1996C170.336 51.1046 170.585 50.9514 170.792 50.7504C171 50.5494 171.161 50.3056 171.264 50.036C171.368 49.7664 171.411 49.4774 171.391 49.1892V25.358C171.391 24.5819 171.323 23.8072 171.187 23.043C173.527 21.0798 176.444 19.9325 179.494 19.7747C184.056 19.7747 186.439 23.043 186.439 28.6944V49.1892C186.428 49.4813 186.479 49.7725 186.59 50.043C186.7 50.3135 186.868 50.5571 187.081 50.7572C187.294 50.9573 187.548 51.1094 187.825 51.203C188.102 51.2967 188.395 51.3297 188.686 51.3C188.974 51.3288 189.264 51.2945 189.537 51.1996C189.809 51.1046 190.058 50.9514 190.266 50.7504C190.473 50.5494 190.634 50.3056 190.738 50.036C190.841 49.7664 190.885 49.4774 190.865 49.1892V28.6944C190.865 21.0684 187.392 15.9617 180.311 15.9617C176.645 15.9985 173.079 17.1635 170.098 19.2981ZM198.622 25.4261C198.622 33.5968 206.86 34.2777 212.171 36.9332C213.082 37.3846 213.836 38.1002 214.334 38.9866C214.832 39.873 215.051 40.889 214.963 41.9018C214.963 45.9191 212.171 47.6213 208.018 47.6213C205.474 47.5639 202.968 46.9845 200.657 45.9191C200.527 45.8685 200.388 45.8453 200.248 45.851C199.975 45.8447 199.703 45.8927 199.449 45.9922C199.194 46.0918 198.962 46.2409 198.766 46.431C198.569 46.621 198.413 46.8482 198.305 47.0993C198.197 47.3504 198.14 47.6204 198.138 47.8937C198.138 50.6853 204.538 51.3662 208.011 51.3662C215.432 51.3662 219.236 47.6857 219.236 41.6976C219.236 33.5269 211.875 32.846 206.503 30.1905C203.848 28.7607 202.895 27.535 202.895 25.0838C202.895 21.4751 205.005 19.5631 209.635 19.5631C211.583 19.5242 213.508 19.9935 215.219 20.9249C215.536 21.0867 215.884 21.1795 216.24 21.1972C216.501 21.2057 216.762 21.1612 217.005 21.0663C217.249 20.9713 217.47 20.8281 217.657 20.6451C217.844 20.4621 217.991 20.2431 218.091 20.0015C218.191 19.7599 218.24 19.5006 218.237 19.2392C218.237 16.6518 212.926 15.8348 209.453 15.8348C202.372 15.8256 198.627 19.6385 198.627 25.4261H198.622ZM245.807 42.7244C245.812 43.4753 245.858 44.2254 245.944 44.9714C243.503 46.6084 240.643 47.5067 237.705 47.5588C233.143 47.5588 230.692 44.2905 230.692 38.7072V18.2087C230.713 17.9171 230.671 17.6245 230.569 17.3505C230.467 17.0766 230.307 16.8279 230.1 16.6212C229.894 16.4145 229.645 16.2547 229.371 16.1527C229.097 16.0506 228.804 16.0087 228.513 16.0298C228.218 16.0074 227.921 16.0478 227.643 16.1484C227.365 16.2491 227.111 16.4076 226.899 16.6135C226.686 16.8195 226.52 17.0682 226.411 17.3431C226.302 17.6181 226.252 17.9131 226.266 18.2087V38.7035C226.266 46.2614 229.875 51.3681 236.956 51.3681C240.49 51.3826 243.965 50.4668 247.033 48.7126C247.918 50.0744 248.803 50.9595 249.961 50.9595C250.221 50.9689 250.48 50.9269 250.723 50.8361C250.967 50.7452 251.19 50.6072 251.38 50.4299C251.571 50.2527 251.724 50.0397 251.832 49.8031C251.94 49.5666 252 49.311 252.009 49.0512C251.879 48.3237 251.521 47.6563 250.988 47.1447C250.579 46.6681 250.239 46.1234 250.239 42.7281V18.2087C250.26 17.9176 250.218 17.6255 250.116 17.352C250.014 17.0785 249.855 16.83 249.649 16.6234C249.443 16.4168 249.195 16.2569 248.922 16.1545C248.648 16.0521 248.356 16.0096 248.065 16.0298C247.769 16.0015 247.47 16.0378 247.189 16.1363C246.908 16.2349 246.652 16.3932 246.439 16.6004C246.225 16.8076 246.059 17.0587 245.952 17.3364C245.845 17.614 245.799 17.9117 245.818 18.2087L245.807 42.7244ZM264.333 25.4961C264.38 24.7919 264.357 24.0849 264.265 23.3853V23.3172C266.914 21.2024 270.292 20.223 273.661 20.5936C273.959 20.5932 274.253 20.5319 274.527 20.4136C274.8 20.2953 275.046 20.1225 275.25 19.9058C275.454 19.689 275.611 19.4329 275.713 19.1531C275.814 18.8733 275.858 18.5757 275.84 18.2786C275.84 17.053 275.091 16.0998 272.712 16.0998C269.246 16.3199 265.893 17.4208 262.971 19.2981C262.222 18.0725 261.201 17.1873 260.316 17.1873C260.051 17.1805 259.788 17.2264 259.542 17.3223C259.295 17.4183 259.071 17.5624 258.88 17.7462C258.69 17.93 258.539 18.1499 258.434 18.393C258.33 18.636 258.275 18.8974 258.273 19.1619C258.273 19.5831 258.417 19.9917 258.682 20.3194C259.651 21.8613 260.082 23.6812 259.907 25.4942V49.1892C259.906 49.4816 259.963 49.7713 260.076 50.0409C260.19 50.3105 260.356 50.5544 260.566 50.758C260.776 50.9615 261.025 51.1205 261.298 51.2254C261.571 51.3302 261.862 51.3788 262.154 51.3681C262.731 51.3642 263.283 51.1334 263.691 50.7256C264.098 50.3179 264.329 49.7659 264.333 49.1892V25.4961ZM298.105 32.3731C295.652 31.6277 293.11 31.2155 290.547 31.1474C282.581 31.1474 278.7 34.5519 278.7 41.0848V41.3571C278.7 47.2827 282.036 51.3681 288.919 51.3681C290.732 51.3669 292.526 51.005 294.198 50.3036C295.869 49.6023 297.385 48.5754 298.656 47.2827C299.072 48.346 299.776 49.2724 300.689 49.9579C301.602 50.6435 302.688 51.061 303.825 51.1638C305.05 51.1638 306.412 50.6872 306.412 49.3236C306.44 49.1035 306.422 48.8802 306.361 48.667C306.3 48.4539 306.196 48.2553 306.056 48.0833C305.916 47.9113 305.743 47.7695 305.547 47.6664C305.35 47.5633 305.135 47.501 304.914 47.4833C304.778 47.4833 304.642 47.5514 304.362 47.5514C303.135 47.5514 302.522 46.6662 302.522 44.8959V29.5078C302.522 20.5881 299.186 15.8219 290.811 15.8219C286.249 15.8219 281.21 16.9794 281.482 19.8391C281.55 20.6562 281.959 21.6095 282.98 21.6095C283.568 21.5942 284.138 21.4017 284.614 21.0574C286.256 20.0001 288.184 19.4769 290.135 19.5594C295.514 19.5594 298.102 22.1468 298.102 27.6565L298.105 32.3731ZM290.479 34.7654C293.071 34.816 295.641 35.2501 298.105 36.0535V44.2242C295.858 46.3473 292.89 47.5395 289.798 47.5606C284.624 47.5606 283.058 44.9732 283.058 41.4326V41.1602C283.058 37.6822 284.215 34.7543 290.479 34.7543V34.7654ZM315.536 19.3073C315.311 18.7195 314.934 18.202 314.443 17.8073C313.953 17.4126 313.367 17.1549 312.744 17.0604C312.221 17.0604 311.719 17.2684 311.348 17.6387C310.978 18.009 310.77 18.5113 310.77 19.0349C310.77 19.4562 310.914 19.8648 311.178 20.1925C312.148 21.7343 312.579 23.5542 312.404 25.3672V49.1892C312.386 49.4829 312.434 49.7768 312.542 50.0502C312.651 50.3235 312.819 50.5696 313.033 50.7711C313.247 50.9725 313.503 51.1243 313.783 51.2157C314.063 51.3071 314.359 51.3359 314.651 51.3C314.938 51.3288 315.229 51.2945 315.501 51.1996C315.774 51.1046 316.023 50.9514 316.23 50.7504C316.438 50.5494 316.599 50.3056 316.702 50.036C316.806 49.7664 316.849 49.4774 316.83 49.1892V25.358C316.829 24.5819 316.761 23.8072 316.626 23.043C318.966 21.0798 321.882 19.9325 324.932 19.7747C329.494 19.7747 331.878 23.043 331.878 28.6944V49.1892C331.866 49.4813 331.917 49.7725 332.028 50.043C332.139 50.3135 332.306 50.5571 332.519 50.7572C332.732 50.9573 332.986 51.1094 333.263 51.203C333.54 51.2967 333.834 51.3297 334.124 51.3C334.412 51.3288 334.702 51.2945 334.975 51.1996C335.248 51.1046 335.496 50.9514 335.704 50.7504C335.911 50.5494 336.072 50.3056 336.176 50.036C336.279 49.7664 336.323 49.4774 336.303 49.1892V28.6944C336.303 21.0684 332.831 15.9617 325.749 15.9617C322.083 15.9985 318.517 17.1635 315.536 19.2981V19.3073ZM343.453 39.0531C343.453 45.9982 347.133 51.3828 355.573 51.3828C358.637 51.3828 364.774 50.5657 364.774 47.7023C364.778 47.2067 364.588 46.7291 364.244 46.3725C363.899 46.0159 363.429 45.8088 362.934 45.7958C362.585 45.8165 362.242 45.8852 361.912 46.0001H361.98C360.206 47.051 358.186 47.6147 356.125 47.6342C350.201 47.6342 347.886 44.434 347.886 39.055V28.422C347.886 22.9749 350.201 19.7729 356.125 19.7729C358.193 19.8104 360.214 20.398 361.98 21.4751H361.912C362.246 21.5584 362.589 21.604 362.934 21.6113C363.422 21.6113 363.89 21.4174 364.235 21.0723C364.58 20.7272 364.774 20.2591 364.774 19.771C364.774 16.8432 358.646 16.0261 355.573 16.0261C347.129 16.0261 343.453 21.4733 343.453 28.4184V39.0531ZM381.242 47.6324C375.795 47.6324 373.003 44.8407 373.003 40.6873V35.8438C375.538 36.3434 378.114 36.5943 380.697 36.5927C388.664 36.5927 392 32.8478 392 26.7198C392 20.1152 388.391 15.8256 380.97 15.8256C372.935 15.8256 368.578 20.728 368.578 27.1964V40.2622C368.578 46.519 372.935 51.3607 380.561 51.3607C384.17 51.3607 391.387 50.4075 391.387 47.3435C391.377 46.8411 391.173 46.3621 390.818 46.0068C390.462 45.6515 389.983 45.4473 389.481 45.437C389.22 45.4548 388.966 45.5242 388.732 45.6412C386.428 46.8867 383.861 47.5661 381.242 47.6232V47.6324ZM387.642 26.729C387.642 29.9292 386.689 32.9859 380.97 32.9859C378.306 32.9575 375.646 32.7732 373.003 32.4338V26.6462C373.003 22.4247 375.863 19.7011 380.765 19.7011C385.123 19.7066 387.642 21.7493 387.642 26.7198V26.729Z" fill="#3C3C3C"/>
</g>
<path d="M135.5 128.816V129.816H136.5H144.066H145.066V128.816V108.52H159.197H160.197V107.52V104.396V103.396H159.197H145.066V87.5072H164.841H165.841V86.5072V83.3838V82.3838H164.841H136.5H135.5V83.3838V128.816ZM189.019 129.752L189.269 130.384H189.949H192.651H193.329L193.58 129.754L211.893 83.7537L212.439 82.3838H210.964H207.241H206.56L206.311 83.0178L193.566 115.427L181.216 83.0276L180.97 82.3838H180.281H171.755H170.284L170.825 83.7516L189.019 129.752ZM220.515 128.816V129.816H221.515H229.02H230.02V128.816V111.302H237.607C243.532 111.302 248.215 110.049 251.503 107.39C254.829 104.734 256.5 101.188 256.5 96.843C256.5 92.459 254.807 88.9073 251.433 86.2875C248.065 83.6347 243.266 82.3838 237.186 82.3838H221.515H220.515V83.3838V128.816ZM244.113 103.575L244.112 103.576C242.669 105.265 240.501 106.179 237.427 106.179H230.02V87.5072H237.006C240.307 87.5072 242.594 88.4176 244.066 90.069L244.066 90.069L244.073 90.0775C245.642 91.7975 246.454 94.0061 246.454 96.7863C246.454 99.5304 245.66 101.771 244.113 103.575Z" fill="#3C3C3C" stroke="#3C3C3C" stroke-width="2"/>
<defs>
<clipPath id="clip0_2573_5761">
<rect width="392" height="65.3839" fill="white"/>
</clipPath>
</defs>
</svg>
