[
    {
        "test-name": "payments_api_multiple-consents-conditional_test-module_v4",
        "variant": "*",
        "configuration-filename": "./scripts/configs/phase3/v4/generated/generated-phase3_v4_payments-config.json",
        "current-block": "",
        "condition": "EnsurePaymentsJointAccountCpfOrCnpjIsPresent",
        "expected-result": "warning",
        "comment": "warning is expected sine the test is skipped"
    },
    {
        "test-name": "payments_api_multiple-consents-no-funds-conditional_test-module_v4",
        "variant": "*",
        "configuration-filename": "./scripts/configs/phase3/v4/generated/generated-phase3_v4_payments-config.json",
        "current-block": "",
        "condition": "EnsurePaymentsJointAccountCpfOrCnpjIsPresent",
        "expected-result": "warning",
        "comment": "warning is expected sine the test is skipped"
    },
    {
        "test-name": "consents_api_multiple-consents-extension-cond_test-module_v3-2",
        "variant": "*",
        "configuration-filename": "./scripts/configs/phase2/v3/generated/generated-phase2_v3_consents-config.json",
        "current-block": "",
        "condition": "EnsureJointAccountCpfOrCnpjIsPresent",
        "expected-result": "warning",
        "comment": "mb does not support joint account"
    },
    {
        "test-name": "accounts_api_multiple-consents_test-module_v2-4",
        "variant": "*",
        "configuration-filename": "./scripts/configs/phase2/v2/generated/generated-phase2_v2_accounts-config.json",
        "current-block": "",
        "condition": "EnsureJointAccountCpfOrCnpjIsPresent",
        "expected-result": "warning",
        "comment": "MB does not support joint account"
    },
    {
        "test-name": "consents_api_client-limits_test-module_v3-2",
        "variant": "*",
        "configuration-filename": "./scripts/configs/phase2/v3/generated/generated-phase2_v3_consents-config.json",
        "current-block": "Attempt to fetch with second client",
        "condition": "CallTokenEndpoint",
        "expected-result": "failure",
        "comment": "OCI-3657"
    },
    {
        "test-name": "enrollments_api_payments-core_test-module_v2",
        "variant": "*",
        "configuration-filename": "./scripts/configs/phase3/no-redirect-payments/v2/generated/generated-phase3_v2_no_redirect_payments-config.json",
        "current-block": "",
        "condition": "EnsureEnrollmentDoesNotContainExpirationDateTime",
        "expected-result": "failure",
        "comment": "OMB-352"
    },
    {
        "test-name": "enrollments_api_multiple-consents-core_test-module_v2",
        "variant": "*",
        "configuration-filename": "./scripts/configs/phase3/no-redirect-payments/v2/generated/generated-phase3_v2_no_redirect_payments-config.json",
        "current-block": "Post consents authorise - Expects 204",
        "condition": "EnsureResourceResponseCodeWas204",
        "expected-result": "failure",
        "comment": "OMB-365"
    },
    {
        "test-name": "enrollments_api_multiple-consents-core_test-module_v2",
        "variant": "*",
        "configuration-filename": "./scripts/configs/phase3/no-redirect-payments/v2/generated/generated-phase3_v2_no_redirect_payments-config.json",
        "current-block": "Call pix/payments endpoint",
        "condition": "EnsureResourceResponseCodeWas201",
        "expected-result": "failure",
        "comment": "OMB-365"
    },
    {
        "test-name": "enrollments_api_multiple-consents-core_test-module_v2",
        "variant": "*",
        "configuration-filename": "./scripts/configs/phase3/no-redirect-payments/v2/generated/generated-phase3_v2_no_redirect_payments-config.json",
        "current-block": "Validate Consent Self link",
        "condition": "EnsurePaymentConsentStatusWasPartiallyAccepted",
        "expected-result": "warning",
        "comment": "OMB-365"
    },
    {
        "test-name": "enrollments_api_multiple-consents-core_test-module_v2",
        "variant": "*",
        "configuration-filename": "./scripts/configs/phase3/no-redirect-payments/v2/generated/generated-phase3_v2_no_redirect_payments-config.json",
        "current-block": "Validate Consent Self link",
        "condition": "EnsurePaymentConsentStatusWasAuthorised",
        "expected-result": "warning",
        "comment": "OMB-365"
    },
    {
        "test-name": "payments_api_temporization-conditional_test-module_v4",
        "variant": "*",
        "configuration-filename": "./scripts/configs/phase3/v4/generated/generated-phase3_v4_payments-config.json",
        "current-block": "Polling sequence [5]",
        "condition": "ChuckWarning",
        "expected-result": "failure",
        "comment": "OMB-394"
    },
    {
        "test-name": "automatic-payments_api_automatic-pix-wrong-creditor_test-module_v2",
        "variant": "*",
        "configuration-filename": "./scripts/configs/phase3/automatic-payments/v2/pix-payments/generated/generated-phase3_v2_automatic_pix_payments-config.json",
        "current-block": "Call pix/payments endpoint",
        "condition": "EnsureResourceResponseCodeWas201",
        "expected-result": "failure",
        "comment": "OMB-492"
    },
    {
        "test-name": "automatic-payments_api_automatic-pix-unmatching-loggedUser_test-module_v2",
        "variant": "*",
        "configuration-filename": "./scripts/configs/phase3/automatic-payments/v2/pix-payments/generated/generated-phase3_v2_automatic_pix_payments-config.json",
        "current-block": "Validate Consent Self link",
        "condition": "EnsurePaymentConsentStatusWasRejected",
        "expected-result": "failure",
        "comment": "OMB-474"
    },
    {
        "test-name": "automatic-payments_api_automatic-pix-referenceStartDate_test-module_v2",
        "variant": "*",
        "configuration-filename": "./scripts/configs/phase3/automatic-payments/v2/pix-payments/generated/generated-phase3_v2_automatic_pix_payments-config.json",
        "current-block": "Polling sequence [1]",
        "condition": "EnsureRecurringPaymentRejectionReasonCodeWasPagamentoDivergenteConsentimento",
        "expected-result": "failure",
        "comment": "OCI-4035"
    }
]
