{
        "resource": {
            "brazilOrganizationId": "74e929d9-33b6-4d85-8ba7-c146c867a817",
            "brazilQrdnCnpj": "43142666000197",
            "loggedUserIdentification": "87517400444",
            "debtorAccountIspb": "12345678",
            "debtorAccountIssuer": "1774",
            "debtorAccountNumber": "94088393",
            "debtorAccountType": "CACC",
            "paymentAmount": "1333.00",
            "creditorName": "Gabriel Nunes",
            "creditorAccountIspb": "99999004",
            "creditorAccountIssuer": "0001",
            "creditorAccountNumber": "94088393",
            "creditorAccountAccountType": "CACC",
            "creditorCpfCnpj": "87517400444",
            "contractDebtorName": "Example",
            "contractDebtorIdentification": "87517400444"
        },
        "browser": [
            {
                "match": "https://auth.mockbank.poc.raidiam.io/auth*",
                "tasks": [
                    {
                        "task": "Login",
                        "optional": true,
                        "match": "https://auth.mockbank.poc.raidiam.io/interaction*",
                        "commands": [
                            [
                                "text",
                                "name",
                                "username",
                                "gabriel.nunes@email.com",
                                "optional"
                            ],
                            [
                                "text",
                                "name",
                                "password",
                                "P@ssword01",
                                "optional"
                            ],
                            [
                                "click",
                                "xpath",
                                "//button[contains(text(),\"Sign in\")]",
                                "optional"
                            ]
                        ]
                    },
                    {
                        "task": "Retry Login",
                        "optional": true,
                        "match": "https://auth.mockbank.poc.raidiam.io/interaction*",
                        "commands": [
                            [
                                "text",
                                "name",
                                "username",
                                "gabriel.nunes@email.com",
                                "optional"
                            ],
                            [
                                "text",
                                "name",
                                "password",
                                "P@ssword01",
                                "optional"
                            ],
                            [
                                "click",
                                "xpath",
                                "//button[contains(text(),\"Sign in\")]",
                                "optional"
                            ]
                        ]
                    },
                    {
                        "task": "Consent",
                        "optional": true,
                        "match": "https://auth.mockbank.poc.raidiam.io/interaction*",
                        "commands": [
                            [
                                "wait",
                                "xpath",
                                "//*",
                                10,
                                ".*Before sharing your data, we need to confirm some information:*",
                                "update-image-placeholder-optional"
                            ],
                            [
                                "click",
                                "xpath",
                                "//label[@for='consent']/div[1]/div[1]"
                            ],
                            [
                                "click",
                                "id",
                                "consent"
                            ],
                            [
                                "click",
                                "id",
                                "continue"
                            ]
                        ]
                    },
                    {
                        "task": "Verify Complete",
                        "match": "*/test/*/callback*",
                        "commands": [
                            [
                                "wait",
                                "id",
                                "submission_complete",
                                10
                            ]
                        ]
                    }
                ]
            }
        ]
   }

