{
    "alias": "phase4b_v1_treasure_titles",
    "description": "Phase 4b V1- pipeline",
    "server": {
        "discoveryUrl": "https://auth.mockbank.poc.raidiam.io/.well-known/openid-configuration"
    },
    "client": {
        "jwks": {
            "keys": [
                {
                    "kty": "RSA",
                    "kid": "ffU3tFwY5JLMhAEfXzskj1xuH8po08NuZ8i5K7bohGQ",
                    "d": "JYkR8zfjMvR5GTe91exZjU4jDsowlAAHb4BE4Zw8f4zpuK9LIVC3C4bfuo0KMoQeHHxHKaMLfbWy4lEhz4mBJANBN60u4tlu8JMMEInkZhG31w_03TucO5ntRHxaw2u36FhYgRsi3mbuQoVYum1RiwCUzhBiD2_W_4fEhNU4cQkA4OHcWWuiISr3z8Lr1XFHQzTcKOpl_Ckk6ZM1llk2SkGLjrFf5VlzS56jbabpX_YpEIC8d39z_TKuQoS4HRrf8RZzS7YLxlsPrhZlt4KNae1onWdUdmnF4iUEBjmP1lkh_4NQp5pSGCtnUesZ319_cqHO9UN7tvWQM3XDLERpQQ",
                    "n": "tn1U25Jt5gOSQ3jq1mm7gvTqhQmPPAX9j2pIDMiClChJCDkympWoHSF8dOx9yeGgS9ubO0tNWJjaBKJWnLOXus3PlyOGJ1sKEL_5Yhtw4eHg3pJhyewgCsCCoOxjDaUO0HN7ZMxEjJF8AF9SMG2dtUqX5y6k_cHU1xuTdVJyEL8HPhud1z2rN7ZuxyA1caDaBT67B_e67fw_Ap4uCNLgC8CGlIUR5a6m2RziIzqXc_UPhiLJRcGLfANJu6IjNe6-3_1CZf9Uqik1geQ6myho1f9TVZTCBTWDhhkW5SEisJYeBylkNaWZuH8U-DeFX3EX_b5HnIROpOqpMqSBeOB8Sw",
                    "e": "AQAB",
                    "p": "2jbnjOwzm2zzRE2NVGDqu0la9enc-IqETywQh8B4t7TIUW1iZFUTh3vkd3sNY6QmDM8IlEpC1-ILBAS10jFGJ3zGqY8vf67lI3RzPtyfEqqOe2jHZuJXCKVIhf89NjTDMFd4tTftIuz-amgzAnRsxgvHYsX0nbKQGQ7ui6Az9Q0",
                    "q": "1hbMzp1nbjNYMIAOBm7PZx5pyICU7lLF2x_H2qsg8bs-5WK_83nxZ-PK5ODNM65kpBbIht4ZJZyT7wQywu4dyNdRQNTPsJZBX4OtrsGR5y012Mh-A4QjEfkReXB-xqe2gt47PUr-7UCJCDOZVGF-zA4zBwortBc_iSGfWVI5kLc",
                    "dp": "BONN9H4l-clK-bCzBbzWBTPzcaa3aGnR5OQbyq6pBZRrGEfW-GBfe51u1K5Q8nZu08KfcpLnRGav0Hs6h2bLJ39IA-xNKBMG1vB41GOkvIpNfr4uGUPgpzTslvPMrzYnWSHcdlK2YR3l5QRIgDmTZixFXxUIEbA6QhVvinkgMNE",
                    "dq": "lU6tY2NvYPG6DYkhPudFCjuxtr3GIDfl-R4--Yfjn_LguIWYLSvcaoH5XIpTUjnLwoyJKVX3371Fhqo85KnAZ_OSnU5N0m_YA88H8BrbsIhdR2T8TWN4Oe6kezczk0QgC0EFu4d0Ju6dIvUpeCnOjm1QtRYoyJ52FyM1yMuJjh0",
                    "qi": "RsMnp9uaXTiaJOEXJClFyRa5apfQy_zs0x9Guviv7YQLB9qKvptcN6ZnQwAAv7RXjiALXGmvoyCXsrDpxneHHOFqzG7ZcVbROeZR9waJGyHdSf67zbem-8U-fuKi5K_D3ZEhXGLpIe6RT18bf6l_KkU-WDsYUd6qRH3krpnPhpI",
                    "alg": "PS256",
                    "use": "sig"
                },
                {
                    "p": "2a8fRJ7ybF-qtF1zrYzSm7z3C4wNTUMbVYqe44tR9FbKsobqW2tS0iAZf-GJ_SZPcWxkE76gunW7YqMJecGUtXsJ8TTHwjcPQOMYzxnyJu8Q4JOj01YJVrxUY9D0ZzpWM9oTAj1-qoE0w7Dy-XNUc14-HeRlmOkg2tTfrXTVR8c",
                    "kty": "RSA",
                    "q": "0xlPJFRUcBU5j2SKSajVnd4H5p88RSsd4cArMby1ZRuSeHEsX76c6QKAPq7uTfKrTeZic34yzAEUyHloP1fZQYQ2UQn-f6PsTAWdT1Lp5oi2VZCT0yc9-1EGnLAiUCbM9SQQyf2GIVhCiAk_0VuY6le61Pw0U4GssvFJzIrx4as",
                    "d": "GxnizpWcqL1wajD8-Y-8H9-II4UZMKfkgbfwRiLK9uAd8-kEJdO9jdNeMxyytg2saDhxNTeRTkYz_VbBf3p9dGhuYx84d-ZagUbIiU3ho3FCsBRrzQQZw9OQrzPDUzp0-SBn1_GLCf9fo4ysxWHbn9euJVi2fpN_bHlBi1n8fKhdBHYE7X3XJnRYrUXItxZw5sJsqM_boONLxdLAvgmZx5CHft94JZsR6JPwlj9Ba_CuNWX_3OuUGyV0f5_1ICAEYijw9PA8KAW6t5UUYn39_KYL8nF5L1Bh6W1j8eN84I2lcKZNO6Pou064ag_wqGhk4uXuQO1IV8jRFn3-pqhSEQ",
                    "e": "AQAB",
                    "use": "enc",
                    "kid": "c1d7b80ce4b88c4f2cfb68e7a8c45bfff355ae94259bc1a73a95ddbaeaf7c96b",
                    "qi": "pU1IXwiQoFERdzJsx7kSC79Gwhak7uw7OAJCbcfkKE3GSwTWHrKfg5uDZlNvSnNU1Hbpxd0bgc40dFI2aNBML1gyDwTjQplWVJikkFix8E6z_ErSa_D5w5yV4k6CNtt7OzlMXawiZ-ndcuiOs5MkfSRyeB3k5rQmuZjLVzFFlnw",
                    "dp": "Gn4dqBRQHLBn7huRgIWq_Bk7V8RrugN4yChevgKurrYBZUjWLNoa8kfF0rJ4QL7w3DT82QpSNV8utwpwlMjieFPJGfn6dcCNsq_wzQOzXNmrjClrvsSxzkSNYLiFhiqrYxQfTB5_0_B1o3tdls5acM__b1PkqX916CwQLOQTMPE",
                    "alg": "PS256",
                    "dq": "NS0x94fawWVHW6zK_SUvspXkzZ6dMxtaaqza9KuB0ldwvTBdKj09D6FWpvOwCiiwKG55rHhE2YkIMDwNG6_Iha2FdUKcPpEPjFL5vqq3SyBzNfi2lEFVZsKRdNUVv7UWekY8iHV53Vp7YANcdSOq0JWK9e4WTFblJyqLGaCCsAM",
                    "n": "s4DcK4uxKroJPE1R7Te4ppNexbuK3C-Z3MpXFr5hmY43gYIoVMo89jE6OcDiO0Z4rxe8dsH4oYA2vAJQ0IhAaUxYMk2kN01ei761zMQWHLUPLcEKWgipYHy4AgwAUaF7-Glyb0DT1RRcY4f1tEddftxhwXZjeFduj6luVg6fVvXRIRjttybUkIKvf5ShMofVFCF_IyjYlOal4g3DVnCg62dR71WX3fRXSufxrRBG-L61rv2VSMg8pIb1DFiYKDlEXEnTdLk-7goBpTIz3wBsrZgJESSZOn_BG_-fCE0V75rheLMuJd4IGE4H0taVfEQOJKRKBVzc2jAz0sOaVuPY7Q"
                }
            ]
        },
        "client_id": "hcGG31HvR3SqOlHva6XKk",
        "org_jwks": {
            "keys": [
                {
                    "kty": "RSA",
                    "kid": "ffU3tFwY5JLMhAEfXzskj1xuH8po08NuZ8i5K7bohGQ",
                    "d": "JYkR8zfjMvR5GTe91exZjU4jDsowlAAHb4BE4Zw8f4zpuK9LIVC3C4bfuo0KMoQeHHxHKaMLfbWy4lEhz4mBJANBN60u4tlu8JMMEInkZhG31w_03TucO5ntRHxaw2u36FhYgRsi3mbuQoVYum1RiwCUzhBiD2_W_4fEhNU4cQkA4OHcWWuiISr3z8Lr1XFHQzTcKOpl_Ckk6ZM1llk2SkGLjrFf5VlzS56jbabpX_YpEIC8d39z_TKuQoS4HRrf8RZzS7YLxlsPrhZlt4KNae1onWdUdmnF4iUEBjmP1lkh_4NQp5pSGCtnUesZ319_cqHO9UN7tvWQM3XDLERpQQ",
                    "n": "tn1U25Jt5gOSQ3jq1mm7gvTqhQmPPAX9j2pIDMiClChJCDkympWoHSF8dOx9yeGgS9ubO0tNWJjaBKJWnLOXus3PlyOGJ1sKEL_5Yhtw4eHg3pJhyewgCsCCoOxjDaUO0HN7ZMxEjJF8AF9SMG2dtUqX5y6k_cHU1xuTdVJyEL8HPhud1z2rN7ZuxyA1caDaBT67B_e67fw_Ap4uCNLgC8CGlIUR5a6m2RziIzqXc_UPhiLJRcGLfANJu6IjNe6-3_1CZf9Uqik1geQ6myho1f9TVZTCBTWDhhkW5SEisJYeBylkNaWZuH8U-DeFX3EX_b5HnIROpOqpMqSBeOB8Sw",
                    "e": "AQAB",
                    "p": "2jbnjOwzm2zzRE2NVGDqu0la9enc-IqETywQh8B4t7TIUW1iZFUTh3vkd3sNY6QmDM8IlEpC1-ILBAS10jFGJ3zGqY8vf67lI3RzPtyfEqqOe2jHZuJXCKVIhf89NjTDMFd4tTftIuz-amgzAnRsxgvHYsX0nbKQGQ7ui6Az9Q0",
                    "q": "1hbMzp1nbjNYMIAOBm7PZx5pyICU7lLF2x_H2qsg8bs-5WK_83nxZ-PK5ODNM65kpBbIht4ZJZyT7wQywu4dyNdRQNTPsJZBX4OtrsGR5y012Mh-A4QjEfkReXB-xqe2gt47PUr-7UCJCDOZVGF-zA4zBwortBc_iSGfWVI5kLc",
                    "dp": "BONN9H4l-clK-bCzBbzWBTPzcaa3aGnR5OQbyq6pBZRrGEfW-GBfe51u1K5Q8nZu08KfcpLnRGav0Hs6h2bLJ39IA-xNKBMG1vB41GOkvIpNfr4uGUPgpzTslvPMrzYnWSHcdlK2YR3l5QRIgDmTZixFXxUIEbA6QhVvinkgMNE",
                    "dq": "lU6tY2NvYPG6DYkhPudFCjuxtr3GIDfl-R4--Yfjn_LguIWYLSvcaoH5XIpTUjnLwoyJKVX3371Fhqo85KnAZ_OSnU5N0m_YA88H8BrbsIhdR2T8TWN4Oe6kezczk0QgC0EFu4d0Ju6dIvUpeCnOjm1QtRYoyJ52FyM1yMuJjh0",
                    "qi": "RsMnp9uaXTiaJOEXJClFyRa5apfQy_zs0x9Guviv7YQLB9qKvptcN6ZnQwAAv7RXjiALXGmvoyCXsrDpxneHHOFqzG7ZcVbROeZR9waJGyHdSf67zbem-8U-fuKi5K_D3ZEhXGLpIe6RT18bf6l_KkU-WDsYUd6qRH3krpnPhpI",
                    "alg": "PS256",
                    "use": "sig"
                },
                {
                    "p": "2a8fRJ7ybF-qtF1zrYzSm7z3C4wNTUMbVYqe44tR9FbKsobqW2tS0iAZf-GJ_SZPcWxkE76gunW7YqMJecGUtXsJ8TTHwjcPQOMYzxnyJu8Q4JOj01YJVrxUY9D0ZzpWM9oTAj1-qoE0w7Dy-XNUc14-HeRlmOkg2tTfrXTVR8c",
                    "kty": "RSA",
                    "q": "0xlPJFRUcBU5j2SKSajVnd4H5p88RSsd4cArMby1ZRuSeHEsX76c6QKAPq7uTfKrTeZic34yzAEUyHloP1fZQYQ2UQn-f6PsTAWdT1Lp5oi2VZCT0yc9-1EGnLAiUCbM9SQQyf2GIVhCiAk_0VuY6le61Pw0U4GssvFJzIrx4as",
                    "d": "GxnizpWcqL1wajD8-Y-8H9-II4UZMKfkgbfwRiLK9uAd8-kEJdO9jdNeMxyytg2saDhxNTeRTkYz_VbBf3p9dGhuYx84d-ZagUbIiU3ho3FCsBRrzQQZw9OQrzPDUzp0-SBn1_GLCf9fo4ysxWHbn9euJVi2fpN_bHlBi1n8fKhdBHYE7X3XJnRYrUXItxZw5sJsqM_boONLxdLAvgmZx5CHft94JZsR6JPwlj9Ba_CuNWX_3OuUGyV0f5_1ICAEYijw9PA8KAW6t5UUYn39_KYL8nF5L1Bh6W1j8eN84I2lcKZNO6Pou064ag_wqGhk4uXuQO1IV8jRFn3-pqhSEQ",
                    "e": "AQAB",
                    "use": "enc",
                    "kid": "c1d7b80ce4b88c4f2cfb68e7a8c45bfff355ae94259bc1a73a95ddbaeaf7c96b",
                    "qi": "pU1IXwiQoFERdzJsx7kSC79Gwhak7uw7OAJCbcfkKE3GSwTWHrKfg5uDZlNvSnNU1Hbpxd0bgc40dFI2aNBML1gyDwTjQplWVJikkFix8E6z_ErSa_D5w5yV4k6CNtt7OzlMXawiZ-ndcuiOs5MkfSRyeB3k5rQmuZjLVzFFlnw",
                    "dp": "Gn4dqBRQHLBn7huRgIWq_Bk7V8RrugN4yChevgKurrYBZUjWLNoa8kfF0rJ4QL7w3DT82QpSNV8utwpwlMjieFPJGfn6dcCNsq_wzQOzXNmrjClrvsSxzkSNYLiFhiqrYxQfTB5_0_B1o3tdls5acM__b1PkqX916CwQLOQTMPE",
                    "alg": "PS256",
                    "dq": "NS0x94fawWVHW6zK_SUvspXkzZ6dMxtaaqza9KuB0ldwvTBdKj09D6FWpvOwCiiwKG55rHhE2YkIMDwNG6_Iha2FdUKcPpEPjFL5vqq3SyBzNfi2lEFVZsKRdNUVv7UWekY8iHV53Vp7YANcdSOq0JWK9e4WTFblJyqLGaCCsAM",
                    "n": "s4DcK4uxKroJPE1R7Te4ppNexbuK3C-Z3MpXFr5hmY43gYIoVMo89jE6OcDiO0Z4rxe8dsH4oYA2vAJQ0IhAaUxYMk2kN01ei761zMQWHLUPLcEKWgipYHy4AgwAUaF7-Glyb0DT1RRcY4f1tEddftxhwXZjeFduj6luVg6fVvXRIRjttybUkIKvf5ShMofVFCF_IyjYlOal4g3DVnCg62dR71WX3fRXSufxrRBG-L61rv2VSMg8pIb1DFiYKDlEXEnTdLk-7goBpTIz3wBsrZgJESSZOn_BG_-fCE0V75rheLMuJd4IGE4H0taVfEQOJKRKBVzc2jAz0sOaVuPY7Q"
                }
            ]
        }
    },
    "mtls": {
        "cert": "-----BEGIN CERTIFICATE-----\nMIIHNjCCBh6gAwIBAgIURKoxymww4fT4+5UeLUxKxpG5zXwwDQYJKoZIhvcNAQEL\nBQAweTELMAkGA1UEBhMCQlIxHDAaBgNVBAoTE09wZW4gRmluYW5jZSBCcmFzaWwx\nHTAbBgNVBAsTFE9wZW4gRmluYW5jZSBzYW5kYm94MS0wKwYDVQQDEyRPcGVuIEZp\nbmFuY2Ugc2FuZGJveCBJc3N1aW5nIENBIC0gRzIwHhcNMjQxMDA5MjA1NzAwWhcN\nMjUxMTA4MjA1NzAwWjCCAUAxCzAJBgNVBAYTAkJSMQswCQYDVQQIEwJzcDEPMA0G\nA1UEBxMGTE9ORE9OMRwwGgYDVQQKExNPcGVuIEJhbmtpbmcgQnJhc2lsMS0wKwYD\nVQQLEyQ3NGU5MjlkOS0zM2I2LTRkODUtOGJhNy1jMTQ2Yzg2N2E4MTcxQzBBBgNV\nBAMTOmh0dHBzOi8vd2ViLmNvbmZvcm1hbmNlLmRpcmVjdG9yeS5vcGVuYmFua2lu\nZ2JyYXNpbC5vcmcuYnIxFzAVBgNVBAUTDjQzMTQyNjY2MDAwMTk3MR0wGwYDVQQP\nExRQcml2YXRlIE9yZ2FuaXphdGlvbjETMBEGCysGAQQBgjc8AgEDEwJVSzE0MDIG\nCgmSJomT8ixkAQETJGM1NTI2YjBhLThhM2UtNDczYy04YmY2LWM4NWM4ZDMxODY4\nNzCCASIwDQYJKoZIhvcNAQEBBQADggEPADCCAQoCggEBAKyPBHPp9qpS1Xedmeko\nfxBmA9IVAEjXWi5Zs8N5duDwgN+khK3aSKLmDgxkpcEGlsv7lZNzUgLt0gezDuNN\nP7nQ2s1DfIJOM0Bj0jout4k25A5/v7Ui1VE7lawg6KJspIttaVWBMUVHfTt+EELm\n35MlBtyuJ74Ulp4bn5kTBFslOUh9ciLXXhzwgBoSj4kQ09HigiQjmCSDEFBkudRA\no559tITYe/3sJ0T47FXv/BJgsqbb/kA3kmGSEDDO12hecQQ1tDoNm3dHlvTMHCS6\nHsv5ZADGWbePReNbnGokl1k66iDlqXdvtVtH7nK4xuNSDmJnASAAGfdk9Sep3p06\nOFcCAwEAAaOCAuswggLnMAwGA1UdEwEB/wQCMAAwHQYDVR0OBBYEFM5kJuojUxpg\nO9jDTuKvWJ5TE7brMB8GA1UdIwQYMBaAFHrvC4jYeonhvS8EPR6x1sRHQig9MFkG\nCCsGAQUFBwEBBE0wSzBJBggrBgEFBQcwAYY9aHR0cDovL29jc3AucGtpLWcyLnNh\nbmRib3guZGlyZWN0b3J5Lm9wZW5iYW5raW5nYnJhc2lsLm9yZy5icjBYBgNVHR8E\nUTBPME2gS6BJhkdodHRwOi8vY3JsLnBraS1nMi5zYW5kYm94LmRpcmVjdG9yeS5v\ncGVuYmFua2luZ2JyYXNpbC5vcmcuYnIvaXNzdWVyLmNybDBFBgNVHREEPjA8gjpo\ndHRwczovL3dlYi5jb25mb3JtYW5jZS5kaXJlY3Rvcnkub3BlbmJhbmtpbmdicmFz\naWwub3JnLmJyMA4GA1UdDwEB/wQEAwIFoDATBgNVHSUEDDAKBggrBgEFBQcDAjCC\nAXQGA1UdIASCAWswggFnMIIBYwYLKwYBBAGDui9wAQIwggFSMIH1BggrBgEFBQcC\nAjCB6AyB5VRoaXMgQ2VydGlmaWNhdGUgaXMgc29sZWx5IGZvciB1c2Ugd2l0aCBP\ncGVuIEZpbmFuY2UgQnJhc2lsIHNhbmRib3ggQVBJcyBTZXJ2aWNlcy4gSXRzIHJl\nY2VpcHQsIHBvc3Nlc3Npb24gb3IgdXNlIGNvbnN0aXR1dGVzIGFjY2VwdGFuY2Ug\nb2YgdGhlIE9wZW4gRmluYW5jZSBCcmFzaWwgc2FuZGJveCBvZiBBUElzIENlcnRp\nZmljYXRlIFBvbGljeSBhbmQgcmVsYXRlZCBkb2N1bWVudHMgdGhlcmVpbi4wWAYI\nKwYBBQUHAgEWTGh0dHA6Ly9yZXBvc2l0b3J5LnBraS1nMi5zYW5kYm94LmRpcmVj\ndG9yeS5vcGVuYmFua2luZ2JyYXNpbC5vcmcuYnIvcG9saWNpZXMwDQYJKoZIhvcN\nAQELBQADggEBAHzV8vV9AdAxYw1jlt8gNU+hU0obxwSfhfjypUh7EUXUgz//l1dX\n+bbX6foufNW921Ubxo/yrpa7bJ0mXsJg0InZKiT3h9A4ALk01bzvxudjh8SjB0RE\nizvYC7fHCeP66fRlsha9kzj+faASrTWZwK4mt4vgEkv4qBwKHiE9qQdI8VQWIhCn\nN1EIXwIPARHUpu1o/Dqw8oLILOLhv1s4P9e7vua6bfCkxmhX6+kT6NYkb3AI4Ge2\n2Kb8oYMp232fOWQYkhtMCL1mGlqvRlQUehhyasljeveD/EWVJiDgooSbLi1xARhj\nqrBf4rg6yBfLrIOQUvs/v8uhwV2VEpJRUY8=\n-----END CERTIFICATE-----",
        "key": "-----BEGIN PRIVATE KEY-----\nMIIEvQIBADANBgkqhkiG9w0BAQEFAASCBKcwggSjAgEAAoIBAQCsjwRz6faqUtV3\nnZnpKH8QZgPSFQBI11ouWbPDeXbg8IDfpISt2kii5g4MZKXBBpbL+5WTc1IC7dIH\nsw7jTT+50NrNQ3yCTjNAY9I6LreJNuQOf7+1ItVRO5WsIOiibKSLbWlVgTFFR307\nfhBC5t+TJQbcrie+FJaeG5+ZEwRbJTlIfXIi114c8IAaEo+JENPR4oIkI5gkgxBQ\nZLnUQKOefbSE2Hv97CdE+OxV7/wSYLKm2/5AN5JhkhAwztdoXnEENbQ6DZt3R5b0\nzBwkuh7L+WQAxlm3j0XjW5xqJJdZOuog5al3b7VbR+5yuMbjUg5iZwEgABn3ZPUn\nqd6dOjhXAgMBAAECggEAIzhjt8cCxjv2/x2nWvwdhzrTP89yieuOqBQ+CUFi/sGI\nBF2/iP6bQciECIqIfG/8WnEk0/4/OILTEig9ey56udIDvs6t/Ki6dEOLlr2PT43p\nGX6AoheUg6qOP55N7U0Qfrbbv4yJgnL3gCuYZRdbfdyaXHOdgAISxf2sYyGLC5Ek\nYoFpZcaUXXWG2Upq8Jhp6ABsZI+8fl+xntx3MV4VnTYUyE+WSqDNqyrpzErBmW+t\nBiqI5IaQexLqJFHpRq+y5rhf8hN6CibAdYjqWybfxL+GgpHBMYlvQ733P6Fkj6ma\n6QS3vOFql0UJr8M26eQQe+Nl2BkwQRg9G5hSBJ3ZYQKBgQDwKBp7ZaCMIKIz4K9g\n5yRmtbjQO9op6jlvgZPCO8W4UgySHOABjoCNIEBAe4NhKaM2dC9v2SGEC4YkLqv7\ntdFHX3Sn7awGUCv0nzBgGhvQl9BhjaevOTiszU9aK4mzt+EmLhy2UYfkPZsc3ksh\nv9cG9k+TvyxJTeGd+9bbLhx2IQKBgQC38Ug9SbT5vArZcn/zqIxQn+mTMOw8oRza\n1Vc4MJCaVsq4PWtwQl4YNM4p+oIUf75dwwzgfA192dBhHAnaPblGMIOQXIGn4Hul\nxhXCwfTW88ilBBXbgpC5WXd/u7Ur7sesfgpb1M4dccZUnLn+L5X32rYus4M/K1rv\nrQRZX+dvdwKBgDPBsNNfN5Z7gfmENse/iMzJ5Sabf40A+ZfaaSm3EAmFRUhICM7N\nE09W4AIFnG7YNmCJ8Z89QEfg4+vwUwhQSuYC4HVAd450wMRbemV7uvrdfP9JNBZD\nUr+LD8rzDx44RsGftnhkYdECpec20SJY4dKSStwgmz7BFhqiJ8/cxC2BAoGARlSJ\nDHX8LmiJtW6kIaPWUpVyF4djLCNmBv3/ZUqcX4bD6AID7F5T3+mA0mgoCHJ3dR44\n9DQ6bF414It58OocxwuRokbchDW+0TmV5GuIlA+OLhoLyWx4rYXZvQsmUG/yBLAE\ngewyCuwPqxZpvxiuvJ/xfJXCnwqSsIV03j9fHC0CgYEA7YmKpku7qnsQLPrcoB8q\nFn+7OkE9jyNz+HY9ebqFOoxTN7+A8WpzSzl0iYRk8hXyIvmew7/RNiHp2HM0/4qT\n0VcyjCcHSNlgrtM6SRCLFArwOH8JgG1h3VcwsKcTsZmLJB8ssK46kgN8Eg2HEXUD\nNYmwZgaCvV6QK43VxiCjHho=\n-----END PRIVATE KEY-----",
        "ca": "-----BEGIN CERTIFICATE-----\nMIIHFDCCBPygAwIBAgIUZJOYHaqMZR7leKm8iaKrR380T8QwDQYJKoZIhvcNAQEN\nBQAwdjELMAkGA1UEBhMCQlIxHDAaBgNVBAoTE09wZW4gRmluYW5jZSBCcmFzaWwx\nHTAbBgNVBAsTFE9wZW4gRmluYW5jZSBzYW5kYm94MSowKAYDVQQDEyFPcGVuIEZp\nbmFuY2Ugc2FuZGJveCBSb290IENBIC0gRzIwHhcNMjMwMzA5MTQzNjAwWhcNMzMw\nMzA2MTQzNjAwWjB5MQswCQYDVQQGEwJCUjEcMBoGA1UEChMTT3BlbiBGaW5hbmNl\nIEJyYXNpbDEdMBsGA1UECxMUT3BlbiBGaW5hbmNlIHNhbmRib3gxLTArBgNVBAMT\nJE9wZW4gRmluYW5jZSBzYW5kYm94IElzc3VpbmcgQ0EgLSBHMjCCASIwDQYJKoZI\nhvcNAQEBBQADggEPADCCAQoCggEBAJJZYsafIn0x1j8WLDfJ3HSXt65NqnKwGdcW\nn4z4VqdrvcIl6kJM7cjF3ImaN5SLideuK63/QP4tgGilZxooxLE8V8M/uPgGU74K\noTMBuDho6sND/UtHsr/wgkX9+/Kn50vdLbhXZBmvcL+5gtXKDQGR+d1LyaU8EigX\nkhvegMCSyW72PlQ9FetapanOpH0e5+osGRVI9ysm7PFrWE6UOs8EA/d6+v8SwHTW\nbD6iVVgtGnQtm0C4w4H6VVNnFE0F8pSnXQQPzQXMONIFi/UZPSB00H0qnxRvWkw3\nJa7QErS8hdMPGUHQ9N/RujhMhf7tlUArcgod6mc+SYfcI3j1pUcCAwEAAaOCApUw\nggKRMA4GA1UdDwEB/wQEAwIBBjASBgNVHRMBAf8ECDAGAQH/AgEAMB0GA1UdDgQW\nBBR67wuI2HqJ4b0vBD0esdbER0IoPTAfBgNVHSMEGDAWgBQVb9vsej3AhKXXgbWR\nvfmoWNM++jBZBggrBgEFBQcBAQRNMEswSQYIKwYBBQUHMAGGPWh0dHA6Ly9vY3Nw\nLnBraS1nMi5zYW5kYm94LmRpcmVjdG9yeS5vcGVuYmFua2luZ2JyYXNpbC5vcmcu\nYnIwWAYDVR0fBFEwTzBNoEugSYZHaHR0cDovL2NybC5wa2ktZzIuc2FuZGJveC5k\naXJlY3Rvcnkub3BlbmJhbmtpbmdicmFzaWwub3JnLmJyL2lzc3Vlci5jcmwwggF0\nBgNVHSAEggFrMIIBZzCCAWMGCysGAQQBg7ovcAECMIIBUjCB9QYIKwYBBQUHAgIw\ngegMgeVUaGlzIENlcnRpZmljYXRlIGlzIHNvbGVseSBmb3IgdXNlIHdpdGggT3Bl\nbiBGaW5hbmNlIEJyYXNpbCBzYW5kYm94IEFQSXMgU2VydmljZXMuIEl0cyByZWNl\naXB0LCBwb3NzZXNzaW9uIG9yIHVzZSBjb25zdGl0dXRlcyBhY2NlcHRhbmNlIG9m\nIHRoZSBPcGVuIEZpbmFuY2UgQnJhc2lsIHNhbmRib3ggb2YgQVBJcyBDZXJ0aWZp\nY2F0ZSBQb2xpY3kgYW5kIHJlbGF0ZWQgZG9jdW1lbnRzIHRoZXJlaW4uMFgGCCsG\nAQUFBwIBFkxodHRwOi8vcmVwb3NpdG9yeS5wa2ktZzIuc2FuZGJveC5kaXJlY3Rv\ncnkub3BlbmJhbmtpbmdicmFzaWwub3JnLmJyL3BvbGljaWVzMA0GCSqGSIb3DQEB\nDQUAA4ICAQCANeSAlmJy3e9rrgTGShVCyMQhy68j3cAJyFzqCutyNMGHUgFOjAgD\nzIUQZmAepTDJdhJF+BoruBfAIJUr6tD9EBw2MZXiTLHZG9mqtGwsMbeI3o3R9Y3G\nEpGp72jIHw7mtUZdoaWcmgqxCWn6UT9bBKAkdt6KyRepPUy1YI59MZxpVOs5J0s2\nQFd3FRCNxdzgsuGqdxTb1Gre4I5E1vJWcp1Fe/kPdaOgPVC89M6uk3WYTnMNZ20N\n8K0ecXy8+E3K+to35berWn16g1ZrufylX6s2yyxcsUnh5KP1smFd8MePekKIW0SD\n8hqD1MtGQEmzdWrPCT9fZUzONj4VuDcl/vgfKUBsBszTmqwGF34G+663v10KUhga\nkCiIOZtkT9B+aESGAfczQiFO1h4cI52TKwEptfbplrFS2gILrzleqv0JoDDFYVhY\nV5AVDjqeHaniClCi10JdSN11LqNdagpyojN2a2WhVSAigIT3yDeqozlzjgPui/1E\nDt0zBkXd5uFDwNeLUwOribuS3hxVG5Bg73ZJl+UV3ZuAzFFCfkVBz6BeqUusf8+P\n3pqAQ4gzhSWNsTBIsjaVV8ZU8IqxKhBkRUSNjihG2kM8kX9knQvRbCBuuse/dDUe\n4cUJ+wT1omVgq+TWhShOAjsHEa233omXbH7v5igLBEkzzqmM5cAv8Q==\n-----END CERTIFICATE-----\n-----BEGIN CERTIFICATE-----\nMIIFvDCCA6SgAwIBAgIUKhBUxL5Dt4w3xH1V3X1n+x/e3hcwDQYJKoZIhvcNAQEN\nBQAwdjELMAkGA1UEBhMCQlIxHDAaBgNVBAoTE09wZW4gRmluYW5jZSBCcmFzaWwx\nHTAbBgNVBAsTFE9wZW4gRmluYW5jZSBzYW5kYm94MSowKAYDVQQDEyFPcGVuIEZp\nbmFuY2Ugc2FuZGJveCBSb290IENBIC0gRzIwHhcNMjMwMzA5MTQzNjAwWhcNMzgw\nMzA1MTQzNjAwWjB2MQswCQYDVQQGEwJCUjEcMBoGA1UEChMTT3BlbiBGaW5hbmNl\nIEJyYXNpbDEdMBsGA1UECxMUT3BlbiBGaW5hbmNlIHNhbmRib3gxKjAoBgNVBAMT\nIU9wZW4gRmluYW5jZSBzYW5kYm94IFJvb3QgQ0EgLSBHMjCCAiIwDQYJKoZIhvcN\nAQEBBQADggIPADCCAgoCggIBALJFBgmKj3iDF3C8+8smNNQDxLFA9kCcca1iaxQf\nvMI/FKGW2ullHhH+W3EGEajn39QOlccGyrfCONHLqMW53+HAMtwiIvcrJgj72V7D\nnYflO3aaCFwoC31PL1+pMBo88F6jvezZ8BlRnheT7urCs6+onhz8pm0cVNc77U5X\npi8IOJz1QFKecJnFLjG0NiLCzOzjLSo0A8Rue9K/H5fjq+PqKdXG94AoQyFUwlsU\ny4aXbylDz1kRiOSnOlRNPcY/su95pFKQbGgaZZ1fLf89i5PtHAUu92FbD7H7OyYX\nXpZ97La0d7cUH0A4nb+LpOd/f0c8lAN2Ya1B8aKvWiF23q3c8EoAJyhrdkHKe6yI\nYvLC5G5jkbJefeQcp34IgD8T+Tn3aBF7YgmlYUMbnsuokBG28Hr50EAklCclA0bb\n4pmf8nE6y7VQ0CM/bNZd1F9AjxLukkyvkrOD6A6uv+c5KeC+da245dBzsyhiKe9R\nRX5Gkf7NSkDu9b9YkdDaWV6LXxpUA0SmdT9M16yK3XPDKOWBI4gVSB1KuwrOcal/\ndMwFUlxvqdGugRbxDNNukxa0l3JztGg6XYLjEiiYrQ+7HChbUVNlM0l0VZAz4eON\ngYrq2ExUDWlQXiES389/Qz3R3yDk9ib1YsMHwAux2ulCssFVn4EgtnYFfgf3o01J\n3CedAgMBAAGjQjBAMA4GA1UdDwEB/wQEAwIBBjAPBgNVHRMBAf8EBTADAQH/MB0G\nA1UdDgQWBBQVb9vsej3AhKXXgbWRvfmoWNM++jANBgkqhkiG9w0BAQ0FAAOCAgEA\nVPrUd4UDjOhkxOzSN4bMr0cULZJwQPRV8aj99tzdv8Ef44CwLVkLmm7Z2d1uRA9l\n7xbK6W8L1oL95iV4K4o2u4+ZFG7mrOfU2T2wgTfMlIxHDoAxS49flUYkBpQI1Wj4\nJBZ6fKGFVH6PyIio0I2Mx2u80ZX6lPYQ2q4DR6eBUoNt8T8XSWpD4TjroFbOVIp+\nN84alBca/pvW2aF2HwPndrL/Y++HZp3TpdUeBUT757KOZ7hdwf30pxd8qNn8+peb\nbP2h6b9pjKAmS8ciBExJzchhQWJRP6LIdvexTsBQ1HLxlZNrlg66wYT0kuVVzRTa\n0qRvIjQ0ntmhy2DtmE5VFT9O8ahcQL5Ddk8B4dhiy59vjALS6kIUXJ6GCobzRUsQ\na7b7J7nu+PTY+qVo0LsTMO1rVTUXD63gVk8QmPUwnvduk9nxraNpVP+m17BuEcls\nEsoGAAQYcmzOlnZpqhhbTnbsEayW1bMyxkLjBjXpOfBgrvyv5fU/09lP6VB20FJr\nzVPZWr5PTzaaizDDecSKgZ1ANIwXIIwWirwzDqqQb922JtcH+Ca6JJWgrV7+kDCU\ncVzwKVYievjXMCsmRSzDKEgp4n1AgrxcoaH0smD+qA+wzfsMqvEA1iTNW7zdnF0o\n6UJ9rkWxKr+JRZ5jFO+kpKQ1DxfDJZE554aO8AXzYEI=\n-----END CERTIFICATE-----\n"
    },
    "directory": {
        "keystore": "https://keystore.sandbox.directory.openbankingbrasil.org.br/",
        "client_id": "c5526b0a-8a3e-473c-8bf6-c85c8d318687"
    },
    "resource": {
        "consentUrl": "https://matls-api.mockbank.poc.raidiam.io/open-banking/payments/v3/consents",
        "brazilOrganizationId": "74e929d9-33b6-4d85-8ba7-c146c867a817",
        "brazilCpf": "76109277673",
        "brazilCpfOperational": "76109277673",
        "brazilCpfPaginationList": "76109277673"
    },
    "consent": {},
    "browser": [
        {
            "match": "https://auth.mockbank.poc.raidiam.io/auth*",
            "tasks": [
                {
                    "task": "Login",
                    "optional": true,
                    "match": "https://auth.mockbank.poc.raidiam.io/interaction*",
                    "commands": [
                        [
                            "text",
                            "name",
                            "username",
                            "ralph.bragg@gmail.com",
                            "optional"
                        ],
                        [
                            "text",
                            "name",
                            "password",
                            "P@ssword01",
                            "optional"
                        ],
                        [
                            "click",
                            "xpath",
                            "//button[contains(text(),\"Sign in\")]",
                            "optional"
                        ]
                    ]
                },
                {
                    "task": "Retry Login",
                    "optional": true,
                    "match": "https://auth.mockbank.poc.raidiam.io/interaction*",
                    "commands": [
                        [
                            "text",
                            "name",
                            "username",
                            "ralph.bragg@gmail.com",
                            "optional"
                        ],
                        [
                            "text",
                            "name",
                            "password",
                            "P@ssword01",
                            "optional"
                        ],
                        [
                            "click",
                            "xpath",
                            "//button[contains(text(),\"Sign in\")]",
                            "optional"
                        ]
                    ]
                },
                {
                    "task": "Consent",
                    "optional": true,
                    "match": "https://auth.mockbank.poc.raidiam.io/interaction*",
                    "commands": [
                        [
                            "wait",
                            "xpath",
                            "//*",
                            10,
                            ".*Before sharing your data, we need to confirm some information:*",
                            "update-image-placeholder-optional"
                        ],
                        [
                            "click",
                            "id",
                            "consent"
                        ],
                        [
                            "click",
                            "id",
                            "continue"
                        ]
                    ]
                },
                {
                    "task": "Verify Complete",
                    "match": "*/test/*/callback*",
                    "commands": [
                        [
                            "wait",
                            "id",
                            "submission_complete",
                            10
                        ]
                    ]
                }
            ]
        }
    ],
    "override": {}
}