{
    "resource": {
        "resourceUrl": "https://matls-api.mockbank.poc.raidiam.io/open-banking/payments/v3/pix/payments",
        "consentUrl": "https://matls-api.mockbank.poc.raidiam.io/open-banking/payments/v3/consents",
        "enrollmentsUrl": "https://matls-api.mockbank.poc.raidiam.io/open-banking/enrollments/v2/enrollments",
        "webhookWaitTime": "5",
        "brazilPaymentConsent": {
            "data": {
                "loggedUser": {
                    "document": {
                        "identification": "76109277673",
                        "rel": "CPF"
                    }
                },
                "creditor": {
                    "personType": "PESSOA_NATURAL",
                    "cpfCnpj": "48847377765",
                    "name": "Marco Antonio de Brito"
                },
                "payment": {
                    "type": "PIX",
                    "date": "2021-01-01",
                    "currency": "BRL",
                    "amount": "1333.00",
                    "details": {
                        "localInstrument": "DICT",
                        "proxy": "12345678901",
                        "creditorAccount": {
                            "ispb": "12345678",
                            "issuer": "1774",
                            "number": "1234567890",
                            "accountType": "CACC"
                        }
                    }
                },
                "debtorAccount": {
                    "ispb": "12345678",
                    "issuer": "6272",
                    "number": "94088392",
                    "accountType": "CACC"
                }
            }
        },
        "brazilQrdnPaymentConsent": {
            "data": {
                "loggedUser": {
                    "document": {
                        "identification": "76109277673",
                        "rel": "CPF"
                    }
                },
                "creditor": {
                    "personType": "PESSOA_NATURAL",
                    "cpfCnpj": "48847377765",
                    "name": "Marco Antonio de Brito"
                },
                "payment": {
                    "type": "PIX",
                    "date": "2021-01-01",
                    "currency": "BRL",
                    "amount": "1333.00",
                    "igbeTownCode": "oiweowew",
                    "details": {
                        "localInstrument": "QRDN",
                        "proxy": "cliente-a00001@pix.bcb.gov.br",
                        "qrCode": "00020126510014BR.GOV.BCB.PIX0129cliente-a00001@pix.bcb.gov.br52040000530398654071333.005802BR5922Marco Antonio de Brito6014BELO HORIZONTE62070503***6304B62D",
                        "creditorAccount": {
                            "ispb": "12345678",
                            "issuer": "1774",
                            "number": "1234567890",
                            "accountType": "CACC"
                        }
                    }
                },
                "debtorAccount": {
                    "ispb": "12345678",
                    "issuer": "6272",
                    "number": "94088392",
                    "accountType": "CACC"
                }
            }
        },
        "brazilCpf": "76109277673",
        "brazilOrganizationId": "74e929d9-33b6-4d85-8ba7-c146c867a817",
        "loggedUserIdentification": "76109277673",
        "debtorAccountIspb": "12345678",
        "debtorAccountIssuer": "1774",
        "debtorAccountNumber": "94088392",
        "debtorAccountType": "CACC",
        "paymentAmount": "100.00"
    }
}
