name=slliw
input.rst=0
input.aluop_i=44
input.aluse_i=1
input.reg1_i=${64,0x1234567812345678}
input.reg2_i=${64,0x2234567812345678}
input.wd_i=${5,5}
input.wreg_i=${1,1}
input.imm=${64,0x1234567812345678}
input.pc_in=0
result=slliw
------------------