\begin{thebibliography}{1}

\bibitem{Falconer1997}
Kenneth Falconer.
\newblock {\em {Fractal Geometry: Mathematical Foundations and Applications}}.
\newblock 1997.

\bibitem{Kennedy1991}
Judy Kennedy and James~A. Yorke.
\newblock {Basins of Wada}.
\newblock {\em Physica D: Nonlinear Phenomena}, 51(1-3):213--225, aug 1991.

\bibitem{Mandelbrot1983}
Benoit~B. Mandelbrot.
\newblock {\em {The Fractal Geometry of Nature}}.
\newblock 1983.

\bibitem{Strogatz1994}
Steven~Henry Strogatz.
\newblock {\em {Nonlinear Dynamics and Chaos: With Applications to Physics,
  Biology, Chemistry, and Engineering}}.
\newblock 1994.

\end{thebibliography}
