// Jest Snapshot v1, https://goo.gl/fbAQLP

exports[`should provide routes through context 1`] = `
TypedRoutesConfig {
  "_flattenRouteObjectsCache": null,
  "_flattenRoutesCache": null,
  "_options": {
    "basePath": "",
    "routes": [Function],
  },
  "_routesCache": RouteGroup {
    "a": RouteConfig {
      "_component": <withPathProps(DefaultLayout)>
        <withPathProps(DummyComponent) />
      </withPathProps(DefaultLayout)>,
      "_options": {
        "hoc": {},
      },
      "_path": "",
    },
  },
}
`;
