// Jest Snapshot v1, https://goo.gl/fbAQLP

exports[`should match snapshot when prettier-plugin-tailwindcss is installed 1`] = `
{
  "default": {
    "bracketSameLine": true,
    "overrides": [
      {
        "files": "**/*.{json,yml,yaml}",
        "options": {
          "tabWidth": 2,
        },
      },
      {
        "files": "**/*.{yml,yaml}",
        "options": {
          "bracketSpacing": false,
          "singleQuote": false,
        },
      },
      {
        "files": "src/routes/index.ts",
        "options": {
          "printWidth": 150,
        },
      },
    ],
    "plugins": [
      "prettier-plugin-tailwindcss",
    ],
    "singleQuote": true,
    "tabWidth": 4,
    "tailwindConfig": "./tailwind.config.js",
    "tailwindFunctions": [
      "classNames",
      "twMerge",
    ],
  },
}
`;

exports[`should match snapshot when prettier-plugin-tailwindcss is not installed 1`] = `
{
  "default": {
    "bracketSameLine": true,
    "overrides": [
      {
        "files": "**/*.{json,yml,yaml}",
        "options": {
          "tabWidth": 2,
        },
      },
      {
        "files": "**/*.{yml,yaml}",
        "options": {
          "bracketSpacing": false,
          "singleQuote": false,
        },
      },
      {
        "files": "src/routes/index.ts",
        "options": {
          "printWidth": 150,
        },
      },
    ],
    "plugins": [],
    "singleQuote": true,
    "tabWidth": 4,
  },
}
`;
