{
  "$schema": "https://developer.microsoft.com/json-schemas/api-extractor/v7/api-extractor.schema.json",
  "mainEntryPointFilePath": "<projectFolder>/dist/types/index.d.ts",
  "bundledPackages": [],
  "compiler": {},
  "apiReport": {
    "enabled": true
  },
  "docModel": {
    "enabled": true
  },
  "dtsRollup": {
    "enabled": true,
    "untrimmedFilePath": "",
    "publicTrimmedFilePath": "<projectFolder>/dist/<unscopedPackageName>.d.ts"
  },
  "tsdocMetadata": {},
  "messages": {
    "compilerMessageReporting": {
      "default": {
        "logLevel": "warning"
      }
    },
    "extractorMessageReporting": {
      "default": {
        "logLevel": "warning",
        "addToApiReportFile": true
      }
    },
    "tsdocMessageReporting": {
      "default": {
        "logLevel": "warning"
      },
      "tsdoc-inline-tag-missing-braces": {
        "logLevel": "none"
      },
      "tsdoc-undefined-tag": {
        "logLevel": "none"
      }
    }
  }
}
