<svg xmlns="http://www.w3.org/2000/svg" xmlns:xlink="http://www.w3.org/1999/xlink" viewBox="0 0 48.986 45.861">
  <defs>
    <style>
      .a, .b, .c, .d, .e, .f, .g, .h {
        fill: none;
      }

      .b, .c, .d, .e {
        stroke: #835829;
      }

      .aa, .b, .c, .d, .e, .f, .g, .h, .l, .p, .q, .y {
        stroke-miterlimit: 10;
      }

      .b, .i, .j, .k {
        stroke-width: 0.949px;
      }

      .b, .c, .d, .e, .s, .t {
        mix-blend-mode: multiply;
      }

      .b, .c, .d, .e, .f, .g, .h, .r {
        opacity: 0.2;
      }

      .c, .h, .m {
        stroke-width: 0.949px;
      }

      .d, .g, .n {
        stroke-width: 0.799px;
      }

      .e, .f, .l {
        stroke-width: 0.804px;
      }

      .f, .g, .h {
        stroke: #b87b39;
        mix-blend-mode: screen;
      }

      .i {
        fill: #6b4822;
      }

      .i, .j, .k, .l, .m, .n {
        stroke: #512600;
      }

      .i, .j, .k, .m, .n {
        stroke-linejoin: round;
      }

      .j {
        fill: #a07e57;
      }

      .k, .l, .m, .n {
        fill: #946e42;
      }

      .ab, .o {
        fill: #262626;
      }

      .aa, .p {
        fill: #6e5f50;
      }

      .aa, .p, .q, .y {
        stroke: #262626;
      }

      .p, .q, .y {
        stroke-width: 0.69px;
      }

      .q, .s, .t, .w {
        fill: #aaa39b;
      }

      .r {
        fill: #fff;
        mix-blend-mode: lighten;
      }

      .ab, .s {
        opacity: 0.5;
      }

      .u {
        isolation: isolate;
      }

      .v {
        clip-path: url(#a);
      }

      .x {
        fill: #b9304c;
      }

      .y {
        fill: #e6e6e6;
      }

      .z {
        fill: #296336;
      }

      .aa {
        stroke-width: 0.771px;
      }

      .ac {
        fill: #ff931e;
      }

      .ad {
        fill: #e64f00;
      }

      .ae {
        fill: #f08019;
      }

      .af {
        fill: #ffd8ad;
      }
    </style>
    <clipPath id="a">
      <rect class="a" x="20.87" y="17.668" width="7.218" height="3.241"/>
    </clipPath>
    <symbol id="b" data-name="Boiler" viewBox="0 0 48.986 45.861">
      <line class="b" x1="1.697" y1="27.861" x2="1.697" y2="44.49"/>
      <line class="c" x1="43.697" y1="2.534" x2="43.988" y2="19.142"/>
      <line class="c" x1="43.908" y1="27.767" x2="44.2" y2="44.376"/>
      <line class="b" x1="1.697" y1="2.555" x2="1.697" y2="26.741"/>
      <line class="b" x1="4.725" y1="38.095" x2="4.767" y2="44.66"/>
      <line class="d" x1="43.174" y1="40.027" x2="43.191" y2="44.677"/>
      <line class="c" x1="47.385" y1="34.081" x2="47.519" y2="44.336"/>
      <line class="b" x1="4.602" y1="18.561" x2="4.719" y2="37.172"/>
      <line class="b" x1="4.501" y1="2.644" x2="4.576" y2="14.41"/>
      <line class="e" x1="4.874" y1="39.13" x2="5.013" y2="44.679"/>
      <line class="e" x1="4.584" y1="27.63" x2="4.842" y2="37.882"/>
      <line class="f" x1="4.672" y1="14.49" x2="4.935" y2="24.924"/>
      <line class="d" x1="43.132" y1="27.898" x2="43.329" y2="38.024"/>
      <line class="g" x1="42.877" y1="14.74" x2="43.077" y2="25.045"/>
      <line class="h" x1="47.131" y1="16.413" x2="47.394" y2="30.948"/>
      <line class="e" x1="7.919" y1="14.281" x2="8.684" y2="44.652"/>
      <line class="d" x1="39.986" y1="33.195" x2="39.926" y2="44.643"/>
      <line class="d" x1="40.047" y1="21.656" x2="39.995" y2="31.527"/>
      <polygon class="i" points="41.211 0.651 41.643 13.286 42.949 13.357 42.713 1.982 41.211 0.651"/>
      <polygon class="i" points="6.632 0.475 7.055 14.31 5.361 14.239 5.272 1.982 6.632 0.475"/>
      <polygon class="j" points="5.272 1.982 6.632 0.475 2.396 0.545 0.475 1.982 5.272 1.982"/>
      <polygon class="k" points="5.772 44.936 0.475 45.387 0.475 1.982 5.272 1.982 5.772 44.936"/>
      <polygon class="l" points="9.323 45.078 4.026 45.078 3.526 14.281 8.823 14.281 9.323 45.078"/>
      <polygon class="m" points="48.511 44.887 43.213 44.887 42.713 1.982 48.011 1.982 48.511 44.887"/>
      <polygon class="n" points="38.969 44.926 44.263 44.588 43.882 14.442 39.085 14.503 38.969 44.926"/>
      <path class="o" d="M5.691,16.334a.323.323,0,0,1-.282.3.256.256,0,1,1,0-.511C5.55,16.125,5.691,16.192,5.691,16.334Z"/>
      <path class="o" d="M2.653,12.479a.5.5,0,0,1-.433.466.394.394,0,0,1,0-.788C2.438,12.157,2.653,12.261,2.653,12.479Z"/>
      <path class="o" d="M7.564,16.478a.323.323,0,0,1-.281.3.256.256,0,0,1,0-.512C7.424,16.269,7.564,16.336,7.564,16.478Z"/>
      <path class="o" d="M42.157,16.184a.322.322,0,0,0,.222.348.256.256,0,0,0,.093-.5C42.333,16,42.183,16.045,42.157,16.184Z"/>
      <path class="o" d="M40.34,16.262a.323.323,0,0,0,.413-.032.256.256,0,0,0-.4-.318C40.264,16.023,40.23,16.175,40.34,16.262Z"/>
      <path class="o" d="M4.187,12.543a.5.5,0,0,1-.434.467.394.394,0,0,1,0-.788C3.971,12.222,4.187,12.326,4.187,12.543Z"/>
      <path class="o" d="M45.22,4.055a.5.5,0,0,1-.434.466.394.394,0,1,1,0-.787C45,3.734,45.22,3.838,45.22,4.055Z"/>
      <path class="o" d="M46.517,3.812a.5.5,0,0,1,.134.622.394.394,0,1,1-.646-.451C46.129,3.805,46.338,3.687,46.517,3.812Z"/>
      <path class="o" d="M45.2,12.617a.5.5,0,0,1-.433.467.394.394,0,0,1,0-.788C44.984,12.3,45.2,12.4,45.2,12.617Z"/>
      <path class="o" d="M46.51,12.683a.5.5,0,0,1-.294.564.393.393,0,1,1-.208-.759C46.217,12.43,46.453,12.473,46.51,12.683Z"/>
      <path class="o" d="M3.657,4a.5.5,0,0,1-.433.467c-.136,0-.215-.246-.215-.246s-.179-.067-.179-.148a.393.393,0,0,1,.394-.394C3.441,3.681,3.657,3.785,3.657,4Z"/>
      <polygon class="j" points="3.526 14.281 4.891 13.157 9.62 13.063 8.823 14.281 3.526 14.281"/>
      <polygon class="j" points="8.823 14.281 9.323 45.078 10.491 44.333 9.62 13.063 8.823 14.281"/>
      <polygon class="j" points="43.882 14.442 41.833 13.353 37.809 13.333 39.085 14.503 43.882 14.442"/>
      <polygon class="j" points="37.809 13.333 37.494 44.257 38.969 44.926 39.085 14.503 37.809 13.333"/>
      <polygon class="m" points="48.011 1.982 46.222 0.651 41.211 0.651 42.713 1.982 48.011 1.982"/>
      <g>
        <path class="p" d="M38.926,11.7,39.3,4.128a.7.7,0,0,0-.628-.735,113.558,113.558,0,0,0-14.309-.585A113.916,113.916,0,0,0,9.848,3.925a.452.452,0,0,0-.386.488l.659,7.792Z"/>
        <path class="q" d="M20.975,35.857,14.343,34.85,12.824,13.638l-2.7-1.292L9.475,4.679a.451.451,0,0,1,.5-.492,114,114,0,0,0,14.428.6,113.187,113.187,0,0,0,14.1-1.06.7.7,0,0,1,.794.734l-.366,7.384-2.653,1.385L35.529,34.48l-6.592,1.238A23.756,23.756,0,0,1,20.975,35.857Z"/>
        <path class="q" d="M12.826,13.83a78.808,78.808,0,0,0,23.452-.391"/>
        <path class="r" d="M35.382,25.875l-.21,8.372L28.8,35.439a23,23,0,0,1-7.693.135L14.7,34.6l-.533-8.368A93.869,93.869,0,0,0,35.382,25.875Z"/>
        <path class="s" d="M39.093,8.443l-.165,3.366L36.278,13.2l-.014.242a91.837,91.837,0,0,1-23.427.391l-.013-.224-2.7-1.294L9.845,8.936A129.818,129.818,0,0,0,39.093,8.443Z"/>
        <path class="t" d="M36.264,13.439,36.1,17.377l-.011.367a96.823,96.823,0,0,1-22.918.382l-.024-.348-.31-3.948A91.837,91.837,0,0,0,36.264,13.439Z"/>
        <ellipse class="p" cx="11.276" cy="8.758" rx="0.542" ry="1.643" transform="translate(-0.422 0.573) rotate(-2.855)"/>
        <ellipse class="p" cx="38.497" cy="8.604" rx="1.584" ry="0.523" transform="translate(27.986 46.625) rotate(-87.145)"/>
        <path class="o" d="M21.613,18.94c1.061.1,2.5.2,2.805.225a.762.762,0,0,0,.117,0c.3-.021,1.744-.125,2.805-.225a.9.9,0,0,0,.819-.9v-.008a.909.909,0,0,0-.993-.9c-1.038.094-2.342.189-2.631.209a.762.762,0,0,1-.117,0c-.288-.02-1.593-.115-2.631-.209a.909.909,0,0,0-.993.9v.008A.9.9,0,0,0,21.613,18.94Z"/>
        <g class="u">
          <g class="v">
            <g>
              <path class="w" d="M26.945,18.141c-.243,0-.441.136-.441.3,0,.763-.909,1.384-2.025,1.384s-2.025-.621-2.025-1.384c0-.165-.2-.3-.45-.3s-.45.136-.45.3c0,1.1,1.314,2,2.925,2s2.916-.9,2.916-2c0-.165-.2-.3-.45-.3"/>
              <path class="o" d="M24.479,19.826c1.116,0,2.025-.621,2.025-1.384,0-.165.2-.3.441-.3s.45.136.45.3c0,1.1-1.3,2-2.916,2s-2.925-.9-2.925-2c0-.165.207-.3.45-.3s.45.136.45.3c0,.763.909,1.384,2.025,1.384m2.466-2.158c-.621,0-1.134.35-1.134.774,0,.5-.594.917-1.332.917s-1.341-.412-1.341-.917c0-.424-.5-.774-1.134-.774s-1.134.35-1.134.774c0,1.36,1.62,2.467,3.609,2.467s3.609-1.107,3.609-2.467c0-.424-.513-.774-1.143-.774"/>
            </g>
          </g>
        </g>
        <polygon class="x" points="28.433 13.007 28.433 13.043 28.37 13.043 28.433 13.007"/>
        <circle class="y" cx="29.24" cy="9.26" r="2.663"/>
        <path class="x" d="M30.987,8.3l-1.746.961-.034-1.994A1.987,1.987,0,0,1,30.987,8.3Z"/>
        <path d="M29.161,9.338a6.093,6.093,0,0,1-1.258-1.4l.03-.029A6.1,6.1,0,0,1,29.32,9.181l-.159.157Z"/>
        <circle class="o" cx="29.24" cy="9.26" r="0.274"/>
        <circle class="y" cx="20.17" cy="9.418" r="2.663"/>
        <path class="z" d="M21.916,8.456l-1.745.961-.035-1.994A1.988,1.988,0,0,1,21.916,8.456Z"/>
        <path d="M20.18,9.529a6.079,6.079,0,0,1-1.88.084l0-.041a6.076,6.076,0,0,1,1.863-.265l.021.222Z"/>
        <circle class="o" cx="20.17" cy="9.418" r="0.274"/>
      </g>
      <g>
        <path class="o" d="M47.308,9.334,38.721,9.2a.706.706,0,0,1-.706-.706h0a.706.706,0,0,1,.706-.706l8.569.133"/>
        <path class="o" d="M2.961,9.233l6.711.021a.706.706,0,0,0,.706-.706h0a.706.706,0,0,0-.706-.706L2.791,7.821"/>
        <polygon class="aa" points="46.213 10.779 44.75 10.706 44.962 6.441 46.425 6.514 46.213 10.779"/>
        <circle class="o" cx="45.702" cy="7.463" r="0.167"/>
        <circle class="o" cx="45.42" cy="10.057" r="0.167"/>
        <polygon class="aa" points="2.64 10.717 4.103 10.644 3.89 6.379 2.632 6.404 2.64 10.717"/>
        <circle class="o" cx="3.15" cy="7.401" r="0.167"/>
        <circle class="o" cx="3.432" cy="9.995" r="0.167"/>
        <polyline class="ab" points="45.046 7.63 46.467 7.703 46.275 9.463 44.9 9.383 45.046 7.63"/>
        <polyline class="ab" points="3.807 7.568 2.385 7.641 2.577 9.401 3.952 9.321 3.807 7.568"/>
      </g>
      <ellipse class="o" cx="16.408" cy="43.793" rx="1.412" ry="0.542"/>
      <ellipse class="o" cx="17.82" cy="43.983" rx="1.412" ry="0.542"/>
      <ellipse class="o" cx="27.249" cy="43.362" rx="1.412" ry="0.542"/>
      <ellipse class="o" cx="29.102" cy="43.362" rx="1.412" ry="0.542"/>
      <ellipse class="o" cx="19.022" cy="43.44" rx="2.19" ry="0.841"/>
      <ellipse class="o" cx="20.892" cy="43.793" rx="2.19" ry="0.841"/>
      <ellipse class="o" cx="22.869" cy="43.44" rx="2.19" ry="0.841"/>
      <ellipse class="o" cx="27.691" cy="44.058" rx="2.19" ry="0.841"/>
      <ellipse class="o" cx="25.059" cy="43.793" rx="2.19" ry="0.841"/>
      <ellipse class="o" cx="31.292" cy="43.793" rx="2.19" ry="0.841"/>
      <g>
        <g>
          <path class="ac" d="M27.184,43.329c-2.27,0-4.546-.142-6.747-.279-.281-.018-.576-.028-.877-.038a7.743,7.743,0,0,1-4.025-.855,5.823,5.823,0,0,1-2.089-3.228A8.907,8.907,0,0,1,14.46,34.25l.39-.542.41.526c.1.124.22.258.352.4a5.678,5.678,0,0,1,.927,1.223c.087.17.169.343.251.515a7.789,7.789,0,0,0,.666,1.213,2.851,2.851,0,0,0,.3.354,15.519,15.519,0,0,1-.376-4.875l.063-1.057.776.719A11.662,11.662,0,0,1,21.7,37.334c.207-.23.419-.441.628-.648a5.105,5.105,0,0,0,1.837-3.8l.07-.924.734.566A4.659,4.659,0,0,1,26.7,36.381a6.868,6.868,0,0,0,1.468-2.964l.242-1.12.657.938a9.534,9.534,0,0,1,1.631,4.252,8.153,8.153,0,0,0,1.968-4.016l.245-1.414.686,1.26a13.413,13.413,0,0,1,1.426,4.05c.122.675.306,4.282-.791,5.1a3.141,3.141,0,0,1-1.475.5A38.512,38.512,0,0,1,27.184,43.329Z"/>
          <path class="ad" d="M24.661,32.922a4.153,4.153,0,0,1,1.158,4.955,7.366,7.366,0,0,0,2.833-4.355A8.985,8.985,0,0,1,30.265,38.6a8.6,8.6,0,0,0,2.888-5.042,12.943,12.943,0,0,1,1.373,3.9c.167.925.158,4.045-.6,4.6a2.7,2.7,0,0,1-1.249.409,38.11,38.11,0,0,1-5.5.359c-2.238,0-4.482-.139-6.716-.278-1.509-.094-3.4.028-4.656-.81a5.313,5.313,0,0,1-1.874-2.9,8.523,8.523,0,0,1,.928-4.3,9.843,9.843,0,0,1,1.227,1.545,13.326,13.326,0,0,0,.957,1.793A2.466,2.466,0,0,0,18.7,38.973c-.854-1.592-.923-4.074-.815-5.877,1.46,1.353,3.437,3.27,3.533,5.466,1.082-1.88,2.983-2.143,3.248-5.64m8-2.363-.491,2.826a7.6,7.6,0,0,1-1.185,2.921,9.968,9.968,0,0,0-1.512-3.357l-1.314-1.876-.483,2.239a6.239,6.239,0,0,1-.619,1.662,5.03,5.03,0,0,0-1.784-2.844L23.8,31l-.14,1.848a4.591,4.591,0,0,1-1.69,3.485l-.093.092a13.963,13.963,0,0,0-3.322-4.061l-1.552-1.437-.126,2.112a21.124,21.124,0,0,0-.013,2.385,7.15,7.15,0,0,0-.887-1.124c-.122-.133-.237-.257-.327-.371l-.82-1.052-.78,1.083a9.249,9.249,0,0,0-1.1,5.06,6.315,6.315,0,0,0,2.3,3.555,8.121,8.121,0,0,0,4.286.939c.3.01.586.02.862.037,2.21.137,4.5.28,6.779.28a39.079,39.079,0,0,0,5.64-.369,3.623,3.623,0,0,0,1.7-.595c1.514-1.124.993-5.544.985-5.587a13.883,13.883,0,0,0-1.479-4.2l-1.372-2.519Z"/>
        </g>
        <path class="ae" d="M24.9,33.906a3.032,3.032,0,0,1,.741,1.929,1.371,1.371,0,0,1-.3.969,1.222,1.222,0,0,1-1,.32c-.262-.022-.844-.08-.9-.417-.047-.27.416-.584.57-.779A4.423,4.423,0,0,0,24.9,33.906Z"/>
        <path class="ae" d="M18.124,33.961c0,.674.193,2.572.585,2.914.56.489,1.758-.031,1.516-.341C19.337,35.4,18.124,33.961,18.124,33.961Z"/>
        <path class="ae" d="M28.664,34.415a3.49,3.49,0,0,1,.741,1.787.617.617,0,0,1-.071.437c-.309.413-1.3.071-1.373-.411a1.367,1.367,0,0,1,.232-.782C28.259,35.323,28.752,34.525,28.664,34.415Z"/>
        <path class="ae" d="M14.708,36.221a1.771,1.771,0,0,0,.071.839.9.9,0,0,0,.666.519.378.378,0,0,0,.271-.038.423.423,0,0,0,.136-.381,2.153,2.153,0,0,0-.337-1.017c-.111-.182-.324-.606-.577-.622C14.642,35.5,14.723,36.015,14.708,36.221Z"/>
        <path class="ae" d="M33.268,34.886a1.115,1.115,0,0,1,.284.921,1.766,1.766,0,0,1-.254,1.108c-.248.313-1.29.555-1.029-.109A20.565,20.565,0,0,1,33.268,34.886Z"/>
      </g>
      <path class="ad" d="M21.215,40.346a.869.869,0,0,0-.736.961.828.828,0,0,0,.542.537,2.058,2.058,0,0,0,.786.078,15.67,15.67,0,0,1,3.883-.174c.367.076.723.2,1.093.266a1.713,1.713,0,0,0,1.1-.121.9.9,0,0,0,.487-.928.957.957,0,0,0-.784-.664,2.829,2.829,0,0,0-1.077.08,12.789,12.789,0,0,1-2.66.5C22.937,40.867,22.133,40.2,21.215,40.346Z"/>
      <g>
        <path class="af" d="M22.572,39.5a1.2,1.2,0,0,1-.59-.172,2.813,2.813,0,0,1-.636-.551.908.908,0,0,1-.25-.4.623.623,0,0,1,.27-.585.8.8,0,0,1,.493-.151,1.664,1.664,0,0,1,1.166.562.946.946,0,0,1,.271.734.674.674,0,0,1-.526.536A.859.859,0,0,1,22.572,39.5Z"/>
        <path d="M21.859,37.7a1.611,1.611,0,0,1,1.128.544.9.9,0,0,1,.259.7.632.632,0,0,1-.488.494.869.869,0,0,1-.186.021,1.138,1.138,0,0,1-.565-.165,2.726,2.726,0,0,1-.624-.542.856.856,0,0,1-.238-.372.573.573,0,0,1,.251-.535.754.754,0,0,1,.463-.141m0-.1a.852.852,0,0,0-.523.161.664.664,0,0,0-.289.635.939.939,0,0,0,.263.42,2.884,2.884,0,0,0,.647.561,1.257,1.257,0,0,0,.615.178.918.918,0,0,0,.209-.024.729.729,0,0,0,.564-.579c.088-.683-.775-1.352-1.486-1.352Z"/>
      </g>
      <g>
        <path class="af" d="M26.985,39.619a2.931,2.931,0,0,1-.791-.13.928.928,0,0,1-.441-.221.9.9,0,0,1-.167-.627,1.2,1.2,0,0,1,1.249-1.2,1.426,1.426,0,0,1,.485.087,1.2,1.2,0,0,1,.717.955.94.94,0,0,1-.334.922,1.169,1.169,0,0,1-.717.212Z"/>
        <path d="M26.835,37.493a1.356,1.356,0,0,1,.468.084,1.155,1.155,0,0,1,.685.916.891.891,0,0,1-.315.874,1.105,1.105,0,0,1-.687.2,2.868,2.868,0,0,1-.778-.128.892.892,0,0,1-.418-.207.857.857,0,0,1-.154-.593,1.154,1.154,0,0,1,1.2-1.148m0-.1a1.26,1.26,0,0,0-1.3,1.246.945.945,0,0,0,.18.662.973.973,0,0,0,.464.235,3.025,3.025,0,0,0,.806.131,1.215,1.215,0,0,0,.747-.221,1.2,1.2,0,0,0-.4-1.964,1.462,1.462,0,0,0-.5-.089Z"/>
      </g>
      <path d="M22.292,38.39a.2.2,0,0,0-.185.007.2.2,0,0,0-.111.151.249.249,0,0,0,.223.259.444.444,0,0,0,.344-.133.292.292,0,0,0,.076-.1.128.128,0,0,0-.015-.124.179.179,0,0,0-.161-.043A.308.308,0,0,1,22.292,38.39Z"/>
      <path d="M26.569,38.723a.333.333,0,0,0,.335.092c.3-.089.2-.422-.037-.522C26.565,38.163,26.428,38.55,26.569,38.723Z"/>
    </symbol>
  </defs>
  <use width="48.986" height="45.861" xlink:href="#b"/>
</svg>
