<svg xmlns="http://www.w3.org/2000/svg" xmlns:xlink="http://www.w3.org/1999/xlink" viewBox="0 0 49.054 49.006">
  <defs>
    <style>
      .a, .f, .g, .h, .j, .k {
        fill: none;
      }

      .b {
        fill: #967b5b;
      }

      .b, .e, .i, .m {
        stroke: #512600;
      }

      .b, .e, .f, .g, .h, .i, .j, .k, .m {
        stroke-miterlimit: 10;
      }

      .c {
        clip-path: url(#a);
      }

      .d {
        opacity: 0.3;
      }

      .e, .i, .m {
        fill: #946e42;
      }

      .e, .f, .g, .h {
        stroke-width: 1.011px;
      }

      .f, .h, .j {
        stroke: #835829;
        mix-blend-mode: multiply;
      }

      .f, .g, .j, .k {
        opacity: 0.2;
      }

      .g, .k {
        stroke: #b87b39;
        mix-blend-mode: screen;
      }

      .h {
        opacity: 0.1;
      }

      .i {
        stroke-width: 1.283px;
      }

      .l {
        fill: #512600;
      }

      .m {
        stroke-width: 1.181px;
      }
    </style>
    <clipPath id="a">
      <path class="a" d="M.554,45.378V3.633A3.127,3.127,0,0,1,3.681.506H45.426a3.128,3.128,0,0,1,3.128,3.127V45.378a3.129,3.129,0,0,1-3.128,3.128H3.681A3.128,3.128,0,0,1,.554,45.378Z"/>
    </clipPath>
    <symbol id="b" data-name="btn-ok" viewBox="0 0 49.054 49.006">
      <rect class="b" x="0.554" y="0.506" width="48" height="48" rx="3.128"/>
      <g class="c">
        <g class="d">
          <polygon class="e" points="1.05 5.966 0.554 0.506 48.318 0.506 48.318 5.45 1.05 5.966"/>
          <polygon class="e" points="1.05 12.063 1.05 6.603 48.318 6.088 48.318 11.548 1.05 12.063"/>
          <polygon class="e" points="1.05 42.199 1.05 36.739 48.318 36.224 48.318 41.684 1.05 42.199"/>
          <polygon class="e" points="1.05 17.684 0.554 12.224 48.318 12.224 48.318 17.169 1.05 17.684"/>
          <polygon class="e" points="1.05 36.063 0.554 30.603 48.318 30.603 48.318 35.548 1.05 36.063"/>
          <polygon class="e" points="1.05 23.738 1.05 18.278 48.318 17.763 48.318 23.223 1.05 23.738"/>
          <polygon class="e" points="1.05 30.296 1.05 24.321 47.822 23.806 48.318 29.781 1.05 30.296"/>
          <line class="f" x1="19.84" y1="1.765" x2="1.54" y2="1.765"/>
          <line class="f" x1="47.711" y1="37.237" x2="29.413" y2="37.538"/>
          <line class="f" x1="19.91" y1="37.456" x2="1.612" y2="37.756"/>
          <line class="f" x1="47.688" y1="1.765" x2="21.072" y2="1.765"/>
          <line class="f" x1="8.578" y1="4.886" x2="1.353" y2="4.929"/>
          <line class="f" x1="8.578" y1="31.666" x2="1.353" y2="31.709"/>
          <line class="f" x1="9.068" y1="22.549" x2="1.843" y2="22.592"/>
          <line class="f" x1="12.954" y1="41.038" x2="1.657" y2="41.177"/>
          <line class="f" x1="30.074" y1="4.759" x2="9.593" y2="4.88"/>
          <line class="f" x1="47.59" y1="4.656" x2="34.642" y2="4.732"/>
          <line class="f" x1="10.057" y1="7.395" x2="1.54" y2="7.539"/>
          <line class="f" x1="27.707" y1="7.097" x2="11.973" y2="7.363"/>
          <line class="f" x1="30.713" y1="22.233" x2="14.978" y2="22.499"/>
          <line class="f" x1="43.976" y1="28.864" x2="27.065" y2="28.9"/>
          <line class="g" x1="47.874" y1="7.187" x2="31.861" y2="7.458"/>
          <line class="f" x1="27.424" y1="31.551" x2="11.688" y2="31.481"/>
          <line class="g" x1="47.874" y1="31.643" x2="31.859" y2="31.571"/>
          <line class="g" x1="47.616" y1="21.877" x2="31.602" y2="22.148"/>
          <line class="g" x1="32.42" y1="40.777" x2="16.406" y2="41.048"/>
          <line class="f" x1="48.318" y1="10.616" x2="1.703" y2="11.404"/>
          <polygon class="e" points="1.05 48.336 1.05 42.876 48.318 42.361 48.318 47.821 1.05 48.336"/>
          <line class="f" x1="10.057" y1="43.668" x2="1.54" y2="43.812"/>
          <line class="f" x1="27.707" y1="43.369" x2="11.973" y2="43.635"/>
          <line class="g" x1="47.874" y1="43.46" x2="31.861" y2="43.731"/>
          <line class="f" x1="48.318" y1="46.889" x2="1.703" y2="47.677"/>
          <line class="h" x1="48.154" y1="13.099" x2="1.135" y2="12.921"/>
          <line class="f" x1="23.948" y1="18.971" x2="1.05" y2="19.221"/>
          <line class="f" x1="44.327" y1="18.749" x2="27.238" y2="18.936"/>
          <line class="g" x1="21.147" y1="28.827" x2="1.82" y2="29.191"/>
          <line class="f" x1="1.82" y1="25.117" x2="41.875" y2="24.608"/>
          <line class="f" x1="37.604" y1="16.486" x2="1.89" y2="16.85"/>
          <line class="f" x1="19.257" y1="34.862" x2="1.47" y2="35.073"/>
          <line class="f" x1="37.184" y1="34.65" x2="21.848" y2="34.831"/>
        </g>
      </g>
      <g>
        <g>
          <polygon class="i" points="21.121 43.061 28.783 38.9 14.031 11.382 6.369 15.542 21.121 43.061"/>
          <line class="j" x1="13.385" y1="12.626" x2="17.089" y2="19.555"/>
          <line class="j" x1="18.913" y1="22.55" x2="27.459" y2="38.898"/>
          <line class="j" x1="16.438" y1="31.774" x2="21.755" y2="41.847"/>
          <line class="k" x1="10.2" y1="19.822" x2="15.25" y2="28.806"/>
          <circle class="j" cx="11.469" cy="15.904" r="1"/>
          <circle class="l" cx="11.513" cy="15.746" r="1"/>
          <circle class="l" cx="23.758" cy="38.973" r="1"/>
        </g>
        <g>
          <polygon class="m" points="18.481 39.983 24.673 44.039 43.56 9.981 37.73 6.702 18.481 39.983"/>
          <line class="j" x1="27.361" y1="36.696" x2="23.755" y2="43.023"/>
          <line class="j" x1="36.772" y1="20.193" x2="29.055" y2="34.052"/>
          <line class="k" x1="42.083" y1="10.089" x2="38.946" y2="16.287"/>
          <line class="j" x1="28.494" y1="24.558" x2="19.527" y2="40.084"/>
          <line class="j" x1="37.532" y1="8.908" x2="29.801" y2="22.295"/>
          <circle class="l" cx="39.295" cy="10.25" r="1"/>
          <circle class="l" cx="23.132" cy="39.721" r="1"/>
        </g>
      </g>
    </symbol>
  </defs>
  <use width="49.054" height="49.006" xlink:href="#b"/>
</svg>
