<svg xmlns="http://www.w3.org/2000/svg" xmlns:xlink="http://www.w3.org/1999/xlink" viewBox="0 0 47.287 45.729">
  <defs>
    <style>
      .a {
        fill: #aab38a;
      }

      .b {
        fill: #ccc;
      }

      .b, .e, .f {
        mix-blend-mode: multiply;
      }

      .c {
        fill: #946e42;
        stroke: #512600;
      }

      .c, .d, .e, .f {
        stroke-miterlimit: 10;
      }

      .c, .d, .e {
        stroke-width: 0.88px;
      }

      .d, .e, .f {
        fill: none;
        opacity: 0.2;
      }

      .d {
        stroke: #b87b39;
        mix-blend-mode: screen;
      }

      .e, .f {
        stroke: #835829;
      }

      .f {
        stroke-width: 0.812px;
      }

      .g {
        fill: #262626;
      }
    </style>
    <symbol id="a" data-name="Bin" viewBox="0 0 47.287 45.729">
      <g>
        <g>
          <path class="a" d="M33.533,44.826c22.053-2.809,11.1-19.785,8.179-25.273L34.275,8.039C20.816-9.655,11.592,8.322,8.3,13.592L2.452,25.746c-8.594,20.5,11.586,19.5,17.8,19.72Z"/>
          <path d="M33.51,44.565C50.592,42.347,48.469,31.6,41.4,19.758c.006.03-7.536-11.6-7.456-11.464C27.706.011,20.511-2.269,13.481,6.685a64.738,64.738,0,0,0-4.764,7.109L3.464,24.623C-7.744,48.728,18.3,45.2,33.51,44.565Zm.046.523c-7.336.221-18.239,1.616-25.344-.575C-2.037,41.685-1.2,32.16,2.69,24.272L7.88,13.391a64.5,64.5,0,0,1,4.833-7.326C20.1-3.329,28.075-1.073,34.61,7.784c.035,0,7.388,11.552,7.418,11.565,7.333,12.348,9.043,23.584-8.472,25.739Z"/>
        </g>
        <path class="b" d="M7.766,44.015c-5.82-1.95-10.18-6.66-5.31-18.27l2.34-4.86C3.226,28.655,2.156,38.835,7.766,44.015Z"/>
        <path class="b" d="M33.536,44.825l-8.87.43c9.57-2.1,21.88-6.41,19.94-17.88-.23-1.38-.36-2.42-.41-3.16C47.746,31.465,51.026,42.6,33.536,44.825Z"/>
      </g>
      <g>
        <path class="c" d="M10.123,34.718c-.209-.28-.8-1.111-.089-2.957l1.7.773-1.59-4.247L5.893,29.875l1.74.792c-1.095,2.716-.426,4.557.374,5.63,2.249,3.015,8.215,3.744,13.459,3.744a70.365,70.365,0,0,0,9.014-.615l-.363-2.614C23.658,37.707,12.518,37.93,10.123,34.718Z"/>
        <path class="c" d="M31.942,13.441l-2.083,1.622c4.006,5.144,9.771,14.678,8.185,18.361-.139.322-.562,1.249-2.517,1.556l-.179-1.855-2.883,3.5,3.5,2.885-.184-1.9c2.9-.409,4.159-1.909,4.688-3.139C43.184,28.16,33.1,14.929,31.942,13.441Z"/>
        <path class="c" d="M22.8,9.942c.348-.043,1.363-.138,2.607,1.4l-1.517,1.083,4.472.747L29.109,8.7,27.562,9.8C25.755,7.485,23.82,7.162,22.49,7.32c-6.82.8-13.237,16.151-13.946,17.9l2.445.993C13.444,20.168,18.821,10.409,22.8,9.942Z"/>
      </g>
      <g>
        <polyline class="d" points="31.606 14.455 35.91 21.013 38.806 26.701"/>
        <polyline class="d" points="9.574 24.936 13.034 17.897 16.46 12.512"/>
        <polyline class="d" points="29.346 38.674 21.511 39.04 15.141 38.636"/>
        <line class="e" x1="35.258" y1="34.532" x2="33.332" y2="37.11"/>
        <line class="e" x1="10.608" y1="31.867" x2="9.35" y2="28.906"/>
        <line class="f" x1="28.039" y1="12.461" x2="25.103" y2="12.11"/>
        <circle class="g" cx="10.369" cy="24.086" r="0.353"/>
        <circle class="g" cx="25.545" cy="9.616" r="0.353"/>
        <circle class="g" cx="36.933" cy="35.898" r="0.353"/>
        <circle class="g" cx="28.651" cy="38.275" r="0.353"/>
        <circle class="g" cx="8.792" cy="31.475" r="0.353"/>
        <circle class="g" cx="31.969" cy="15.616" r="0.353"/>
      </g>
    </symbol>
  </defs>
  <use width="47.287" height="45.729" xlink:href="#a"/>
</svg>
