[gd_scene load_steps=3 format=3 uid="uid://c604ehpr1jvwl"]

[ext_resource type="Script" path="res://select_output_button/select_output_button.gd" id="1_vc28y"]

[sub_resource type="RectangleShape2D" id="RectangleShape2D_swoxd"]

[node name="OutputButton" type="Area2D"]
script = ExtResource("1_vc28y")

[node name="ColorRect" type="ColorRect" parent="."]
offset_left = -10.0
offset_top = -10.0
offset_right = 10.0
offset_bottom = 10.0
color = Color(0, 1, 0, 0.501961)

[node name="CollisionShape2D" type="CollisionShape2D" parent="."]
shape = SubResource("RectangleShape2D_swoxd")

[connection signal="gui_input" from="ColorRect" to="." method="_on_color_rect_gui_input"]
