[gd_scene load_steps=4 format=3 uid="uid://bqsat2teyywpu"]

[ext_resource type="Script" path="res://Item/item.gd" id="1_uampv"]
[ext_resource type="Texture2D" uid="uid://dryk6cealnb1x" path="res://images/rasterized/dish_rice.svg.png" id="2_7mjg1"]

[sub_resource type="RectangleShape2D" id="RectangleShape2D_5ym0d"]

[node name="Item" type="Area2D" groups=["item"]]
z_index = 15
scale = Vector2(1.5, 1.5)
script = ExtResource("1_uampv")

[node name="CollisionShape2D" type="CollisionShape2D" parent="."]
shape = SubResource("RectangleShape2D_5ym0d")

[node name="Sprite2D" type="Sprite2D" parent="."]
scale = Vector2(0.02, 0.02)
texture = ExtResource("2_7mjg1")

[node name="Label" type="Label" parent="."]
visible = false
modulate = Color(1, 0.172549, 0.137255, 1)
offset_left = -19.3333
offset_top = -29.3333
offset_right = 20.6667
offset_bottom = -6.33333

[connection signal="mouse_entered" from="." to="." method="_on_mouse_entered"]
[connection signal="mouse_exited" from="." to="." method="_on_mouse_exited"]
