<svg xmlns="http://www.w3.org/2000/svg" xmlns:xlink="http://www.w3.org/1999/xlink" viewBox="0 0 41.542 46.779">
  <defs>
    <style>
      .a, .k {
        fill: #aaa39b;
      }

      .b {
        fill: #816f5b;
      }

      .c {
        fill: #442114;
      }

      .d, .j {
        fill: #442e14;
      }

      .e {
        fill: #a0897c;
      }

      .f {
        fill: #81675b;
      }

      .g {
        fill: #523426;
      }

      .h {
        fill: #523d26;
      }

      .i {
        fill: #5e462a;
        stroke: #000;
        stroke-miterlimit: 10;
        stroke-width: 0.791px;
      }

      .j, .k, .l {
        mix-blend-mode: multiply;
      }

      .j, .k {
        opacity: 0.4;
      }

      .l {
        opacity: 0.7;
      }

      .m {
        fill: #ecddcc;
      }

      .n {
        fill: #c9baa9;
      }
    </style>
    <symbol id="a" data-name="Sack" viewBox="0 0 41.542 46.779">
      <g>
        <path class="a" d="M1.306,37.953c3.59,13.586,47.6,11.035,38.554-9.3C30.413,7.414-6.1,9.916,1.306,37.953Z"/>
        <path d="M1.56,37.886C4.592,46.5,19.5,46.845,27.042,45.342c6.483-1.143,14.963-5.47,13.394-13.259-1.539-6.918-7.123-12.63-13.614-15.291C10.927,10.676-3.3,20.336,1.56,37.886Zm-.508.134C-6.2,12.056,25.926,6.539,38.48,25.111,50.021,42.9,26.176,49.078,12.645,46.037c-4.622-1-10.081-3.023-11.593-8.017Z"/>
      </g>
      <path class="b" d="M15.836,3.3c-.09,0-.19.02-.29.03a3.523,3.523,0,0,1-.49.05,1.4,1.4,0,0,1-.99-.36,1.205,1.205,0,0,1-.2-.26.661.661,0,0,0-.37.13c-.29.22-.22.68-.11,1.03a18.842,18.842,0,0,0,1.85,3.33,16.908,16.908,0,0,1-.46-1.69,1.007,1.007,0,0,1,.2-.84.9.9,0,0,1,.38-.29,6.006,6.006,0,0,1,.28-.63,5.273,5.273,0,0,0,.22-.49C15.846,3.3,15.846,3.3,15.836,3.3Z"/>
      <path class="c" d="M17.866,4.53a2.831,2.831,0,0,0-.6-2.32l-.22-.24-.02-.02h-1.22l-1.35.01h-.01v.07a.629.629,0,0,0,.09.33.462.462,0,0,0,.07.07v.01a.607.607,0,0,0,.1.07,1.151,1.151,0,0,0,.74.04,1.6,1.6,0,0,1,.69.01.8.8,0,0,1,.34.18h.2a2.039,2.039,0,0,1,.4,1.68,2.1,2.1,0,0,0,0,.36,1.8,1.8,0,0,0,.4.1,2.832,2.832,0,0,0,.4.08A3.449,3.449,0,0,1,17.866,4.53Zm.16,2.36q-.015-.18-.03-.39c-.01-.13-.02-.27-.04-.41,0-.1-.01-.21-.02-.32V5.75a2.761,2.761,0,0,1-.4-.06,2.569,2.569,0,0,1-.4-.07,1.841,1.841,0,0,0,.03.33c.01.14.02.29.02.43.02.14.03.27.04.41.08,1.2.1,2.38-.28,2.38a.247.247,0,0,1-.16-.07c.06.14.14.3.22.46.06.11.13.24.2.36a1.008,1.008,0,0,0,.46-.28C18.076,9.2,18.126,8.38,18.026,6.89Z"/>
      <path d="M25.526,1.73a4.846,4.846,0,0,0-1.91-.68,5.421,5.421,0,0,0-1.09-.13,1.1,1.1,0,0,0-.26.02c-.02-.02-.03-.04-.05-.05a4.106,4.106,0,0,0-2.27-.81c-.52-.05-1.04-.08-1.56-.08a15.059,15.059,0,0,0-2.92.29,2.56,2.56,0,0,0-1.36.64,1.562,1.562,0,0,0-.46,1.06,1.4,1.4,0,0,0-.64.27,1.6,1.6,0,0,0-.37,1.91,18.842,18.842,0,0,0,3.51,5.44c.37.79,1.6,3.03,3.26,3.03a1.573,1.573,0,0,0,.5-.08v-.17l.01.01v.16l-.01.24-.01.4h.45l.44.01.24-.36,2.5-3.72,2.5-3.73a3.172,3.172,0,0,0,.64-1.52A2.4,2.4,0,0,0,25.526,1.73Zm-11.08.23h.01a.17.17,0,0,1,.01-.07.419.419,0,0,1,.04-.15c.02-.05.05-.09.07-.13a.538.538,0,0,1,.09-.12h.01a1.105,1.105,0,0,1,.43-.28,5.009,5.009,0,0,1,.52-.14,14.033,14.033,0,0,1,4.24-.2c.12.01.24.03.35.05a.675.675,0,0,1,.14.02,2.048,2.048,0,0,1,.24.05.109.109,0,0,1,.05.01c.09.02.19.05.28.08.11.04.22.08.33.13a1.618,1.618,0,0,0-.18.1,1.968,1.968,0,0,0-.88,1.27,1.872,1.872,0,0,0,.66,1.8,4.715,4.715,0,0,1-1.54.54,4.541,4.541,0,0,1-.82.07c-.21,0-.41-.01-.62-.03a2.832,2.832,0,0,1-.4-.08,1.8,1.8,0,0,1-.4-.1,3.992,3.992,0,0,1-.87-.33c.26-.59.74-1.31.27-1.71a.8.8,0,0,0-.34-.18,1.6,1.6,0,0,0-.69-.01,1.151,1.151,0,0,1-.74-.04.607.607,0,0,1-.1-.07V2.43a.462.462,0,0,1-.07-.07.629.629,0,0,1-.09-.33Zm-1.06,1.96c-.11-.35-.18-.81.11-1.03a.661.661,0,0,1,.37-.13,1.205,1.205,0,0,0,.2.26,1.4,1.4,0,0,0,.99.36,3.523,3.523,0,0,0,.49-.05c.1-.01.2-.03.29-.03.01,0,.01,0,.02.01a5.273,5.273,0,0,1-.22.49,6.006,6.006,0,0,0-.28.63.9.9,0,0,0-.38.29,1.007,1.007,0,0,0-.2.84,16.908,16.908,0,0,0,.46,1.69A18.842,18.842,0,0,1,13.386,3.92Zm6.98,8.49h-.1a.647.647,0,0,0,.16-.09Zm.3-1.56c0,.01-.01.01-.01.02v.01c0,.01-.01.01-.01.02a1.99,1.99,0,0,1-.73.8.01.01,0,0,1-.01.01.926.926,0,0,1-.5.14h-.02c-.81-.02-1.63-1.01-2.18-1.93-.07-.12-.14-.25-.2-.36-.08-.16-.16-.32-.22-.46a17.626,17.626,0,0,1-1.07-3.06c-.06-.22-.11-.43-.16-.65a.214.214,0,0,1,.12-.24.235.235,0,0,1,.08-.02.161.161,0,0,1,.09.03,1.533,1.533,0,0,0,.27.11v.01a5.312,5.312,0,0,0,1.02.34,2.569,2.569,0,0,0,.4.07,2.761,2.761,0,0,0,.4.06,5.253,5.253,0,0,0,.56.03,5.15,5.15,0,0,0,.95-.08,5.709,5.709,0,0,0,2.18-.85,1.848,1.848,0,0,0,.27-.19.435.435,0,0,0,.06-.07.035.035,0,0,1,.02.01,3.762,3.762,0,0,0,.31-.25c.14-.12.27-.25.4-.38.06-.06.12-.13.18-.2l.02-.02h.01a.5.5,0,0,0-.05.13l-.09.36v.01c-.03.22-.06.45-.08.67a4.2,4.2,0,0,1-.07.51c-.14.61-.3,1.21-.49,1.81A21.269,21.269,0,0,1,20.666,10.85Zm4.7-5.89c-1.16,1.73-2.31,3.45-3.47,5.17a24.233,24.233,0,0,0,.97-2.65c.2-.62.37-1.24.51-1.87a3.63,3.63,0,0,0,.09-.66,4.307,4.307,0,0,1,.14-.84l.17-.38-.2-.4-.23-.37h-.16l-.29-.01h-.1a1.5,1.5,0,0,1,0,.3,1.417,1.417,0,0,1-.02-.3h-.25l-.12.14-.12.14a5.234,5.234,0,0,1-.72.69h-.01l-.12-.09a1.336,1.336,0,0,1-.21-.2c-.01,0-.01-.01-.02-.02a.452.452,0,0,1-.11-.17.619.619,0,0,1-.11-.27c0-.01-.01-.03-.01-.04a.09.09,0,0,1-.01-.05.554.554,0,0,1-.02-.18.148.148,0,0,1,.01-.07.066.066,0,0,1,.01-.06V2.75c0-.03.01-.06.01-.09A.292.292,0,0,0,21,2.57a2.256,2.256,0,0,1,.11-.22l.09-.12a.27.27,0,0,1,.07-.08.462.462,0,0,0,.07-.07,1.268,1.268,0,0,1,.41-.24.758.758,0,0,1,.16-.06.127.127,0,0,1,.06-.01.78.78,0,0,1,.22-.04h.01a.749.749,0,0,1,.21-.02h.21a2.09,2.09,0,0,1,.25.01v.01a5.4,5.4,0,0,1,.58.08h.01c.01.01.01.01.02.01a4.354,4.354,0,0,1,1.61.56,1.647,1.647,0,0,1,.79,1.44A2.4,2.4,0,0,1,25.366,4.96Z"/>
      <g>
        <path class="b" d="M20.2,2.58a1.872,1.872,0,0,0,.66,1.8,4.715,4.715,0,0,1-1.54.54,4.541,4.541,0,0,1-.82.07c-.21,0-.41-.01-.62-.03a2.832,2.832,0,0,1-.4-.08,1.8,1.8,0,0,1-.4-.1,3.992,3.992,0,0,1-.87-.33c.26-.59.74-1.31.27-1.71a.8.8,0,0,0-.34-.18,1.6,1.6,0,0,0-.69-.01,1.151,1.151,0,0,1-.74-.04.607.607,0,0,1-.1-.07V2.43a.462.462,0,0,1-.07-.07.629.629,0,0,1-.09-.33V1.96h.01a.17.17,0,0,1,.01-.07.833.833,0,0,1,.04-.15c.02-.05.05-.09.07-.13a.538.538,0,0,1,.09-.12h.01a1.105,1.105,0,0,1,.43-.28,5.009,5.009,0,0,1,.52-.14,14.033,14.033,0,0,1,4.24-.2c.12.01.24.03.35.05a.675.675,0,0,1,.14.02,2.048,2.048,0,0,1,.24.05.109.109,0,0,1,.05.01c.09.02.19.05.28.08.11.04.22.08.33.13a1.618,1.618,0,0,0-.18.1A1.968,1.968,0,0,0,20.2,2.58Z"/>
        <path class="b" d="M22.8,2.95a1.5,1.5,0,0,1,0,.3,1.417,1.417,0,0,1-.02-.3h-.25l-.12.14-.12.14a5.234,5.234,0,0,1-.72.69h-.01l-.12-.09a1.336,1.336,0,0,1-.21-.2c-.01,0-.01-.01-.02-.02a.452.452,0,0,1-.11-.17.619.619,0,0,1-.11-.27c0-.01-.01-.03-.01-.04a.09.09,0,0,1-.01-.05.554.554,0,0,1-.02-.18.148.148,0,0,1,.01-.07.066.066,0,0,1,.01-.06V2.75c0-.03.01-.06.01-.09A.292.292,0,0,0,21,2.57a2.256,2.256,0,0,1,.11-.22l.09-.12a.27.27,0,0,1,.07-.08.462.462,0,0,0,.07-.07,1.268,1.268,0,0,1,.41-.24.758.758,0,0,1,.16-.06.127.127,0,0,1,.06-.01.78.78,0,0,1,.22-.04h.01a.749.749,0,0,1,.21-.02.01.01,0,0,1,.01.01,2.582,2.582,0,0,1,.37,1.06A.97.97,0,0,1,22.8,2.95Z"/>
        <path class="d" d="M14.546,2.36h-.01a.462.462,0,0,0,.07.07A.374.374,0,0,1,14.546,2.36Zm.06.07v.01a.607.607,0,0,0,.1.07A.392.392,0,0,1,14.606,2.43Zm1.52.12a.925.925,0,0,0-.29-.04,2.579,2.579,0,0,0-.39.04,1.6,1.6,0,0,1,.69.01Zm6.89-.46a2.749,2.749,0,0,0-.15-.36V1.72h-.19a.127.127,0,0,0-.06-.01h-.21a.749.749,0,0,0-.21.02h-.01a.78.78,0,0,0-.22.04.01.01,0,0,1,.01.01.359.359,0,0,1,.07.1.01.01,0,0,1,.01.01,1.377,1.377,0,0,1,.14.24,1.658,1.658,0,0,1,.16.49,2.082,2.082,0,0,1,.05.36v.01A.01.01,0,0,0,22.4,3l.01.01v.08l.12-.14h.25a1.417,1.417,0,0,0,.02.3,1.5,1.5,0,0,0,0-.3h.1l.29.01A2.859,2.859,0,0,0,23.016,2.09Zm-.13,1.66-.02.02c-.06.07-.12.14-.18.2-.13.13-.26.26-.4.38a3.762,3.762,0,0,1-.31.25.035.035,0,0,0-.02-.01.435.435,0,0,1-.06.07,2.226,2.226,0,0,1-.19.24,4.063,4.063,0,0,1-2.56,1.19,5.464,5.464,0,0,1-.62.03q-.27,0-.57-.03a2.6,2.6,0,0,1-.39-.05,1.787,1.787,0,0,1-.4-.09,1.536,1.536,0,0,1-1.05-.67V5.27a1.533,1.533,0,0,1-.27-.11.161.161,0,0,0-.09-.03.235.235,0,0,0-.08.02.214.214,0,0,0-.12.24c.05.22.1.43.16.65a2.7,2.7,0,0,0,1.51.75,2.568,2.568,0,0,0,.4.06,2.581,2.581,0,0,0,.4.04c.16.01.33.02.5.02.25,0,.5-.01.7-.03a5.157,5.157,0,0,0,2.33-.83h.01a3.392,3.392,0,0,0,.51-.41,3.167,3.167,0,0,0,.46-.51c.01,0,.01-.01.01-.02l.01-.01a1.249,1.249,0,0,0,.09-.12c.01-.02.03-.04.03-.06.02-.22.05-.45.08-.67V4.24l.09-.36a.5.5,0,0,1,.05-.13Z"/>
      </g>
      <path class="a" d="M21.256,1.21a1.618,1.618,0,0,0-.18.1,9.35,9.35,0,0,0-4.03.66,1.06,1.06,0,0,0-.41.37.792.792,0,0,0-.13.4v.02c-.01-.01-.02-.02-.03-.02a.8.8,0,0,0-.34-.18,1.6,1.6,0,0,0-.69-.01,1.151,1.151,0,0,1-.74-.04.607.607,0,0,1-.1-.07V2.43a.462.462,0,0,1-.07-.07.629.629,0,0,1-.09-.33.17.17,0,0,1,.01-.07.17.17,0,0,1,.01-.07.833.833,0,0,1,.04-.15c.02-.05.05-.09.07-.13a.58.58,0,0,1,.1-.12,1.389,1.389,0,0,1,.43-.28,5.009,5.009,0,0,1,.52-.14,14.033,14.033,0,0,1,4.24-.2c.12.01.24.03.35.05a.675.675,0,0,1,.14.02,2.048,2.048,0,0,1,.24.05.109.109,0,0,1,.05.01c.09.02.19.05.28.08C21.036,1.12,21.146,1.16,21.256,1.21Z"/>
      <path class="e" d="M22.406,2.98v.03L22.4,3l-.64-1.15-.01-.01a.758.758,0,0,1,.16-.06.127.127,0,0,1,.06-.01.01.01,0,0,1,.01.01.359.359,0,0,1,.07.1.01.01,0,0,1,.01.01,1.377,1.377,0,0,1,.14.24,1.658,1.658,0,0,1,.16.49A2.082,2.082,0,0,1,22.406,2.98Z"/>
      <g>
        <path class="f" d="M22.9,3.75a.5.5,0,0,0-.05.13l-.09.36v.01c-.03.22-.06.45-.08.67a4.2,4.2,0,0,1-.07.51c-.14.61-.3,1.21-.49,1.81a21.269,21.269,0,0,1-1.45,3.61c0,.01-.01.01-.01.02v.01c0,.01-.01.01-.01.02a1.99,1.99,0,0,1-.73.8v-.02c.19-.43.5-1.25,1-2.76l.12-.35c.09-.28.22-.59.35-.91a12.367,12.367,0,0,0,.69-2.02,3.126,3.126,0,0,0,.08-.66V4.97a.349.349,0,0,0-.18-.37,3.762,3.762,0,0,0,.31-.25c.14-.12.27-.25.4-.38.06-.06.12-.13.18-.2l.02-.02Z"/>
        <path class="f" d="M20.426,12.32l-.06.09h-.1A.647.647,0,0,0,20.426,12.32Z"/>
        <path class="b" d="M25.876,3.82a2.4,2.4,0,0,1-.51,1.14c-1.16,1.73-2.31,3.45-3.47,5.17a24.233,24.233,0,0,0,.97-2.65c.2-.62.37-1.24.51-1.87a3.63,3.63,0,0,0,.09-.66,4.307,4.307,0,0,1,.14-.84l.17-.38-.2-.4-.23-.37h-.16l-.29-.01h-.1a1.5,1.5,0,0,1,0,.3,1.417,1.417,0,0,1-.02-.3h-.25l-.12.14-.12.14a5.234,5.234,0,0,1-.72.69h-.01l-.12-.09a1.336,1.336,0,0,1-.21-.2c-.01,0-.01-.01-.02-.02a.452.452,0,0,1-.11-.17.619.619,0,0,1-.11-.27c0-.01-.01-.03-.01-.04a.09.09,0,0,1-.01-.05.554.554,0,0,1-.02-.18.148.148,0,0,1,.01-.07.066.066,0,0,1,.01-.06V2.75c0-.03.01-.06.01-.09A.292.292,0,0,0,21,2.57a2.256,2.256,0,0,1,.11-.22l.09-.12a.27.27,0,0,1,.07-.08.462.462,0,0,0,.07-.07,1.268,1.268,0,0,1,.41-.24.758.758,0,0,1,.16-.06.127.127,0,0,1,.06-.01.78.78,0,0,1,.22-.04h.01a.749.749,0,0,1,.21-.02h.21a.127.127,0,0,1,.06.01h.19v.01c.19.02.39.05.58.08h.01c.01.01.01.01.02.01a4.354,4.354,0,0,1,1.61.56A1.647,1.647,0,0,1,25.876,3.82Z"/>
      </g>
      <path class="g" d="M22.866,3.77l-.02.11-.09.36v.01l-.2.85-.01.01v.03l-.02.07c0-.03.01-.05.01-.08a.757.757,0,0,0,.01-.15.937.937,0,0,0-.1-.45.755.755,0,0,0-.11-.14.1.1,0,0,0-.05-.04c.14-.12.27-.25.4-.38C22.746,3.91,22.806,3.84,22.866,3.77Z"/>
      <path class="h" d="M23.446,1.81a.776.776,0,0,0-.43.28,1.266,1.266,0,0,0-.23.69.97.97,0,0,0-.01.17h-.25l-.12.14-.12.14a5.234,5.234,0,0,1-.72.69h-.01l-.12-.09a1.336,1.336,0,0,1-.21-.2c-.01,0-.01-.01-.02-.02a.452.452,0,0,1-.11-.17.619.619,0,0,1-.11-.27c0-.01-.01-.03-.01-.04a.09.09,0,0,1-.01-.05.554.554,0,0,1-.02-.18.148.148,0,0,1,.01-.07.066.066,0,0,1,.01-.06V2.75c0-.03.01-.06.01-.09A.292.292,0,0,0,21,2.57a2.256,2.256,0,0,1,.11-.22l.09-.12a.27.27,0,0,1,.07-.08.462.462,0,0,0,.07-.07,1.268,1.268,0,0,1,.41-.24.758.758,0,0,1,.16-.06.127.127,0,0,1,.06-.01.78.78,0,0,1,.22-.04h.01a.749.749,0,0,1,.21-.02h.21a.127.127,0,0,1,.06.01h.19v.01C23.056,1.75,23.256,1.78,23.446,1.81Z"/>
      <g>
        <path class="a" d="M22.9,3.75a.5.5,0,0,0-.05.13l-.09.36v.01c-.03.22-.06.45-.08.67a4.2,4.2,0,0,1-.07.51c-.14.61-.3,1.21-.49,1.81a21.269,21.269,0,0,1-1.45,3.61c0,.01-.01.01-.01.02v.01c0,.01-.01.01-.01.02a1.99,1.99,0,0,1-.73.8.01.01,0,0,1-.01.01.926.926,0,0,1-.5.14h-.02c-.81-.02-1.63-1.01-2.18-1.93-.07-.12-.14-.25-.2-.36-.08-.16-.16-.32-.22-.46a17.626,17.626,0,0,1-1.07-3.06c-.06-.22-.11-.43-.16-.65a.214.214,0,0,1,.12-.24.235.235,0,0,1,.08-.02.161.161,0,0,1,.09.03,1.533,1.533,0,0,0,.27.11v.01a5.312,5.312,0,0,0,1.02.34,2.569,2.569,0,0,0,.4.07,2.761,2.761,0,0,0,.4.06,5.253,5.253,0,0,0,.56.03,5.15,5.15,0,0,0,.95-.08,5.709,5.709,0,0,0,2.18-.85,1.848,1.848,0,0,0,.27-.19.435.435,0,0,0,.06-.07.035.035,0,0,1,.02.01,3.762,3.762,0,0,0,.31-.25c.14-.12.27-.25.4-.38.06-.06.12-.13.18-.2l.02-.02Z"/>
        <path class="c" d="M21.956,4.59a.435.435,0,0,1-.06.07.555.555,0,0,0,.08-.06A.035.035,0,0,0,21.956,4.59Zm.82-1.64a1.417,1.417,0,0,0,.02.3,1.5,1.5,0,0,0,0-.3Zm-.82,1.64a.435.435,0,0,1-.06.07.555.555,0,0,0,.08-.06A.035.035,0,0,0,21.956,4.59Zm-2.05,7.8v.17h.01V12.4Z"/>
      </g>
      <path class="i" d="M16.5,12.668a.583.583,0,0,0,.365-.174c.263-.35-.387-.942-.056-1.227a2.194,2.194,0,0,1,1.876-.407c.654.107,1.286.351,1.947.4a2.627,2.627,0,0,1,.832.12c.616.263.766,1.052.831,1.719.28,2.861-2.462,2.728-4.668,2.72C15.655,15.814,13.685,13.251,16.5,12.668Z"/>
      <path class="j" d="M22.352,14.184l-.3-.73a5.72,5.72,0,0,1-1.806.4,6.887,6.887,0,0,0,.654-.423,7.474,7.474,0,0,0,.629-.676,5.862,5.862,0,0,0,.738-.289l-.234-.494a.724.724,0,0,0,.034-.625l-.693.383a.242.242,0,0,1-.032-.139,1.6,1.6,0,0,1-.263.453,6.784,6.784,0,0,1-3.871-.032l-.258.748a6.965,6.965,0,0,0,2.244.353,7.947,7.947,0,0,0,.845-.047,6.239,6.239,0,0,1-1.387.685,5.873,5.873,0,0,1-2.572-1.171l-.5.614a6.4,6.4,0,0,0,1.507.88,6.026,6.026,0,0,1-1.524-.058l-.135.779a6.66,6.66,0,0,0,1.154.1,7.14,7.14,0,0,0,2.09-.329,7.077,7.077,0,0,0,1.18.1A6.551,6.551,0,0,0,22.352,14.184Z"/>
      <path class="k" d="M3.228,41.266c16.06,1.45,35.44-4.95,31.75-19.68a22.926,22.926,0,0,1,4.88,7.06C48.088,47.136,12.478,50.926,3.228,41.266Z"/>
      <g class="l">
        <path class="d" d="M16.442,15.974A12.451,12.451,0,0,0,9.671,29.419l-.474.093a13.088,13.088,0,0,1,6.9-14.247l.35.709Z"/>
      </g>
      <g class="l">
        <path class="d" d="M20.5,15.3c6.256,4.385,12.084,10.105,11.822,18.355l-.483,0c.16-8.014-5.629-13.513-11.812-17.719L20.5,15.3Z"/>
      </g>
      <g>
        <path class="m" d="M13.878,37.748a1.723,1.723,0,0,1-.605-.106,2.781,2.781,0,0,1-1.4-2.843c.249-4.065,4.585-5.507,8.223-5.507,1.439,0,2.436.177,2.686,1.026.362,1.235-.773,1.892-2.415,2.685a12.1,12.1,0,0,0-1.1.578,9.476,9.476,0,0,0-2.084,1.965c-.29.336-.58.672-.892.983a3.719,3.719,0,0,1-2.412,1.219Z"/>
        <path class="n" d="M20.1,28.7l.016,1.188c1.366,0,1.975.176,2.1.6.2.664-.257,1.09-2.1,1.982a12.431,12.431,0,0,0-1.16.609,9.94,9.94,0,0,0-2.219,2.081c-.293.34-.57.661-.861.95a3.186,3.186,0,0,1-1.993,1.047,1.12,1.12,0,0,1-.4-.07c-.73-.269-1.066-1.36-1.011-2.249.223-3.654,4.251-4.951,7.631-4.951V28.7m0,0c-3.864,0-8.542,1.566-8.817,6.066A3.348,3.348,0,0,0,13.067,38.2a2.31,2.31,0,0,0,.811.144,4.3,4.3,0,0,0,2.831-1.393,18.228,18.228,0,0,1,2.872-2.866c1.352-.845,4.448-1.631,3.773-3.933-.4-1.378-2.026-1.452-3.237-1.454Z"/>
        <path d="M20.1,28.7h.018c1.211,0,2.832.076,3.237,1.454.675,2.3-2.421,3.088-3.773,3.933a18.228,18.228,0,0,0-2.872,2.866,4.3,4.3,0,0,1-2.831,1.393,2.31,2.31,0,0,1-.811-.144,3.348,3.348,0,0,1-1.785-3.436c.275-4.5,4.953-6.066,8.817-6.066m0-.4c-4.068,0-8.921,1.687-9.212,6.437-.089,1.45.513,3.267,2.042,3.833a2.732,2.732,0,0,0,.949.167,4.64,4.64,0,0,0,3.11-1.507c.334-.332.643-.691.943-1.038a8.606,8.606,0,0,1,1.86-1.773c.269-.168.628-.342,1.009-.526,1.5-.725,3.56-1.72,2.934-3.854-.509-1.734-2.608-1.737-3.617-1.739Z"/>
      </g>
      <g>
        <path class="m" d="M22.93,37.707a11.427,11.427,0,0,1-5.3-1.51c-1.247-.682-2.039-1.313-1.851-2.178.193-.889.861-1.235,2.383-1.235.346,0,.693.017,1.023.033s.621.03.895.03c.122,0,.239,0,.349-.009A9.485,9.485,0,0,0,23.2,32.11c.415-.156.831-.313,1.254-.436a4.986,4.986,0,0,1,1.381-.209,2.359,2.359,0,0,1,1.8.676,2.782,2.782,0,0,1-.134,3.165,5.049,5.049,0,0,1-4.57,2.4Z"/>
        <path class="n" d="M25.833,32.059a1.8,1.8,0,0,1,1.353.472A2.264,2.264,0,0,1,27,34.99a4.487,4.487,0,0,1-4.067,2.123,10.829,10.829,0,0,1-5.017-1.437c-1.2-.655-1.649-1.1-1.555-1.531.07-.324.166-.767,1.8-.767.335,0,.672.017.992.032s.641.031.924.031c.135,0,.264,0,.385-.011a9.953,9.953,0,0,0,2.945-.764c.42-.158.817-.307,1.211-.422a4.409,4.409,0,0,1,1.215-.185m0-1.188a5.584,5.584,0,0,0-1.548.233,18.247,18.247,0,0,1-3.893,1.141c-.1.006-.2.008-.315.008-.558,0-1.239-.063-1.916-.063-1.333,0-2.648.245-2.964,1.7-.3,1.4,1.083,2.244,2.146,2.825A12.12,12.12,0,0,0,22.93,38.3,5.66,5.66,0,0,0,28,35.621a3.347,3.347,0,0,0,.078-3.871,2.886,2.886,0,0,0-2.248-.879Z"/>
        <path d="M25.833,30.871a2.886,2.886,0,0,1,2.248.879A3.347,3.347,0,0,1,28,35.621,5.66,5.66,0,0,1,22.93,38.3a12.12,12.12,0,0,1-5.587-1.583c-1.063-.581-2.451-1.422-2.146-2.825.316-1.458,1.631-1.7,2.964-1.7.677,0,1.358.063,1.916.063.11,0,.215,0,.315-.008A18.247,18.247,0,0,0,24.285,31.1a5.584,5.584,0,0,1,1.548-.233m0-.395a5.974,5.974,0,0,0-1.658.248c-.452.131-.9.3-1.326.459a8.6,8.6,0,0,1-2.481.667c-.092,0-.19.007-.291.007-.259,0-.546-.014-.847-.029-.345-.016-.708-.034-1.069-.034-.8,0-2.914,0-3.351,2.015-.383,1.766,1.458,2.773,2.343,3.257A12.428,12.428,0,0,0,22.93,38.7a6.059,6.059,0,0,0,5.409-2.865c.771-1.23,1.113-3.114.041-4.342a3.253,3.253,0,0,0-2.547-1.014Z"/>
      </g>
      <g>
        <path class="m" d="M19.736,39.775a3.775,3.775,0,0,1-1.612-.384c-3.669-1.786-3.34-6.352-1.943-9.72.517-1.249,1.027-2.081,1.828-2.081a1.341,1.341,0,0,1,.139.008c1.279.136,1.453,1.436,1.559,3.257a12.151,12.151,0,0,0,.113,1.239,9.482,9.482,0,0,0,1.02,2.677c.2.4.4.793.568,1.2.425,1.03.616,2.415-.123,3.214a2.077,2.077,0,0,1-1.549.59Z"/>
        <path class="n" d="M18.009,28.184a.656.656,0,0,1,.076,0c.689.074.91.655,1.03,2.7a12.15,12.15,0,0,0,.119,1.3,9.919,9.919,0,0,0,1.076,2.845c.2.4.393.78.55,1.159.338.821.538,1.99-.012,2.584a1.5,1.5,0,0,1-1.113.4,3.157,3.157,0,0,1-1.351-.324c-3.3-1.6-2.953-5.829-1.655-8.959.352-.847.779-1.714,1.28-1.714m0-1.188c-1.291,0-1.936,1.383-2.377,2.447-1.482,3.573-1.828,8.506,2.232,10.482a4.361,4.361,0,0,0,1.871.444,2.635,2.635,0,0,0,1.986-.781c.921-1,.754-2.589.237-3.843A18.2,18.2,0,0,1,20.406,32c-.265-1.573.191-4.734-2.2-4.989a2.015,2.015,0,0,0-.2-.011Z"/>
        <path d="M18.009,27a2.015,2.015,0,0,1,.2.011c2.386.255,1.93,3.416,2.2,4.989a18.2,18.2,0,0,0,1.552,3.749c.517,1.254.684,2.846-.237,3.843a2.635,2.635,0,0,1-1.986.781,4.361,4.361,0,0,1-1.871-.444c-4.06-1.976-3.714-6.909-2.232-10.482C16.073,28.379,16.718,27,18.009,27m0-.4c-1.627,0-2.352,1.751-2.743,2.691-1.561,3.765-1.863,8.9,2.425,10.99a4.765,4.765,0,0,0,2.044.483,3,3,0,0,0,2.277-.908c.9-.969,1.013-2.562.312-4.262-.18-.435-.393-.859-.6-1.269a8.618,8.618,0,0,1-.928-2.4,11.188,11.188,0,0,1-.1-1.133c-.1-1.666-.231-3.947-2.443-4.184a2.269,2.269,0,0,0-.244-.013Z"/>
      </g>
    </symbol>
  </defs>
  <use width="41.542" height="46.779" xlink:href="#a"/>
</svg>
