<?xml version="1.0" encoding="iso-8859-1"?>
<!-- Generator: Adobe Illustrator 19.0.0, SVG Export Plug-In . SVG Version: 6.00 Build 0)  -->
<svg version="1.1" id="Capa_1" xmlns="http://www.w3.org/2000/svg" xmlns:xlink="http://www.w3.org/1999/xlink" x="0px" y="0px"
	 viewBox="0 0 512 512" style="enable-background:new 0 0 512 512;" xml:space="preserve">
<g>
	<g>
		<path d="M400.899,6.896C396.457,2.449,390.546,0,384.257,0s-12.199,2.449-16.638,6.894L319.522,54.99
			c-4.445,4.445-6.894,10.354-6.894,16.639c0,3.695,0.853,7.258,2.454,10.472l-34.266,34.266
			c-9.701,9.701-15.365,22.358-16.173,35.939h-17.287c-0.808-13.581-6.471-26.238-16.173-35.939L196.916,82.1
			c1.601-3.214,2.454-6.777,2.454-10.472c0-6.284-2.449-12.193-6.894-16.638L144.382,6.896C139.94,2.449,134.03,0,127.741,0
			c-6.29,0-12.2,2.449-16.639,6.894c-4.446,4.445-6.894,10.354-6.894,16.639c0,6.285,2.448,12.193,6.894,16.639l48.093,48.093
			c4.442,4.448,10.352,6.897,16.642,6.897c3.697,0,7.26-0.852,10.473-2.453l34.266,34.266c7.668,7.668,11.891,17.863,11.891,28.706
			v42.569c-4.909,4.316-8.016,10.635-8.016,17.67V497h-16.548c-4.142,0-7.5,3.358-7.5,7.5c0,4.142,3.358,7.5,7.5,7.5h96.193
			c4.142,0,7.5-3.358,7.5-7.5c0-4.142-3.358-7.5-7.5-7.5h-16.548V215.919c0-7.035-3.107-13.354-8.016-17.67V155.68
			c0-10.843,4.223-21.038,11.891-28.706l34.266-34.266c3.213,1.6,6.776,2.453,10.473,2.453c6.29,0,12.2-2.449,16.639-6.894
			l48.097-48.097c4.446-4.445,6.894-10.354,6.894-16.639C407.792,17.246,405.341,11.339,400.899,6.896z M181.866,77.665
			c-1.608,1.61-3.749,2.497-6.028,2.497c-2.28-0.001-4.421-0.888-6.032-2.501l-48.097-48.097c-3.326-3.326-3.326-8.738,0.003-12.067
			c1.608-1.61,3.75-2.497,6.029-2.497s4.42,0.887,6.032,2.5l48.097,48.098c1.612,1.612,2.5,3.754,2.5,6.031
			C184.37,73.906,183.482,76.049,181.866,77.665z M247.467,167.306h17.064V192.4c-0.172-0.003-0.343-0.013-0.516-0.013h-16.032
			c-0.173,0-0.344,0.009-0.516,0.013V167.306z M239.45,215.919c0-4.705,3.828-8.532,8.532-8.532h16.032
			c4.706,0,8.533,3.828,8.533,8.532v208.936H239.45V215.919z M272.548,497h-33.097v-57.145h33.097V497z M390.289,29.564l-48.1,48.1
			c-1.608,1.61-3.749,2.497-6.029,2.497c-2.28,0-4.42-0.887-6.032-2.5c-1.612-1.612-2.5-3.755-2.5-6.032
			c0-2.277,0.888-4.419,2.5-6.032l48.1-48.1c1.608-1.61,3.749-2.497,6.028-2.497c2.28,0,4.421,0.887,6.032,2.5
			C393.615,20.826,393.615,26.238,390.289,29.564z"/>
	</g>
</g>
<g>
</g>
<g>
</g>
<g>
</g>
<g>
</g>
<g>
</g>
<g>
</g>
<g>
</g>
<g>
</g>
<g>
</g>
<g>
</g>
<g>
</g>
<g>
</g>
<g>
</g>
<g>
</g>
<g>
</g>
</svg>
