<svg width="371" height="512" viewBox="0 0 371 512" fill="none" xmlns="http://www.w3.org/2000/svg">
<path fill-rule="evenodd" clip-rule="evenodd" d="M0 185.426C0 83.182 83.182 0 185.427 0C287.671 0 370.852 83.182 370.854 185.426C370.854 312.314 204.915 498.593 197.85 506.461C191.226 513.839 179.64 513.852 173.004 506.461C165.939 498.593 0 312.314 0 185.426ZM172.301 241.81C171.673 230.586 162.377 221.678 150.999 221.667H119C107.375 221.679 97.9263 230.977 97.6718 242.543C97.6684 242.695 97.6667 242.847 97.6665 243V309.779V360.333H108.333V289.282V280.333C108.333 277.387 110.721 274.999 113.667 274.999C116.612 274.999 119 277.387 119 280.333V300.613V360.333H166.214H172.334V243C172.334 242.6 172.323 242.204 172.301 241.81ZM183.001 245.951V243C182.974 227.401 171.712 214.091 156.333 211.481V109.667C156.343 100.834 163.501 93.6758 172.334 93.666H225.667C234.5 93.6758 241.656 100.834 241.666 109.667V113.827C238.284 116.835 236.346 121.142 236.333 125.666V147.001C236.333 147.01 236.334 147.018 236.336 147.027C236.337 147.032 236.338 147.037 236.339 147.042C236.341 147.051 236.344 147.061 236.347 147.07L236.347 147.07C236.35 147.079 236.353 147.089 236.355 147.098C236.358 147.109 236.36 147.121 236.36 147.133L210.254 197.897C209.405 199.55 209.476 201.527 210.445 203.114C211.414 204.701 213.14 205.668 215 205.666H230.999V216.334C231.019 231.054 242.947 242.982 257.667 243H268.333C283.055 242.982 294.983 231.054 295 216.334V205.666H310.999C312.859 205.666 314.583 204.696 315.552 203.109C316.521 201.525 316.595 199.547 315.745 197.897L289.639 147.133C289.639 147.123 289.64 147.114 289.642 147.104C289.645 147.092 289.649 147.079 289.653 147.067C289.659 147.046 289.666 147.024 289.666 147.001V125.666C289.654 121.142 287.715 116.835 284.334 113.827V109.667C284.297 77.2817 258.052 51.0366 225.667 51H172.334C139.947 51.0366 113.704 77.2817 113.667 109.667V211.481C98.2866 214.091 87.0269 227.401 87 243V245.401V304.964V365.666C87 368.612 89.3877 371 92.3345 371H176.542H177.667C180.613 371 183.001 368.612 183.001 365.666V245.951ZM252.334 120.333C249.388 120.336 247.002 122.721 247 125.666V141.667H279V125.666C278.997 122.721 276.612 120.336 273.667 120.333H252.334ZM172.334 82.9995H225.667C240.386 83.0166 252.315 94.9453 252.334 109.667H273.667C273.638 83.168 252.164 61.6958 225.667 61.6665H172.334C145.835 61.6958 124.363 83.168 124.334 109.667V211H145.667V109.667C145.684 94.9453 157.613 83.0166 172.334 82.9995ZM268.333 232.333C277.166 232.323 284.324 225.165 284.334 216.334V205.666H241.666V216.334C241.675 225.165 248.833 232.323 257.667 232.333H268.333ZM223.741 194.999H289.666H302.261L280.318 152.333H245.682L223.741 194.999ZM108.333 253.666C108.333 250.722 110.721 248.334 113.667 248.334C116.612 248.334 119 250.722 119 253.666V259C119 261.945 116.612 264.333 113.667 264.333C110.721 264.333 108.333 261.945 108.333 259V253.666ZM268.333 264.333C268.333 261.388 265.945 259 263.001 259C260.054 259 257.667 261.388 257.667 264.333V285.666C257.667 288.612 260.054 291 263.001 291C265.945 291 268.333 288.612 268.333 285.666V264.333ZM224.954 276.901C224 278.554 222.237 279.572 220.328 279.567C218.423 279.567 216.663 278.549 215.713 276.898C214.761 275.248 214.761 273.217 215.713 271.566L226.38 253.095C227.852 250.543 231.116 249.667 233.667 251.142C236.219 252.614 237.093 255.875 235.621 258.427L224.954 276.901ZM292.334 251.142C291.109 251.847 290.213 253.012 289.847 254.379C289.48 255.746 289.673 257.201 290.381 258.427L301.048 276.901C302.52 279.452 305.782 280.326 308.333 278.854C310.884 277.382 311.758 274.118 310.286 271.566L299.62 253.095C298.914 251.867 297.75 250.973 296.382 250.607C295.015 250.238 293.558 250.431 292.334 251.142Z" fill="black"/>
</svg>
