<svg width="31" height="28" viewBox="0 0 31 28" fill="none" xmlns="http://www.w3.org/2000/svg">
<path d="M2.99287 21.8344L7.85622 19.403C8.31491 19.1734 8.6 18.7121 8.6 18.199V16.4777C8.48342 16.3352 8.36073 16.1728 8.23396 15.9936C7.6032 15.1027 7.09767 14.111 6.73011 13.0414C6.01178 12.712 5.54545 12.0018 5.54545 11.2V9.16364C5.54545 8.67338 5.72873 8.1984 6.05454 7.82727V5.11942C6.02604 4.83942 5.91404 3.17265 7.11956 1.7976C8.16524 0.6048 9.86204 0 12.1636 0C14.4652 0 16.162 0.6048 17.2077 1.79709C17.9383 2.63047 18.1841 3.56924 18.2585 4.24327C19.1311 3.79222 20.1594 3.56364 21.3273 3.56364C26.6162 3.56364 26.9242 8.07164 26.9273 8.14545V10.4766C27.2572 10.836 27.4364 11.2509 27.4364 11.6628V13.4212C27.4364 13.9705 27.1905 14.4826 26.7689 14.8288C26.3489 16.4121 25.316 17.6084 24.9138 18.0284V19.4249C24.9138 19.8255 25.1317 20.1931 25.51 20.3998L28.8969 22.5242C30.1941 23.2319 31 24.5896 31 26.067V28H23.8727H22.8545H0.454544V25.9417C0.454544 24.1915 1.42742 22.6174 2.99287 21.8344ZM23.8727 25.8425V26.9818H29.9818V26.067C29.9818 24.9623 29.3791 23.9471 28.3828 23.4029L24.9963 21.2785C24.3177 20.9084 23.8961 20.1987 23.8961 19.4249V17.5967L24.058 17.4455C24.0713 17.4333 25.4239 16.1555 25.8236 14.4139L25.8699 14.2123L26.044 14.1003C26.2782 13.9486 26.4182 13.6945 26.4182 13.4212V11.6628C26.4182 11.4795 26.2935 11.2616 26.0766 11.0651L25.9091 10.9139L25.9101 8.17498C25.9009 8.02887 25.6357 4.58182 21.3273 4.58182C20.109 4.58182 19.0832 4.86335 18.2727 5.41876V7.82727C18.5985 8.1984 18.7818 8.67338 18.7818 9.16364V11.2C18.7818 11.3548 18.764 11.507 18.7304 11.6546C18.7167 11.7137 18.6892 11.7676 18.6703 11.8247C18.6423 11.9102 18.6199 11.9983 18.5807 12.0792C18.5802 12.0802 18.5797 12.0807 18.5792 12.0817C18.4489 12.3505 18.259 12.5908 18.0197 12.7828C18.0172 12.7924 18.0141 12.8011 18.0116 12.8103C17.981 12.9268 17.9489 13.0429 17.9143 13.1564L17.8731 13.2893C17.866 13.3127 17.8573 13.3367 17.8497 13.3601C17.8319 13.4151 17.8145 13.4695 17.7962 13.5235C17.7657 13.6126 17.7336 13.7047 17.6964 13.805C17.6807 13.8468 17.6633 13.8844 17.6471 13.9257C17.6053 14.0321 17.5636 14.1349 17.5198 14.2367C17.5091 14.2612 17.4999 14.2876 17.4892 14.3116L17.4607 14.3757C17.4475 14.4052 17.4337 14.4317 17.4205 14.4607C17.3706 14.5697 17.3217 14.6751 17.2708 14.7769C17.2627 14.7932 17.2551 14.811 17.2469 14.8273C17.2148 14.8909 17.1828 14.951 17.1507 15.0121C17.0957 15.1169 17.0417 15.2157 16.9878 15.3114C16.9613 15.3583 16.9353 15.4041 16.9094 15.4484C16.8361 15.5736 16.7663 15.6887 16.6986 15.7956C16.6839 15.8185 16.6696 15.8424 16.6553 15.8643C16.5321 16.0552 16.4252 16.21 16.3367 16.3306C16.3132 16.3627 16.2929 16.3902 16.273 16.4172C16.2618 16.4319 16.2465 16.4533 16.2369 16.4665V18.1511C16.2369 18.6439 16.5057 19.096 16.9379 19.3322L18.2849 20.0668L18.5196 20.046L18.6153 20.2471L21.4795 21.8095C22.9559 22.6159 23.8727 24.1604 23.8727 25.8425ZM1.47272 26.9818H22.8545V25.8425C22.8545 24.5336 22.1408 23.3306 20.9918 22.7044L16.4502 20.2272C15.6901 19.8123 15.2182 19.0166 15.2182 18.1516V16.1061V16.1056L15.3169 15.9875L15.3363 15.9646C15.3373 15.9631 15.3689 15.9249 15.4203 15.8577C15.4233 15.8536 15.4264 15.8495 15.43 15.8455C15.4569 15.8103 15.4885 15.7681 15.5247 15.7177C15.5252 15.7167 15.5257 15.7161 15.5262 15.7151C15.602 15.6097 15.6972 15.4728 15.8031 15.3079C15.8057 15.3043 15.8077 15.3002 15.8103 15.2967C15.8601 15.2188 15.9131 15.1337 15.9671 15.0436C15.9711 15.037 15.9752 15.0304 15.9793 15.0233C16.0943 14.8303 16.2165 14.6119 16.3382 14.3701C16.3382 14.3701 16.3387 14.3696 16.3387 14.3691C16.4033 14.2393 16.468 14.1028 16.5311 13.9608C16.5398 13.9409 16.5489 13.9216 16.5576 13.9017C16.5856 13.8381 16.6136 13.7714 16.6421 13.7027C16.6523 13.6777 16.6625 13.6518 16.6727 13.6263C16.6991 13.5596 16.7261 13.4924 16.7546 13.4156C16.8065 13.2771 16.8554 13.1325 16.9023 12.9833L16.9303 12.8927C16.9333 12.8825 16.9369 12.8724 16.9399 12.8617C16.9878 12.7008 17.0336 12.5364 17.0723 12.3673L17.1186 12.1657L17.2922 12.0537C17.5875 11.8633 17.7636 11.5441 17.7636 11.2V9.16364C17.7636 8.87804 17.6425 8.61178 17.4225 8.41273L17.2545 8.26153V5.09091V4.91069L17.2683 4.9C17.2856 4.53244 17.2637 3.40582 16.442 2.46858C15.5985 1.50589 14.1588 1.01818 12.1636 1.01818C10.1756 1.01818 8.73898 1.50233 7.8944 2.45789C6.9032 3.5784 7.06713 5.012 7.06815 5.02422L7.07273 8.26153L6.90473 8.41324C6.6848 8.61178 6.56364 8.87804 6.56364 9.16364V11.2C6.56364 11.6444 6.85484 12.0334 7.28756 12.1668L7.54109 12.2447L7.62255 12.4967C7.96313 13.5561 8.44829 14.5345 9.06531 15.4051C9.21651 15.6194 9.36364 15.8093 9.49142 15.9544L9.61818 16.099V18.199C9.61818 19.1001 9.11774 19.91 8.31185 20.3132L3.44851 22.7447C2.22974 23.354 1.47272 24.5789 1.47272 25.9417V26.9818Z" fill="white"/>
</svg>
