<svg width="24" height="24" viewBox="0 0 24 24" fill="none" xmlns="http://www.w3.org/2000/svg">
<path d="M20.9576 5.6864C20.9576 3.5648 20.4464 3.0536 18.3248 3.0536H16.2176V2H19.376C20.8304 2 22.0088 3.1784 22.0088 4.6328V7.7912H20.9552V5.6864H20.9576ZM3.0536 5.6864V7.7936H2V4.6328C2 3.1784 3.1784 2 4.6328 2H7.7912V3.0536H5.684C3.5912 3.0536 3.0536 3.5648 3.0536 5.6864ZM3.0536 18.3248C3.0536 20.4152 3.596 20.9576 5.6864 20.9576H7.7936V22.0112H4.6328C3.1784 22.0112 2 20.8328 2 19.3784V16.2176H3.0536V18.3248ZM20.9576 18.3248V16.2176H22.0112V19.376C22.0112 20.8304 20.8328 22.0088 19.3784 22.0088H16.2176V20.9576H18.3248C20.4464 20.9576 20.9576 20.4152 20.9576 18.3248Z" fill="white"/>
<rect x="3" y="11" width="18" height="1.4" rx="0.3" fill="white"/>
</svg>
