{
    "nodes": [
        {
            "id": "0",
            "group": 1
        },
        {
            "id": "1",
            "group": 1
        },
        {
            "id": "2",
            "group": 1
        },
        {
            "id": "3",
            "group": 1
        },
        {
            "id": "4",
            "group": 1
        },
        {
            "id": "5",
            "group": 1
        },
        {
            "id": "6",
            "group": 1
        },
        {
            "id": "7",
            "group": 2
        },
        {
            "id": "8",
            "group": 2
        },
        {
            "id": "9",
            "group": 2
        },
        {
            "id": "10",
            "group": 2
        },
        {
            "id": "11",
            "group": 3
        },
        {
            "id": "12",
            "group": 4
        },
        {
            "id": "13",
            "group": 4
        },
        {
            "id": "14",
            "group": 4
        },
        {
            "id": "15",
            "group": 4
        },
        {
            "id": "16",
            "group": 4
        },
        {
            "id": "17",
            "group": 5
        },
        {
            "id": "18",
            "group": 5
        },
        {
            "id": "19",
            "group": 5
        }
    ],
    "links": [
        {
            "source": "0",
            "target": "1",
            "value": 1
        },
        {
            "source": "0",
            "target": "2",
            "value": 1
        },
        {
            "source": "0",
            "target": "3",
            "value": 1
        },
        {
            "source": "0",
            "target": "4",
            "value": 1
        },
        {
            "source": "0",
            "target": "5",
            "value": 1
        },
        {
            "source": "0",
            "target": "6",
            "value": 1
        },
        {
            "source": "7",
            "target": "8",
            "value": 1
        },
        {
            "source": "7",
            "target": "9",
            "value": 1
        },
        {
            "source": "7",
            "target": "10",
            "value": 1
        },
        {
            "source": "11",
            "target": "10",
            "value": 1
        },
        {
            "source": "12",
            "target": "13",
            "value": 1
        },
        {
            "source": "12",
            "target": "14",
            "value": 1
        },
        {
            "source": "12",
            "target": "15",
            "value": 1
        },
        {
            "source": "12",
            "target": "16",
            "value": 1
        },
        {
            "source": "17",
            "target": "18",
            "value": 1
        },
        {
            "source": "17",
            "target": "19",
            "value": 1
        },
        {
            "source": "0",
            "target": "7",
            "value": 1
        },
        {
            "source": "7",
            "target": "11",
            "value": 1
        },
        {
            "source": "11",
            "target": "12",
            "value": 1
        },
        {
            "source": "12",
            "target": "17",
            "value": 1
        }
    ]
}
