{
  "elements": [
    {
      "z_virus": {
        "id": 0,
        "type": "micros",
        "damage": -1,
        "chance": 0.75,
        "infect": true
      }
    },
    {
      "flesh_eater": {
        "id": 1,
        "type": "micros",
        "damage": -2,
        "chance": 0.7,
        "infect": true
      }
    },
    {
      "spring_virus": {
        "id": 2,
        "type": "micros",
        "damage": -3,
        "chance": 0.65,
        "infect": true
      }
    },
    {
      "t_virus": {
        "id": 3,
        "type": "micros",
        "damage": -4,
        "chance": 0.6,
        "infect": true
      }
    },
    {
      "borax": {
        "id": 4,
        "type": "micros",
        "damage": -5,
        "chance": 0.55,
        "infect": true
      }
    },
    {
      "lis": {
        "id": 5,
        "type": "dinos",
        "damage": -7,
        "chance": 0.7,
        "move": true
      }
    },
    {
      "heg": {
        "id": 6,
        "type": "dinos",
        "damage": -7,
        "chance": 0.65,
        "move": true
      }
    },
    {
      "pte": {
        "id": 7,
        "type": "dinos",
        "damage": -8,
        "chance": 0.6,
        "move": true
      }
    },
    {
      "tri": {
        "id": 8,
        "type": "dinos",
        "damage": -9,
        "chance": 0.55,
        "move": true
      }
    },
    {
      "rex": {
        "id": 9,
        "type": "dinos",
        "damage": -10,
        "chance": 0.5,
        "move": true
      }
    },{
      "z_virus_s": {
        "id": 10,
        "type": "micros",
        "damage": -4,
        "chance": 0.75,
        "infect": true
      }
    },
    {
      "flesh_eater_s": {
        "id": 11,
        "type": "micros",
        "damage": -5,
        "chance": 0.7,
        "infect": true
      }
    },
    {
      "spring_virus_s": {
        "id": 12,
        "type": "micros",
        "damage": -6,
        "chance": 0.65,
        "infect": true
      }
    },
    {
      "t_virus_s": {
        "id": 13,
        "type": "micros",
        "damage": -7,
        "chance": 0.6,
        "infect": true
      }
    },
    {
      "borax_s": {
        "id": 14,
        "type": "micros",
        "damage": -8,
        "chance": 0.55,
        "infect": true
      }
    },
    {
      "lis_s": {
        "id": 15,
        "type": "dinos",
        "damage": -11,
        "chance": 0.7,
        "move": true
      }
    },
    {
      "heg_s": {
        "id": 16,
        "type": "dinos",
        "damage": -11,
        "chance": 0.65,
        "move": true
      }
    },
    {
      "pte_s": {
        "id": 17,
        "type": "dinos",
        "damage": -12,
        "chance": 0.6,
        "move": true
      }
    },
    {
      "tri_s": {
        "id": 18,
        "type": "dinos",
        "damage": -14,
        "chance": 0.55,
        "move": true
      }
    },
    {
      "rex_s": {
        "id": 19,
        "type": "dinos",
        "damage": -15,
        "chance": 0.5,
        "move": true
      }
    }
  ]
}
