<svg width="{width}" height="{height}" viewBox="0 0 122 121" fill="none" xmlns="http://www.w3.org/2000/svg">
<path d="M60.9269 0.474365C74.7764 0.474365 86.0038 11.7017 86.0038 25.5512H35.85C35.85 11.7017 47.0773 0.474365 60.9269 0.474365Z" fill="currentColor"/>
<path d="M30.8274 60.6588C30.8274 44.0393 44.3001 30.5666 60.9196 30.5666C77.5392 30.5666 91.0119 44.0393 91.0119 60.6588C91.0119 77.2784 77.5392 90.7511 60.9196 90.7511C44.3001 90.7511 30.8274 77.2784 30.8274 60.6588Z" fill="currentColor"/>
<path d="M25.8141 35.5818C11.9645 35.5818 0.737183 46.8091 0.737183 60.6587C0.737183 74.5083 11.9645 85.7357 25.8141 85.7357V35.5818Z" fill="currentColor"/>
<path d="M121.106 60.6587C121.106 74.5083 109.879 85.7357 96.0293 85.7357V35.5818C109.879 35.5818 121.106 46.8091 121.106 60.6587Z" fill="currentColor"/>
<path d="M35.85 95.7678C35.85 109.617 47.0773 120.845 60.9269 120.845C74.7764 120.845 86.0038 109.617 86.0038 95.7678H35.85Z" fill="currentColor"/>
<path d="M96.0293 10.505C104.339 10.505 111.075 17.2414 111.075 25.5511H96.0293V10.505Z" fill="currentColor"/>
<path d="M96.0293 110.812C104.339 110.812 111.075 104.076 111.075 95.7664H96.0293V110.812Z" fill="currentColor"/>
<path d="M10.7711 25.551C10.7711 17.2413 17.5075 10.5049 25.8172 10.5049V25.551H10.7711Z" fill="currentColor"/>
<path d="M10.7711 95.7678C10.7711 104.078 17.5075 110.814 25.8172 110.814V95.7678H10.7711Z" fill="currentColor"/>
</svg>
