<svg xmlns="http://www.w3.org/2000/svg" version="1.1" viewBox="0 0 1280 1284">
<path transform="translate(150)" d="m0 0h396l6 3 7 2 1 2 1 322 5 25 7 14 8 10 9 8 13 8 18 6 16 3 314 1 8 3 1 3v347l-3 5-3 2-513 1-37 5-29 10-19 10-13 9-9 9-7 6-1 2h-2l-2 4-12 13-10 16-7 15-7 21-5 32-1 354-1 9-3 4h-149v-2l-5-2-9-4-29-12-10-6-13-10-25-25-10-13-10-17-6-15-7-19-3-4v-1021l5-10 7-21 6-11 8-14 8-11 10-13 9-8 10-8 13-9 21-11 24-9 18-4 10-4z" fill="currentColor"/>
<path transform="translate(768,884)" d="m0 0h63l16 2 20 2 29 9 20 10 16 11 12 11 10 13 6 11 8 16 7 21 4 16 1 7v20l-3 17-7 24-7 17-10 16-10 13-9 9-15 11-16 9-16 7-22 6-18 2-45 1-1 2-1 72-1 12-4 12-5 9-8 7-8 5h-30l-5-4-8-7-6-10-5-12v-332l4-12 7-9 9-7 11-4zm39 80-7 3v114l1 2 3 1h41l17-5 12-6 10-10 9-15 7-20v-7l-6-19-4-10-10-12-10-7-10-5-17-4z" fill="currentColor"/>
<path transform="translate(448,884)" d="m0 0h63l16 2 21 2 30 10 16 8 18 12 12 11 10 13 8 14 6 13 7 21 5 31v7l-3 14-2 17-9 25-9 17-9 13-12 13-14 11-15 9-17 8-22 7-5 1-15 1-47 1-1 80-2 9-4 11-6 9-7 6-5 2-1 2h-31v-2l-5-2-10-9-5-10-3-9-1-6v-325l4-14 7-9 7-6 8-4 13-3zm36 80-4 4v115l2 1h43l17-5 12-6 7-6 7-10 8-15 3-16-1-8-3-16-7-13-12-12-9-6-11-4-13-3z" fill="currentColor"/>
<path transform="translate(642,10)" d="m0 0 6 3 13 11 8 7 116 116 7 8 20 20v2l4 2 7 8 79 79 6 5 4 4v2l4 2 8 8 7 8 8 8 9 11 5 9-6 1h-302l-4-2-1-4v-305z" fill="currentColor"/>
<path transform="translate(1089,884)" d="m0 0h138l13 1 16 4 11 7 7 8 6 10v23l-9 14-7 7-13 5-10 1-37 1-3 3-1 279-2 10-8 15-8 8-6 4h-31l-3-3-7-4-5-5-3-4-6-16-1-5-1-277-2-4-3-1-40-1-13-4-9-6-6-8-4-11-2-8 1-10 4-12 10-11 8-5 17-4z" fill="currentColor"/>
</svg>
