<svg width="24" height="24" viewBox="0 0 24 24" fill="none" xmlns="http://www.w3.org/2000/svg">
<path fill-rule="evenodd" clip-rule="evenodd" d="M22.6288 11.0551C20.0662 6.43919 16.0964 3.99997 12.0007 4C7.90507 4.00003 3.93525 6.4393 1.3727 11.0552C1.04764 11.6407 1.04764 12.3594 1.3727 12.9449C3.93525 17.5608 7.90508 20 12.0007 20C16.0964 20 20.0662 17.5607 22.6288 12.9448C22.9538 12.3593 22.9538 11.6406 22.6288 11.0551ZM11.5528 8.89443L10.7412 10.5176C10.6928 10.6144 10.6144 10.6928 10.5176 10.7412L8.89443 11.5528C8.5259 11.737 8.5259 12.263 8.89443 12.4472L10.5176 13.2588C10.6144 13.3072 10.6928 13.3856 10.7412 13.4824L11.5528 15.1056C11.737 15.4741 12.263 15.4741 12.4472 15.1056L13.2588 13.4824C13.3072 13.3856 13.3856 13.3072 13.4824 13.2588L15.1056 12.4472C15.4741 12.263 15.4741 11.737 15.1056 11.5528L13.4824 10.7412C13.3856 10.6928 13.3072 10.6144 13.2588 10.5176L12.4472 8.89443C12.263 8.5259 11.737 8.5259 11.5528 8.89443Z" fill="currentColor"/>
</svg>
