#
# Stamps.pts
# Author: Firstmate
# Last Modified 05/28/2010 03:03
# 
# for crators
field.ptx&24$5,5&0,0$24,2112,0,0^1,0$25,2112,0,0^2,0$26,2112,0,0^3,0$27,2112,0,0^4,0$28,2112,0,0^0,1$29,2112,0,0^1,1$30,2112,0,0^2,1$31,2112,0,0^3,1$32,2112,0,0^4,1$33,2112,0,0^0,2$34,2112,0,0^1,2$35,2112,0,0^2,2$36,2112,0,0^3,2$37,2112,0,0^4,2$38,2112,0,0^0,3$39,2112,0,0^1,3$40,2112,0,0^2,3$41,2112,0,0^3,3$42,2112,0,0^4,3$43,2112,0,0^0,4$44,2112,0,0^1,4$45,2112,0,0^2,4$46,2112,0,0^3,4$47,2112,0,0^4,4$48,2112,0,0
# green box
field.ptx&85$2,2&0,0$85,2112,0,0^1,0$86,2112,0,0^0,1$87,2112,0,0^1,1$88,2112,0,0
# white table
field.ptx&89$2,2&0,0$89,2112,0,0^1,0$89,0112,0,0^0,1$89,2110,0,0^1,1$89,0110,0,0
#
#Villyer's Edits
#
# orange thing (2x2)
field.ptx&75$2,2&0,0$75,2112,0,0^1,0$81,2112,0,0^0,1$78,2112,0,0^1,1$83,2112,0,0
# orange thing (3x3)
field.ptx&79$3,3&0,0$75,2112,0,0^1,0$80,2112,0,0^2,0$81,2112,0,0^0,1$76,2112,0,0^1,1$79,2112,0,0^2,1$82,2112,0,0^0,2$78,2112,0,0^1,2$77,2112,0,0^2,2$83,2112,0,0
# protected nade hole
field.ptx&109$3,2&0,0$110,2112,0,0^1,0$109,2112,0,0^2,0$110,0112,0,0^0,1$4,1021,0,0^1,1$100,1021,0,0^2,1$4,1201,0,0
# cement ring
field.ptx&57$4,4&0,0$57,1021,0,0^1,0$56,2112,0,0^2,0$56,2112,0,0^3,0$57,2112,0,0^0,1$56,1021,0,0^1,1$55,2112,0,0^2,1$55,2112,0,0^3,1$56,1201,0,0^0,2$56,1021,0,0^1,2$55,2112,0,0^2,2$55,2112,0,0^3,2$56,1201,0,0^0,3$57,0110,0,0^1,3$56,0110,0,0^2,3$56,0110,0,0^3,3$57,1201,0,0
# slope to grass
field.ptx&104$3,2&0,0$57,0112,0,0^1,0$56,2112,0,0^2,0$57,2112,0,0^0,1$4,1021,0,0^1,1$104,1021,0,0^2,1$4,1201,0,0
# ILS donut
field.ptx&2$2,2&0,0$2,1021,0,0^1,0$2,2112,0,0^0,1$2,0110,0,0^1,1$2,1201,0,0
#barb wire thing
field.ptx&98$3,3&0,0$58,0110,0,0^1,0$56,0110,0,0^2,0$58,1021,0,0^0,1$4,1021,0,0^1,1$98,1021,0,0^2,1$4,1201,0,0^0,2$58,1201,0,0^1,2$56,2112,0,0^2,2$58,2112,0,0^
#crate (in cement)
field.ptx&58$3,3&0,0$58,0110,0,0^1,0$56,0110,0,0^2,0$58,1021,0,0^0,1$56,1201,0,0^1,1$84,2112,0,0^2,1$56,1021,0,0^0,2$58,1201,0,0^1,2$56,2112,0,0^2,2$58,2112,0,0^
#crate (in dirt)
field.ptx&50$3,3&0,0$50,2112,0,0^1,0$49,1201,0,0^2,0$50,1201,0,0^0,1$49,2112,0,0^1,1$84,2112,0,0^2,1$49,0110,0,0^0,2$50,1021,0,0^1,2$49,1021,0,0^2,2$50,0110,0,0^
#
#City stamps
#blown out wall to grass
city.ptx&51$3,4&0,0$82,1021,0,0^1,0$51,2112,0,0^2,0$52,2112,0,0^0,1$53,2112,0,0^1,1$54,2112,0,0^2,1$55,2112,0,0^0,2$56,2112,0,0^1,2$57,2112,0,0^2,2$58,2112,0,0^0,3$82,1021,0,0^1,3$59,2112,0,0^2,3$60,2112,0,0^
#blown out wall to street
city.ptx&61$3,4&0,0$82,1021,0,0^1,0$61,2112,0,0^2,0$62,2112,0,0^0,1$63,2112,0,0^1,1$64,2112,0,0^2,1$65,2112,0,0^0,2$66,2112,0,0^1,2$67,2112,0,0^2,2$68,2112,0,0^0,3$82,1021,0,0^1,3$69,2112,0,0^2,3$70,2112,0,0^
#blown out wall to cement
city.ptx&71$3,4&0,0$82,1021,0,0^1,0$71,2112,0,0^2,0$72,2112,0,0^0,1$73,2112,0,0^1,1$74,2112,0,0^2,1$75,2112,0,0^0,2$76,2112,0,0^1,2$77,2112,0,0^2,2$78,2112,0,0^0,3$82,1021,0,0^1,3$79,2112,0,0^2,3$80,2112,0,0^
#crater
city.ptx&93$5,5&0,0$93,2112,0,0^1,0$94,2112,0,0^2,0$95,2112,0,0^3,0$96,2112,0,0^4,0$97,2112,0,0^0,1$98,2112,0,0^1,1$99,2112,0,0^2,1$100,2112,0,0^3,1$101,2112,0,0^4,1$102,2112,0,0^0,2$103,2112,0,0^1,2$104,2112,0,0^2,2$105,2112,0,0^3,2$106,2112,0,0^4,2$107,2112,0,0^0,3$108,2112,0,0^1,3$109,2112,0,0^2,3$110,2112,0,0^3,3$111,2112,0,0^4,3$112,2112,0,0^0,4$113,2112,0,0^1,4$114,2112,0,0^2,4$115,2112,0,0^3,4$116,2112,0,0^4,4$117,2112,0,0^
#pothole
city.ptx&118$2,2&0,0$118,2112,0,0^1,0$119,2112,0,0^0,1$120,2112,0,0^1,1$121,2112,0,0^
#large debris
city.ptx&122$4,4&0,0$122,2112,0,0^1,0$123,2112,0,0^2,0$124,2112,0,0^3,0$125,2112,0,0^0,1$126,2112,0,0^1,1$127,2112,0,0^2,1$128,2112,0,0^3,1$129,2112,0,0^0,2$130,2112,0,0^1,2$131,2112,0,0^2,2$132,2112,0,0^3,2$133,2112,0,0^0,3$134,2112,0,0^1,3$135,2112,0,0^2,3$136,2112,0,0^3,3$137,2112,0,0^
#small debris
city.ptx&138$3,4&0,0$138,2112,0,0^1,0$139,2112,0,0^2,0$140,2112,0,0^0,1$141,2112,0,0^1,1$142,2112,0,0^2,1$143,2112,0,0^0,2$144,2112,0,0^1,2$145,2112,0,0^2,2$146,2112,0,0^0,3$147,2112,0,0^1,3$148,2112,0,0^2,3$149,2112,0,0^
#clean propane tank
city.ptx&150$2,4&0,0$150,2112,0,0^1,0$151,2112,0,0^0,1$152,2112,0,0^1,1$153,2112,0,0^0,2$154,2112,0,0^1,2$155,2112,0,0^0,3$156,2112,0,0^1,3$157,2112,0,0^
#dirty propane tank
city.ptx&158$2,4&0,0$158,2112,0,0^1,0$159,2112,0,0^0,1$160,2112,0,0^1,1$161,2112,0,0^0,2$162,2112,0,0^1,2$163,2112,0,0^0,3$164,2112,0,0^1,3$165,2112,0,0^
#red car
city.ptx&166$2,3&0,0$166,2112,0,0^1,0$167,2112,0,0^0,1$168,2112,0,0^1,1$169,2112,0,0^0,2$170,2112,0,0^1,2$171,2112,0,0^
#green car
city.ptx&172$2,3&0,0$172,2112,0,0^1,0$173,2112,0,0^0,1$174,2112,0,0^1,1$175,2112,0,0^0,2$176,2112,0,0^1,2$177,2112,0,0^
#street barb wire circle
city.ptx&13$2,2&0,0$13,2112,0,0^1,0$13,1201,0,0^0,1$13,1021,0,0^1,1$13,0110,0,0^
#grass barb wire circle
city.ptx&16$2,2&0,0$16,2112,0,0^1,0$16,1201,0,0^0,1$16,1021,0,0^1,1$16,0110,0,0^
#red/white barrier
city.ptx&14$2,1&0,0$14,2112,0,0^1,0$14,0110,0,0^
#concrete barrier
city.ptx&15$2,1&0,0$15,2112,0,0^1,0$15,0112,0,0^
field.ptx&90$2,4&0,0$90,2112,0,0^1,0$91,2112,0,0^0,1$92,2112,0,0^1,1$93,2112,0,0^0,2$94,2112,0,0^1,2$0,2112,0,0^0,3$96,2112,0,0^1,3$97,2112,0,0^