{
	"appenders": {
		"global": {
			"type": "file",
			"filename": "log/global.log",
			"pattern": "-yyyy-MM-dd",
			"maxLogSize": 1000000,
			"numBackups": 2
		},
		"files": {
			"type": "file",
			"filename": "log/files.log",
			"pattern": "-yyyy-MM-dd",
			"maxLogSize": 10485760,
			"numBackups": 5
		},
		"error": {
			"type": "file",
			"filename": "log/error.log",
			"pattern": "-yyyy-MM-dd",
			"maxLogSize": 1000000,
			"numBackups": 2
		}
	},
	"categories": {
		"default": { "appenders": [ "global" ], "level": "DEBUG" },
		"files": { "appenders": [ "files" ], "level": "DEBUG" },
		"error": { "appenders": [ "error"], "level": "ERROR" }
	}
}