1, Northampton, Northamptonshire, All Saints, 15,,, Ab, 20, 10, 1975, South Northamptonshire Society, 0, 5010, Bristol, Surprise, Maximus, 3, 10, Ringer1, Ringer2, "3 Ringer", Ringer4, Ringer5, Ringer6, Ringer7, Ringer8, Ringer9, Ringer10, "Ringer, 11", Ringer12, 11 Ringer
2, Northampton, Northamptonshire, St Giles, 13, cwt,, B#, 21, 11, 1976, South Northamptonshire Society, 1, 5011, Cambridge, Delight, Royal, 2, 15, Ringer1, Ringer2, Ringer3, Ringer4, Ringer5, Ringer6, Ringer7, Ringer8, Ringer9, Ringer10,,, Ringer2
3, Northampton, Northamptonshire, 22 High street, 13,,, HB, 22, 12, 1978, South Northamptonshire Society, 1, 5011, Cambridge, Delight, Royal, 2, 15, Ringer1, Ditto, Ringer3, Ditto, Ringer5, Ditto, Ringer7, Ditto, Ringer9, Ditto,,, Ringer3
4, Northampton, Northamptonshire, St Giles, 13, cwt,, B#, 22, 12, 1979, South Northamptonshire Society, 1, 5011, Cambridge, Delight, Major, 2, 15, Ringer1, Ringer2, "3 Ringer", Ringer4, Ringer5, Ringer6, Ringer7, Ringer8, ,,,, "Ringer, 3"
5, Northampton, Northamptonshire, St Giles, 13, cwt,, B#, 21, 11, 1980, South Northamptonshire Society, 1, 5011, Cambridge, Delight, Royal, 2, 15, Ringer1, Ringer2, Ringer3, Ringer4, Ringer5, Ringer6, Ringer7, Ringer8, Ringer9, Ringer10,,, Ringer2