Group,Value,,Na,Mg,Al,Si,P,S,Cl,K,Ca,Mn,Fe,Ni,Cu,Zn
Adults,Recommended Daily Allowance,,1000,362.5,,,700,,,3000,1000,2.05,13,,0.9,9.5
Adults,Tolerable Upper Intake Level,,2250,,,,4000,,,,2500,11,45,,,40
Men,Recommended Daily Allowance,,1000,410,,,700,,,3400,1000,2.3,8,,0.9,11
Men,Adequate Intake,,,,,,,,,,,,,,,
Men,Estimated Average Requirement,,,,,,,,,,,,,,,
Men,Tolerable Upper Intake Level,,2250,,,,4000,,,,2500,11,45,1,,40
Women,Recommended Daily Allowance,,1000,315,,,700,,,2600,1000,1.8,18,,0.9,8
Women,Adequate Intake,,,,,,,,,,,,,,,
Women,Estimated Average Requirement,,,,,,,,,,,,,,,
Women,Tolerable Upper Intake Level,,2250,,,,4000,,,,2500,11,45,1,,40
Pregnant Women,Recommended Daily Allowance,,,355,,,700,,,2900,1000,2,27,,1,11
Pregnant Women,Adequate Intake,,,,,,,,,,,,,,,
Pregnant Women,Estimated Average Requirement,,,,,,,,,,,,,,,
Pregnant Women,Tolerable Upper Intake Level,,,,,,3500,,,,2500,11,45,1,,40
Breastfeeding Women,Recommended Daily Allowance,,,315,,,700,,,2800,1000,2.6,9,,1.3,12
Breastfeeding Women,Adequate Intake,,,,,,,,,,,,,,,
Breastfeeding Women,Estimated Average Requirement,,,,,,,,,,,,,,,
Breastfeeding Women,Tolerable Upper Intake Level,,,,,,4000,,,,2500,11,45,1,,40
Children 1 - 3,Recommended Daily Allowance,,700,80,,,460,,,2000,700,1.2,7,,3.4,3
Children 1 - 3,Adequate Intake,,,,,,,,,,,,,,,
Children 1 - 3,Estimated Average Requirement,,,,,,,,,,,,,,,
Children 1 - 3,Tolerable Upper Intake Level,,1500,,,,3000,,,,2500,2,40,0.2,,7