slug,name,crop group,additional considerations / thoughts,how many?,keep this for general survey?,prioritize,2021 sample targets,Partners,Rationale,"Is this valuable / useful, market perspective generally",does it have significant variation... have we measured it already?,samples run,"For RFC as a service, is this something growers will demand?",bqi model,anti model,poly model,protein model,"Is there other research utility for this crop (unusual situations useful for other reasons, common side-by-sides... etc.)?",Observational study,Paid partners only,Standard RFC shipping,Special shipping,standard dry weight,Sample wt (g),ml methanol/water (80/20),USDA averages,Na,Mg,Al,Si,P,S,Cl,K,Ca,Mn,Fe,Ni,Cu,Zn,Na_perc_rda,Mg_perc_rda,Al_perc_rda,Si_perc_rda,P_perc_rda,S_perc_rda,Cl_perc_rda,K_perc_rda,Ca_perc_rda,Mn_perc_rda,Fe_perc_rda,Ni_perc_rda,Cu_perc_rda,Zn_perc_rda
,,,,,,,,,,,,,,,,,,,,,,,,,,,,,,,,,,,,,,,,,,,,,,,,,,,,,,
apple,Apple,fruit,big impact,,"yes, but waiting on data",,100,"G, C","large market impact, few samples to date",,analysis in process,78,,,,,,,X,,X,,14.44,1,10,,1,5,,,11,,,107,6,,0.12,,0.027,0.04,0.10%,1.22%,,,1.57%,,,3.15%,0.60%,,1.50%,,3.00%,0.36%
beet,Beet,root_tuber,good results,,yes,,75,"G, C","good results to date, could increase nutrients predicted",,High (20x or more),257,,,X,,,,X,,X,,12.42,1,13,,78,23,,,40,,,325,16,,0.8,,0.075,0.35,7.80%,5.61%,,,5.71%,,,9.56%,1.60%,,10.00%,,8.33%,3.18%
blueberry,Blueberry,fruit,"big impact, more samples!",,yes,,75,C,"big impact, need more samples to get model built",,High (20x or more),36,,,,,,,,X,,X,15.79,1,13,,1,6,,,12,,,77,6,,0.28,,0.057,0.16,0.10%,1.46%,,,1.71%,,,2.26%,0.60%,,3.50%,,6.33%,1.45%
bok_choy_bok_choi_pak_choy,Bok choy,leafy,"low impact, but ok model",,maybe,,25,C,"specialty crop, low impact",,High (20x or more),105,,,,X,,,X,,X,,4.68,1,13,,65,19,,,37,,,252,105,,0.8,,0.021,0.19,6.50%,4.63%,,,5.29%,,,7.41%,10.50%,,10.00%,,2.33%,1.73%
butternut_squash,Butternut squash,veg,tbd,,tbd,,50,G,There is interest in the community,,analysis in process,11,,,,,,,,,,X,13.59,5,8,,4,34,,,33,,,352,48,,0.7,,0.072,0.15,0.40%,8.29%,,,4.71%,,,10.35%,4.80%,,8.75%,,8.00%,1.36%
carrot,Carrot,root_tuber,bad models with high samples,,no,,50,"G, C",,,High (20x or more),390,,,,,,,X,,X,,11.71,5,5,,69,12,,,35,,,320,33,,0.3,,0.045,0.24,6.90%,2.93%,,,5.00%,,,9.41%,3.30%,,3.75%,,5.00%,2.18%
cherry_tomato,Cherry tomato,veg,no compelling data,,no,,0,,"Hard to ship, no models, is it compelling?",,High (20x or more),0,,,,,,,,X,,X,5.48,1,8,,5,11,,,24,,,237,10,,0.27,,0.059,0.17,0.50%,2.68%,,,3.43%,,,6.97%,1.00%,,3.38%,,6.56%,1.55%
grapes,Grapes,fruit,ok model... but compelling?,,maybe,,50,C,"good models, is it compelling?",,High (20x or more),67,,,X,X,,,X,,X,,19.46,1,8,,2,7,,,20,,,191,10,,0.36,,0.127,0.07,0.20%,1.71%,,,2.86%,,,5.62%,1.00%,,4.50%,,14.11%,0.64%
lettuce,Head lettuce,leafy,ok model... commonly eaten,,yes,,50,C,"good models, is it compelling?",,High (20x or more),166,,,,X,,,X,,X,,5.3,2,8,,19,10,,,24,,,168,27,0.127,0.64,,0.027,0.16,1.90%,2.44%,,,3.43%,,,4.94%,2.70%,5.52%,8.00%,,3.00%,1.45%
kale,Kale,leafy,ok model... commonly eaten,,yes,,25,C,"good models, is it compelling?",,High (20x or more),194,,,,X,,,X,,X,,10.4,1,13,,53,33,,,55,,,348,254,0.92,1.6,,0.053,0.39,5.30%,8.05%,,,7.86%,,,10.24%,25.40%,40.00%,20.00%,,5.89%,3.55%
leeks,Leeks,leafy,"not many samples, not compelling, no clear",,no,,0,,"No models built, low impact",,High (20x or more),63,,,,,,,X,,X,,17,2,8,,20,28,,,35,,,180,59,,2.1,,0.12,0.12,2.00%,6.83%,,,5.00%,,,5.29%,5.90%,,26.25%,,13.33%,1.09%
mizuna,Mizuna,leafy,ok model... not commonly eaten,,yes,,25,C,"good models, is it compelling?",,Med (10-15x),90,,,X,X,,,X,,X,,7.5,1,13,,,,,,,,,,,,,,,,,0.00%,,,0.00%,,,0.00%,0.00%,,0.00%,,0.00%,0.00%
mustard_greens,Mustard,leafy,"ok model, but uncommon",,no,,25,C,"good models, is it compelling?",,High (20x or more),112,,,,X,,,X,,X,,9.3,1,13,,20,32,,,58,,,384,115,,1.64,,0.165,0.25,2.00%,7.80%,,,8.29%,,,11.29%,11.50%,,20.50%,,18.33%,2.27%
oats,Oats,grain,"great model, expanding market",,yes,,75,"G, C","good results to date, high impact, could increase nutrients predicted",,High (20x or more),484,,X,,X,,,X,,X,,89.16,1,10,,6,138,,,410,,,362,52,,4.25,,0.391,3.64,0.60%,33.66%,,,58.57%,,,10.65%,5.20%,,53.13%,,43.44%,33.09%
peppers,Sweet peppers,veg,,,,,75,"G, C","close to model, need more samples (Aug release)",,High (20x or more),213,,,,,,,X,,X,,6.5,1,8,,3,10,,,20,,,175,10,,0.34,,0.017,0.25,0.30%,2.44%,,,2.86%,,,5.15%,1.00%,,4.25%,,1.89%,2.27%
,(green),veg,,,,,,,,,,,,,,,,,,,,,6.11,1,8,,3,10,,,20,,,175,10,,0.34,,,,,2.44%,,,2.86%,,,5.15%,1.00%,,4.25%,,0.00%,0.00%
,(red),veg,,,,,,,,,,,,,,,,,,,,,7.79,1,8,,4,12,,,26,,,211,7,,0.43,,0.017,0.25,0.40%,2.93%,,,3.71%,,,6.21%,0.70%,,5.38%,,1.89%,2.27%
,(yellow),veg,,,,,,,,,,,,,,,,,,,,,7.98,1,8,,2,12,,,24,,,212,11,,0.46,,0.107,0.17,0.20%,2.93%,,,3.43%,,,6.24%,1.10%,,5.75%,,11.89%,1.55%
potato,Potato,root_tuber,,,,,75,"G, C","close to model, high impact, need more samples (Aug release)",,High (20x or more),481,,,,,,,,,,,20.75,4,8,,6,23,,,57,,,425,12,,0.81,,0.11,0.3,0.60%,5.61%,,,8.14%,,,12.50%,1.20%,,10.13%,,12.22%,2.73%
spinach,Spinach,leafy,,,,,25,C,"no model yet, if we can't get model with 19/20 data combined, time to give up?",,High (20x or more),65,,,,,,,X,,X,,8.6,1,8,,79,79,,,49,,,558,99,,2.71,,0.13,0.53,7.90%,19.27%,,,7.00%,,,16.41%,9.90%,,33.88%,,14.44%,4.82%
squash,Yellow squash/Zuc,veg,,,,,75,"G, C","good results to date, could increase nutrients predicted",,High (20x or more),275,,,,X,,,X,,X,,5.72,4,8,,2,20,,,32,,,222,21,,0.44,,0.092,0.29,0.20%,4.88%,,,4.57%,,,6.53%,2.10%,,5.50%,,10.22%,2.64%
swiss_chard,Swiss chard,leafy,,,,,25,C,"good models, is it compelling?",,High (20x or more),107,,,X,,,,X,,X,,7.34,1,13,,213,81,,,46,,,379,51,,1.8,,0.179,0.36,21.30%,19.76%,,,6.57%,,,11.15%,5.10%,,22.50%,,19.89%,3.27%
tomato,Tomato,veg,,,,,25,C,"good model, but hard to ship",,Med (10-15x),66,,,,X,,,,X,,X,5.48,1,8,,5,11,,,24,,,237,10,,0.27,,0.059,0.17,0.50%,2.68%,,,3.43%,,,6.97%,1.00%,,3.38%,,6.56%,1.55%
wheat,Wheat,grain,,,,,75,"G, C","good results to date, high impact, could increase nutrients predicted",,High (20x or more),298,,X,X,X,X,,X,,X,,86,1,8,,2,137,,,357,,,363,34,,3.6,,0.41,2.6,0.20%,33.41%,,,51.00%,,,10.68%,3.40%,,45.00%,,45.56%,23.64%
zucchini,Zucchini,,,,,,,,,,,,,,,,,,X,,X,,5.21,4,8,,8,18,,,38,,,261,16,,0.37,,0.053,0.32,,,,,,,,,,,,,,
other,Other,,,,,,,,,,,104*,,,,,,,,,,,,,,,,,,,,,,,,,,,,,,,,,,,,,,,,,,
,,,,,,,,,,,,"Mostly butternut squash, updating now",,,,,,,,,,,,,,,,,,,,,,,,,,,,,,,,,,,,,,,,,,
Total,,,,,,,1000,,,,,,,,,,,,,,,,,,,,,,,,,,,,,,,,,,,,,,,,,,,,,,,
Target,,,,,,,1000,,,,,,,,,,,,,,,,,,,,,,,,,,,,,,,,,,,,,,,,,,,,,,,
Remaining,,,,,,,0,,,,,,,,,,,,,,,,,,,,,,,,,,,,,,,,,,,,,,,,,,,,,,,