factor,family,N_spinach_antioxidants,N_spinach_polyphenols,N_carrot_polyphenols,N_cherry_tomato_brix,N_cherry_tomato_polyphenols,N_kale_antioxidants,N_kale_brix,N_kale_polyphenols,N_lettuce_brix,N_lettuce_polyphenols,N_spinach_brix,N_cherry_tomato_antioxidants,N_lettuce_antioxidants,N_carrot_brix,N_carrot_antioxidants,N_grape_antioxidants,N_grape_brix,N_grape_polyphenols,p.value_spinach_antioxidants,p.value_spinach_polyphenols,p.value_carrot_polyphenols,p.value_cherry_tomato_brix,p.value_cherry_tomato_polyphenols,p.value_kale_antioxidants,p.value_kale_brix,p.value_kale_polyphenols,p.value_lettuce_brix,p.value_lettuce_polyphenols,p.value_spinach_brix,p.value_cherry_tomato_antioxidants,p.value_lettuce_antioxidants,p.value_carrot_brix,p.value_carrot_antioxidants,p.value_grape_antioxidants,p.value_grape_brix,p.value_grape_polyphenols,intervalMin_spinach_antioxidants,intervalMin_spinach_polyphenols,intervalMin_carrot_polyphenols,intervalMin_cherry_tomato_brix,intervalMin_cherry_tomato_polyphenols,intervalMin_kale_antioxidants,intervalMin_kale_brix,intervalMin_kale_polyphenols,intervalMin_lettuce_brix,intervalMin_lettuce_polyphenols,intervalMin_spinach_brix,intervalMin_cherry_tomato_antioxidants,intervalMin_lettuce_antioxidants,intervalMin_carrot_brix,intervalMin_carrot_antioxidants,intervalMin_grape_antioxidants,intervalMin_grape_brix,intervalMin_grape_polyphenols,intervalMax_spinach_antioxidants,intervalMax_spinach_polyphenols,intervalMax_carrot_polyphenols,intervalMax_cherry_tomato_brix,intervalMax_cherry_tomato_polyphenols,intervalMax_kale_antioxidants,intervalMax_kale_brix,intervalMax_kale_polyphenols,intervalMax_lettuce_brix,intervalMax_lettuce_polyphenols,intervalMax_spinach_brix,intervalMax_cherry_tomato_antioxidants,intervalMax_lettuce_antioxidants,intervalMax_carrot_brix,intervalMax_carrot_antioxidants,intervalMax_grape_antioxidants,intervalMax_grape_brix,intervalMax_grape_polyphenols
biodynamic,practices,NA,NA,63,NA,NA,NA,NA,30,1,NA,11,4,NA,49,NA,NA,NA,NA,NA,NA,0.16867574396365526,NA,NA,NA,NA,0.25770774329842655,1,NA,0.7144709064277228,0.6288603715993026,NA,0.22195271764461233,NA,NA,NA,NA,NA,NA,-3.92,NA,NA,NA,NA,-143.13,-5.5,NA,-2.5,3108.96,NA,0.6,NA,NA,NA,NA,NA,NA,-1.32,NA,NA,NA,NA,-27.08,-0.4,NA,-0.9,4637.8,NA,1.6,NA,NA,NA,NA
biologique,practices,NA,NA,NA,NA,19,NA,NA,NA,NA,NA,NA,19,NA,NA,NA,NA,NA,NA,NA,NA,NA,NA,0.7183593448155987,NA,NA,NA,NA,NA,NA,0.8603205692684794,NA,NA,NA,NA,NA,NA,NA,NA,NA,NA,-18.31,NA,NA,NA,NA,NA,NA,-459.2,NA,NA,NA,NA,NA,NA,NA,NA,NA,NA,-5.97,NA,NA,NA,NA,NA,NA,-290.29,NA,NA,NA,NA,NA,NA
certified_organic,practices,136,151,NA,256,274,370,321,402,229,246,NA,259,236,326,407,NA,28,NA,0.029410950907510024,0.01666995184188208,NA,0.031990422829628926,0.10217693795421871,0.02242763940117383,0.024129443478370014,0.08687314139131251,0.25164696007171955,0.035569462446302845,NA,4.885171163006676e-4,0.5051624871658227,0.003987720289598727,0.29961203433797945,NA,0.22043174050294082,NA,-89.05,-13.82,NA,-0.9,2.36,317.9,-0.2,-67.46,-0.4,-9.13,NA,-99.79,0.58,0.2,-11.29,NA,0.5,NA,0.69,27.28,NA,-0.5,6.4,1717.13,0.7,-22.39,-0.1,-4.22,NA,18.94,45.23,0.6,-4.13,NA,3.4,NA
cover_crops,practices,27,27,48,NA,NA,76,NA,77,36,NA,19,19,47,NA,48,6,NA,NA,0.011691865791118855,0.023582935938499628,0.025978822078122653,NA,NA,0.5596647389330642,NA,0.0397010379890561,0.04457416515110032,NA,0.26355470286180244,0.44468402361975135,0.026312549933301243,NA,0.17213759724207714,0.643696004634855,NA,NA,-82.8,-22.42,2.03,NA,NA,97.97,NA,-129.81,-0.7,NA,0.7,173.89,63.43,NA,6.13,324.8,NA,NA,162.08,66.74,5.88,NA,NA,4062.4,NA,-56.9,-0.1,NA,2.1,2117.44,153.89,NA,31.69,6459.5,NA,NA
fair_food,practices,NA,NA,NA,6,NA,NA,NA,NA,NA,NA,NA,NA,NA,NA,NA,NA,NA,NA,NA,NA,NA,0.6047016722157472,NA,NA,NA,NA,NA,NA,NA,NA,NA,NA,NA,NA,NA,NA,NA,NA,NA,-3.9,NA,NA,NA,NA,NA,NA,NA,NA,NA,NA,NA,NA,NA,NA,NA,NA,NA,-2.3,NA,NA,NA,NA,NA,NA,NA,NA,NA,NA,NA,NA,NA,NA
Fresh_Organic,practices,NA,NA,8,NA,NA,NA,NA,NA,NA,NA,NA,NA,NA,8,8,NA,NA,NA,NA,NA,0.9735556123115746,NA,NA,NA,NA,NA,NA,NA,NA,NA,NA,0.5002802727659992,0.8375158744700238,NA,NA,NA,NA,NA,5.2,NA,NA,NA,NA,NA,NA,NA,NA,NA,NA,3.4,-45.59,NA,NA,NA,NA,NA,12.19,NA,NA,NA,NA,NA,NA,NA,NA,NA,NA,4.9,-10.98,NA,NA,NA
greenhouse,practices,NA,9,NA,NA,88,8,NA,8,23,NA,6,88,NA,NA,NA,NA,NA,NA,NA,0.7243542667485583,NA,NA,0.6978998200744486,0.9673600328329939,NA,0.9744946966240949,0.02065044461565815,NA,0.7279696277002331,0.1887663502791233,NA,NA,NA,NA,NA,NA,NA,-148.5,NA,NA,-5.76,-7148.06,NA,-371.17,-0.6,NA,0.4,-122.7,NA,NA,NA,NA,NA,NA,NA,-31.88,NA,NA,-1.63,-1025.98,NA,-102.28,0.9,NA,2.6,-10.29,NA,NA,NA,NA,NA,NA
grown_in_CA,practices,NA,NA,7,NA,NA,NA,NA,NA,NA,NA,NA,NA,NA,7,7,NA,NA,NA,NA,NA,0.8244821659248771,NA,NA,NA,NA,NA,NA,NA,NA,NA,NA,0.748542311928104,0.86648099181073035,NA,NA,NA,NA,NA,-6.18,NA,NA,NA,NA,NA,NA,NA,NA,NA,NA,1.5,-58.22,NA,NA,NA,NA,NA,-0.06,NA,NA,NA,NA,NA,NA,NA,NA,NA,NA,2.8,-19.68,NA,NA,NA
"Grown_in_the_Northeast;_Ashfield_MA;_Right_for_you,Right_for_the_farmer,_Right_for_the_Planet",practices,NA,NA,NA,NA,NA,NA,NA,NA,NA,NA,NA,NA,NA,NA,NA,NA,8,NA,NA,NA,NA,NA,NA,NA,NA,NA,NA,NA,NA,NA,NA,NA,NA,NA,0.7028168640263834,NA,NA,NA,NA,NA,NA,NA,NA,NA,NA,NA,NA,NA,NA,NA,NA,NA,0.1,NA,NA,NA,NA,NA,NA,NA,NA,NA,NA,NA,NA,NA,NA,NA,NA,NA,5.3,NA
hydroponic,practices,NA,NA,NA,NA,NA,NA,NA,NA,86,NA,NA,NA,86,NA,NA,NA,NA,NA,NA,NA,NA,NA,NA,NA,NA,NA,0.6585956989476536,NA,NA,NA,0.07960257900085745,NA,NA,NA,NA,NA,NA,NA,NA,NA,NA,NA,NA,NA,-0.6,NA,NA,NA,-20.38,NA,NA,NA,NA,NA,NA,NA,NA,NA,NA,NA,NA,NA,-0.2,NA,NA,NA,38.23,NA,NA,NA,NA,NA
local,practices,NA,6,62,20,21,15,NA,15,NA,28,NA,NA,28,60,NA,NA,8,9,NA,0.9454859898945484,0.06979455226901171,0.010515209893099125,0.5918031232185803,0.9368865621832861,NA,0.7607445262676459,NA,0.25326616124975565,NA,NA,0.07885422054053512,0.19700619120273577,NA,NA,0.7028168640263834,0.051595567208941644,NA,-200.01,-0.34,-1.8,1.04,-6577.83,NA,-203.21,NA,-11.88,NA,NA,42.55,0.1,NA,NA,0.1,-100.34,NA,-64.12,2.38,-0.3,8.96,-1230.57,NA,-33.76,NA,-0.25,NA,NA,126.43,0.7,NA,NA,5.3,106.74
non_gmo,practices,8,8,NA,25,NA,NA,NA,9,NA,NA,NA,25,NA,NA,NA,NA,NA,NA,0.6385025401290114,0.6641698010609312,NA,0.5773209378910255,NA,NA,NA,0.9879943759760289,NA,NA,NA,0.23915703130795782,NA,NA,NA,NA,NA,NA,-328.47,66,NA,0.6,NA,NA,NA,-272.36,NA,NA,NA,-364.2,NA,NA,NA,NA,NA,NA,-32.32,182.48,NA,1.4,NA,NA,NA,-12.34,NA,NA,NA,-184.99,NA,NA,NA,NA,NA,NA
none,practices,96,131,365,274,324,235,173,302,296,372,80,286,333,280,327,41,36,41,0.018321952273340728,6.833643268226893e-9,6.50962389338283e-13,1.5590804536164857e-20,3.8581502405108083e-26,1.7013147557741506e-7,1.2738451473758877e-18,3.3989271446885205e-13,4.98992168826459e-22,1.0041198826785593e-13,4.884407185172556e-6,5.566099433734899e-34,1.2201793744588974e-14,3.9478563780654475e-24,1.1120785799858847e-12,0.007297117614117488,1.4723627727160815e-4,0.004009798296887945,246.55,187.62,12.09,5.95,39.47,5660.13,8.65,325.17,3.8,32.42,5.7,1052.44,228.87,8.1,50.22,987.86,16.3,128.52,446.12,227.02,13.49,6.2,41.74,6836.49,9.45,370.92,4.05,36.27,6.3,1333.02,260.29,8.4,60.4,1327.21,18.7,229.95
nospray,practices,NA,23,33,NA,NA,78,NA,78,NA,NA,20,42,50,NA,NA,11,NA,NA,NA,0.005771384743719061,0.07662726552624871,NA,NA,8.710103716698334e-5,NA,0.1818789436570227,NA,NA,0.2231432545207934,0.7677104426162336,0.4264393484688951,NA,NA,0.4662466329589431,NA,NA,NA,-44.98,0.3,NA,NA,-943.03,NA,-119.63,NA,NA,0.7,89.76,31.97,NA,NA,26.41,NA,NA,NA,37.47,5.82,NA,NA,-43.2,NA,-45.48,NA,NA,2.1,371.61,129.01,NA,NA,1455.04,NA,NA
notill,practices,NA,NA,25,NA,30,54,NA,55,19,NA,NA,30,28,14,25,NA,NA,NA,NA,NA,0.9860993368251957,NA,0.8367352039335237,3.5316072351621096e-4,NA,0.1829209000670825,0.4883517951887784,NA,NA,0.5473031324081614,0.849699685651844,0.5414415216337147,0.9975593832216184,NA,NA,NA,NA,NA,2.64,NA,3.98,-870.42,NA,-147.69,-1.1,NA,NA,40.46,70.32,-2.4,10.69,NA,NA,NA,NA,NA,13.57,NA,13.83,122.49,NA,-61.68,-0.1,NA,NA,275.83,165.84,-0.9,68.28,NA,NA,NA
on_the_vine,practices,NA,NA,NA,21,NA,NA,NA,NA,NA,NA,NA,21,NA,NA,NA,NA,NA,NA,NA,NA,NA,0.5126816801269742,NA,NA,NA,NA,NA,NA,NA,0.13588196165390945,NA,NA,NA,NA,NA,NA,NA,NA,NA,1.4,NA,NA,NA,NA,NA,NA,NA,1030.38,NA,NA,NA,NA,NA,NA,NA,NA,NA,2.3,NA,NA,NA,NA,NA,NA,NA,1378.35,NA,NA,NA,NA,NA,NA
organic,practices,22,35,111,84,NA,109,NA,149,81,130,NA,102,106,85,89,17,NA,17,0.2527007534094938,0.03657942057828439,0.005985688593908887,0.020418932563992263,NA,2.727050997520905e-5,NA,0.03164879987034188,0.03500636344362766,0.49235303013018605,NA,0.5134232541111465,0.14536789639089123,0.44189437281226346,0.9992065850747159,0.3341477321689657,NA,0.20897616829280968,-253.71,-11.05,-2.53,0,NA,-836.37,NA,-87.95,-0.3,8.71,NA,7.54,122.36,-1.3,-15.15,26.41,NA,14.29,-42.35,79.08,-0.05,0.6,NA,-25.64,NA,-28.09,0.2,15.3,NA,197.26,203.57,-0.7,-1.8,769.49,NA,139.09
Organic_Kale,practices,NA,NA,NA,NA,NA,9,NA,NA,NA,NA,NA,NA,NA,NA,NA,NA,NA,NA,NA,NA,NA,NA,NA,0.6354731936189244,NA,NA,NA,NA,NA,NA,NA,NA,NA,NA,NA,NA,NA,NA,NA,NA,NA,3008.96,NA,NA,NA,NA,NA,NA,NA,NA,NA,NA,NA,NA,NA,NA,NA,NA,NA,8062.34,NA,NA,NA,NA,NA,NA,NA,NA,NA,NA,NA,NA
other,practices,8,8,NA,71,NA,26,NA,NA,24,24,NA,71,24,19,23,NA,NA,NA,0.6385025401290114,0.6641698010609312,NA,0.38638335643688626,NA,0.6603316627637323,NA,NA,0.49760001431108275,0.8946019901013951,NA,0.8255983501313959,0.8449343473215671,0.37121470714903654,0.21386058056545873,NA,NA,NA,-328.47,66,NA,0.5,NA,626.8,NA,NA,-1.8,-17.36,NA,-238.01,-111.27,2,-29.73,NA,NA,NA,-32.32,182.48,NA,1.1,NA,4070.48,NA,NA,-0.8,-5.65,NA,-48.21,-28.7,3.3,-8.57,NA,NA,NA
produce_of_usa,practices,NA,NA,NA,NA,NA,NA,NA,NA,9,9,NA,NA,NA,NA,NA,NA,NA,NA,NA,NA,NA,NA,NA,NA,NA,NA,1,0.9975559109516768,NA,NA,NA,NA,NA,NA,NA,NA,NA,NA,NA,NA,NA,NA,NA,NA,-3.06,-24.35,NA,NA,NA,NA,NA,NA,NA,NA,NA,NA,NA,NA,NA,NA,NA,NA,-2.1,-5.84,NA,NA,NA,NA,NA,NA,NA,NA
product_of_Mexico,practices,NA,NA,NA,NA,NA,NA,8,NA,NA,NA,NA,NA,NA,NA,NA,NA,NA,NA,NA,NA,NA,NA,NA,NA,0.47894607729181166,NA,NA,NA,NA,NA,NA,NA,NA,NA,NA,NA,NA,NA,NA,NA,NA,NA,-2.8,NA,NA,NA,NA,NA,NA,NA,NA,NA,NA,NA,NA,NA,NA,NA,NA,NA,-0.3,NA,NA,NA,NA,NA,NA,NA,NA,NA,NA,NA
"urban_farming,_in_chicago",practices,NA,NA,NA,NA,NA,NA,NA,NA,7,NA,NA,NA,7,NA,NA,NA,NA,NA,NA,NA,NA,NA,NA,NA,NA,NA,0.07948760993272681,NA,NA,NA,0.7251037350113689,NA,NA,NA,NA,NA,NA,NA,NA,NA,NA,NA,NA,NA,-1,NA,NA,NA,-204.59,NA,NA,NA,NA,NA,NA,NA,NA,NA,NA,NA,NA,NA,4.8,NA,NA,NA,-55.81,NA,NA,NA,NA,NA
