factor,family,N_organic_carbon_percentage_10cm,N_organic_carbon_percentage_20cm,N_PH_soil_20cm,N_respiration_soil_20cm,N_PH_soil_10cm,N_respiration_soil_10cm,p.value_organic_carbon_percentage_10cm,p.value_organic_carbon_percentage_20cm,p.value_PH_soil_20cm,p.value_respiration_soil_20cm,p.value_PH_soil_10cm,p.value_respiration_soil_10cm,intervalMin_organic_carbon_percentage_10cm,intervalMin_organic_carbon_percentage_20cm,intervalMin_PH_soil_20cm,intervalMin_respiration_soil_20cm,intervalMin_PH_soil_10cm,intervalMin_respiration_soil_10cm,intervalMax_organic_carbon_percentage_10cm,intervalMax_organic_carbon_percentage_20cm,intervalMax_PH_soil_20cm,intervalMax_respiration_soil_20cm,intervalMax_PH_soil_10cm,intervalMax_respiration_soil_10cm
lime,amendments,31,31,30,21,NA,NA,0.8956650936387087,0.7182654277571874,0.050352616093077625,0.601391933960401,NA,NA,-2.73,-1.57,-0.3,-10.7,NA,NA,-1.37,-0.77,-0,-2.21,NA,NA
mulch,amendments,NA,203,205,148,184,131,NA,0.3180489499303573,7.15795640225555e-7,0.028853119389264027,1.8757648725754793e-5,0.1569043867599976,NA,-0.6,-0,1.82,-0.2,1.85,NA,-0.08,-0,7.38,-0,8.46
none,amendments,371,387,395,322,358,247,0.7353705310729091,0.08206509633200258,2.743998041044226e-7,0.033879785851813254,1.7895200061959287e-7,0.02082605397995145,5.1,4.07,6.08,21.11,6.24,29.32,5.6,4.38,6.42,24.61,6.5,32.55
organic_amendment,amendments,830,855,884,717,852,NA,0.046461710375369704,0.8066317395963897,4.660627751201946e-14,0.011016685108945332,1.0229669684208611e-9,NA,-0.74,-0.67,-0,-0.22,-0.2,NA,-0.24,-0.34,-0,2.96,-0,NA
synth_fertilizer,amendments,157,157,155,148,153,142,0.3718379707016269,0.9048830031657117,0.04550733974663746,0.1932147758382081,0.9434498079477258,0.1969802476012308,-3.78,-2.59,-0.3,-9.3,-0.3,-14.17,-3.06,-2.18,-0,-5.87,-0.3,-9.36
