deviceID,standard.x,repetition.x,barium_365,barium_385,barium_450,barium_500,barium_530,barium_587,barium_632,barium_850,barium_880,barium_940,standard.y,repetition.y,teflon_365,teflon_385,teflon_450,teflon_500,teflon_530,teflon_587,teflon_632,teflon_850,teflon_880,teflon_940
00:00:02:0b,barium,1,993446,998682,100142,101431,101344,101598,101527,991956,100203,989552,teflon,1,74746,948278,11072,101329,109739,116332,113939,150229,172305,159017
00:00:02:0b,barium,1,993446,998682,100142,101431,101344,101598,101527,991956,100203,989552,teflon,2,749602,952851,111185,101111,110255,11708,114126,149581,172181,15809
00:00:02:0b,barium,1,993446,998682,100142,101431,101344,101598,101527,991956,100203,989552,teflon,3,755641,950812,110692,101141,109397,116213,11376,14903,17198,158297
00:00:02:0b,barium,1,993446,998682,100142,101431,101344,101598,101527,991956,100203,989552,teflon,4,755056,954167,11128,100866,110159,117014,113926,149645,172126,15849
00:00:02:0b,barium,1,993446,998682,100142,101431,101344,101598,101527,991956,100203,989552,teflon,5,761256,951042,11049,10110,109203,116294,113614,150057,172221,159181
00:00:02:0b,barium,1,993446,998682,100142,101431,101344,101598,101527,991956,100203,989552,teflon,6,756334,953211,110922,10072,110098,116777,113699,147391,170985,155552
00:00:02:0b,barium,2,996256,100055,100326,101389,101564,101532,101605,990493,100196,987112,teflon,1,74746,948278,11072,101329,109739,116332,113939,150229,172305,159017
00:00:02:0b,barium,2,996256,100055,100326,101389,101564,101532,101605,990493,100196,987112,teflon,2,749602,952851,111185,101111,110255,11708,114126,149581,172181,15809
00:00:02:0b,barium,2,996256,100055,100326,101389,101564,101532,101605,990493,100196,987112,teflon,3,755641,950812,110692,101141,109397,116213,11376,14903,17198,158297
00:00:02:0b,barium,2,996256,100055,100326,101389,101564,101532,101605,990493,100196,987112,teflon,4,755056,954167,11128,100866,110159,117014,113926,149645,172126,15849
00:00:02:0b,barium,2,996256,100055,100326,101389,101564,101532,101605,990493,100196,987112,teflon,5,761256,951042,11049,10110,109203,116294,113614,150057,172221,159181
00:00:02:0b,barium,2,996256,100055,100326,101389,101564,101532,101605,990493,100196,987112,teflon,6,756334,953211,110922,10072,110098,116777,113699,147391,170985,155552
00:00:02:0b,barium,3,998306,100098,100255,101247,101378,101622,10147,991546,100443,989848,teflon,1,74746,948278,11072,101329,109739,116332,113939,150229,172305,159017
00:00:02:0b,barium,3,998306,100098,100255,101247,101378,101622,10147,991546,100443,989848,teflon,2,749602,952851,111185,101111,110255,11708,114126,149581,172181,15809
00:00:02:0b,barium,3,998306,100098,100255,101247,101378,101622,10147,991546,100443,989848,teflon,3,755641,950812,110692,101141,109397,116213,11376,14903,17198,158297
00:00:02:0b,barium,3,998306,100098,100255,101247,101378,101622,10147,991546,100443,989848,teflon,4,755056,954167,11128,100866,110159,117014,113926,149645,172126,15849
00:00:02:0b,barium,3,998306,100098,100255,101247,101378,101622,10147,991546,100443,989848,teflon,5,761256,951042,11049,10110,109203,116294,113614,150057,172221,159181
00:00:02:0b,barium,3,998306,100098,100255,101247,101378,101622,10147,991546,100443,989848,teflon,6,756334,953211,110922,10072,110098,116777,113699,147391,170985,155552
00:00:02:0b,barium,4,100329,100277,997859,101247,100844,101559,101368,998439,100699,997394,teflon,1,74746,948278,11072,101329,109739,116332,113939,150229,172305,159017
00:00:02:0b,barium,4,100329,100277,997859,101247,100844,101559,101368,998439,100699,997394,teflon,2,749602,952851,111185,101111,110255,11708,114126,149581,172181,15809
00:00:02:0b,barium,4,100329,100277,997859,101247,100844,101559,101368,998439,100699,997394,teflon,3,755641,950812,110692,101141,109397,116213,11376,14903,17198,158297
00:00:02:0b,barium,4,100329,100277,997859,101247,100844,101559,101368,998439,100699,997394,teflon,4,755056,954167,11128,100866,110159,117014,113926,149645,172126,15849
00:00:02:0b,barium,4,100329,100277,997859,101247,100844,101559,101368,998439,100699,997394,teflon,5,761256,951042,11049,10110,109203,116294,113614,150057,172221,159181
00:00:02:0b,barium,4,100329,100277,997859,101247,100844,101559,101368,998439,100699,997394,teflon,6,756334,953211,110922,10072,110098,116777,113699,147391,170985,155552
00:00:02:0b,barium,5,999256,100564,100602,100909,101854,101878,101473,985455,100271,981066,teflon,1,74746,948278,11072,101329,109739,116332,113939,150229,172305,159017
00:00:02:0b,barium,5,999256,100564,100602,100909,101854,101878,101473,985455,100271,981066,teflon,2,749602,952851,111185,101111,110255,11708,114126,149581,172181,15809
00:00:02:0b,barium,5,999256,100564,100602,100909,101854,101878,101473,985455,100271,981066,teflon,3,755641,950812,110692,101141,109397,116213,11376,14903,17198,158297
00:00:02:0b,barium,5,999256,100564,100602,100909,101854,101878,101473,985455,100271,981066,teflon,4,755056,954167,11128,100866,110159,117014,113926,149645,172126,15849
00:00:02:0b,barium,5,999256,100564,100602,100909,101854,101878,101473,985455,100271,981066,teflon,5,761256,951042,11049,10110,109203,116294,113614,150057,172221,159181
00:00:02:0b,barium,5,999256,100564,100602,100909,101854,101878,101473,985455,100271,981066,teflon,6,756334,953211,110922,10072,110098,116777,113699,147391,170985,155552
00:00:02:0b,barium,6,100362,100335,100141,100922,101073,101389,101167,98606,100442,987197,teflon,1,74746,948278,11072,101329,109739,116332,113939,150229,172305,159017
00:00:02:0b,barium,6,100362,100335,100141,100922,101073,101389,101167,98606,100442,987197,teflon,2,749602,952851,111185,101111,110255,11708,114126,149581,172181,15809
00:00:02:0b,barium,6,100362,100335,100141,100922,101073,101389,101167,98606,100442,987197,teflon,3,755641,950812,110692,101141,109397,116213,11376,14903,17198,158297
00:00:02:0b,barium,6,100362,100335,100141,100922,101073,101389,101167,98606,100442,987197,teflon,4,755056,954167,11128,100866,110159,117014,113926,149645,172126,15849
00:00:02:0b,barium,6,100362,100335,100141,100922,101073,101389,101167,98606,100442,987197,teflon,5,761256,951042,11049,10110,109203,116294,113614,150057,172221,159181
00:00:02:0b,barium,6,100362,100335,100141,100922,101073,101389,101167,98606,100442,987197,teflon,6,756334,953211,110922,10072,110098,116777,113699,147391,170985,155552
00:00:01:d8,barium,1,990563,100518,101722,10055,102167,101494,10092,992572,100243,991294,teflon,1,926058,107808,109794,984976,981192,100314,100393,110304,10846,124089
00:00:01:d8,barium,1,990563,100518,101722,10055,102167,101494,10092,992572,100243,991294,teflon,2,927434,108482,110775,972452,986007,100355,996998,107983,107381,122814
00:00:01:d8,barium,1,990563,100518,101722,10055,102167,101494,10092,992572,100243,991294,teflon,3,92586,108682,111275,97581,991238,100901,100218,104517,106199,120511
00:00:01:d8,barium,1,990563,100518,101722,10055,102167,101494,10092,992572,100243,991294,teflon,4,931118,108872,110997,979507,992565,101306,100579,108821,108554,12343
00:00:01:d8,barium,1,990563,100518,101722,10055,102167,101494,10092,992572,100243,991294,teflon,5,936205,108628,10989,990098,981987,100985,10097,110623,10897,12458
00:00:01:d8,barium,1,990563,100518,101722,10055,102167,101494,10092,992572,100243,991294,teflon,6,930158,108986,111473,976402,992373,101129,100296,104345,106238,120401
00:00:01:d8,barium,2,996494,100249,100761,101148,10159,101652,101208,101409,100835,100329,teflon,1,926058,107808,109794,984976,981192,100314,100393,110304,10846,124089
00:00:01:d8,barium,2,996494,100249,100761,101148,10159,101652,101208,101409,100835,100329,teflon,2,927434,108482,110775,972452,986007,100355,996998,107983,107381,122814
00:00:01:d8,barium,2,996494,100249,100761,101148,10159,101652,101208,101409,100835,100329,teflon,3,92586,108682,111275,97581,991238,100901,100218,104517,106199,120511
00:00:01:d8,barium,2,996494,100249,100761,101148,10159,101652,101208,101409,100835,100329,teflon,4,931118,108872,110997,979507,992565,101306,100579,108821,108554,12343
00:00:01:d8,barium,2,996494,100249,100761,101148,10159,101652,101208,101409,100835,100329,teflon,5,936205,108628,10989,990098,981987,100985,10097,110623,10897,12458
00:00:01:d8,barium,2,996494,100249,100761,101148,10159,101652,101208,101409,100835,100329,teflon,6,930158,108986,111473,976402,992373,101129,100296,104345,106238,120401
00:00:01:d8,barium,3,991581,100747,102044,100593,10274,102334,101315,97674,997576,980922,teflon,1,926058,107808,109794,984976,981192,100314,100393,110304,10846,124089
00:00:01:d8,barium,3,991581,100747,102044,100593,10274,102334,101315,97674,997576,980922,teflon,2,927434,108482,110775,972452,986007,100355,996998,107983,107381,122814
00:00:01:d8,barium,3,991581,100747,102044,100593,10274,102334,101315,97674,997576,980922,teflon,3,92586,108682,111275,97581,991238,100901,100218,104517,106199,120511
00:00:01:d8,barium,3,991581,100747,102044,100593,10274,102334,101315,97674,997576,980922,teflon,4,931118,108872,110997,979507,992565,101306,100579,108821,108554,12343
00:00:01:d8,barium,3,991581,100747,102044,100593,10274,102334,101315,97674,997576,980922,teflon,5,936205,108628,10989,990098,981987,100985,10097,110623,10897,12458
00:00:01:d8,barium,3,991581,100747,102044,100593,10274,102334,101315,97674,997576,980922,teflon,6,930158,108986,111473,976402,992373,101129,100296,104345,106238,120401
00:00:01:d8,barium,4,997273,100611,101121,101322,101918,102161,101466,100786,100877,100055,teflon,1,926058,107808,109794,984976,981192,100314,100393,110304,10846,124089
00:00:01:d8,barium,4,997273,100611,101121,101322,101918,102161,101466,100786,100877,100055,teflon,2,927434,108482,110775,972452,986007,100355,996998,107983,107381,122814
00:00:01:d8,barium,4,997273,100611,101121,101322,101918,102161,101466,100786,100877,100055,teflon,3,92586,108682,111275,97581,991238,100901,100218,104517,106199,120511
00:00:01:d8,barium,4,997273,100611,101121,101322,101918,102161,101466,100786,100877,100055,teflon,4,931118,108872,110997,979507,992565,101306,100579,108821,108554,12343
00:00:01:d8,barium,4,997273,100611,101121,101322,101918,102161,101466,100786,100877,100055,teflon,5,936205,108628,10989,990098,981987,100985,10097,110623,10897,12458
00:00:01:d8,barium,4,997273,100611,101121,101322,101918,102161,101466,100786,100877,100055,teflon,6,930158,108986,111473,976402,992373,101129,100296,104345,106238,120401
00:00:01:d8,barium,5,997322,100458,10088,101559,101849,101951,101604,101252,100996,100135,teflon,1,926058,107808,109794,984976,981192,100314,100393,110304,10846,124089
00:00:01:d8,barium,5,997322,100458,10088,101559,101849,101951,101604,101252,100996,100135,teflon,2,927434,108482,110775,972452,986007,100355,996998,107983,107381,122814
00:00:01:d8,barium,5,997322,100458,10088,101559,101849,101951,101604,101252,100996,100135,teflon,3,92586,108682,111275,97581,991238,100901,100218,104517,106199,120511
00:00:01:d8,barium,5,997322,100458,10088,101559,101849,101951,101604,101252,100996,100135,teflon,4,931118,108872,110997,979507,992565,101306,100579,108821,108554,12343
00:00:01:d8,barium,5,997322,100458,10088,101559,101849,101951,101604,101252,100996,100135,teflon,5,936205,108628,10989,990098,981987,100985,10097,110623,10897,12458
00:00:01:d8,barium,5,997322,100458,10088,101559,101849,101951,101604,101252,100996,100135,teflon,6,930158,108986,111473,976402,992373,101129,100296,104345,106238,120401
00:00:01:d8,barium,6,995938,10046,100979,101759,10251,102773,101922,100972,101035,999781,teflon,1,926058,107808,109794,984976,981192,100314,100393,110304,10846,124089
00:00:01:d8,barium,6,995938,10046,100979,101759,10251,102773,101922,100972,101035,999781,teflon,2,927434,108482,110775,972452,986007,100355,996998,107983,107381,122814
00:00:01:d8,barium,6,995938,10046,100979,101759,10251,102773,101922,100972,101035,999781,teflon,3,92586,108682,111275,97581,991238,100901,100218,104517,106199,120511
00:00:01:d8,barium,6,995938,10046,100979,101759,10251,102773,101922,100972,101035,999781,teflon,4,931118,108872,110997,979507,992565,101306,100579,108821,108554,12343
00:00:01:d8,barium,6,995938,10046,100979,101759,10251,102773,101922,100972,101035,999781,teflon,5,936205,108628,10989,990098,981987,100985,10097,110623,10897,12458
00:00:01:d8,barium,6,995938,10046,100979,101759,10251,102773,101922,100972,101035,999781,teflon,6,930158,108986,111473,976402,992373,101129,100296,104345,106238,120401
00:00:01:52,barium,1,983619,984085,984647,100177,988962,991776,997887,10155,100735,100059,teflon,1,802654,949292,104591,101844,102633,104353,10563,121567,117411,130355
00:00:01:52,barium,1,983619,984085,984647,100177,988962,991776,997887,10155,100735,100059,teflon,2,802572,940218,102743,988388,997745,100965,102114,116493,111434,126685
00:00:01:52,barium,1,983619,984085,984647,100177,988962,991776,997887,10155,100735,100059,teflon,3,802361,943742,10337,994359,10074,101846,102901,115453,111477,125949
00:00:01:52,barium,1,983619,984085,984647,100177,988962,991776,997887,10155,100735,100059,teflon,4,803833,945602,103853,98331,100642,100929,101928,113532,110443,124997
00:00:01:52,barium,1,983619,984085,984647,100177,988962,991776,997887,10155,100735,100059,teflon,5,805281,942539,103181,99266,100415,101455,102649,115796,111473,125849
00:00:01:52,barium,1,983619,984085,984647,100177,988962,991776,997887,10155,100735,100059,teflon,6,805144,935251,101793,100463,993742,101401,103298,117579,112268,126717
00:00:01:52,barium,2,991024,990015,98714,998835,989701,99181,996048,101671,100667,10048,teflon,1,802654,949292,104591,101844,102633,104353,10563,121567,117411,130355
00:00:01:52,barium,2,991024,990015,98714,998835,989701,99181,996048,101671,100667,10048,teflon,2,802572,940218,102743,988388,997745,100965,102114,116493,111434,126685
00:00:01:52,barium,2,991024,990015,98714,998835,989701,99181,996048,101671,100667,10048,teflon,3,802361,943742,10337,994359,10074,101846,102901,115453,111477,125949
00:00:01:52,barium,2,991024,990015,98714,998835,989701,99181,996048,101671,100667,10048,teflon,4,803833,945602,103853,98331,100642,100929,101928,113532,110443,124997
00:00:01:52,barium,2,991024,990015,98714,998835,989701,99181,996048,101671,100667,10048,teflon,5,805281,942539,103181,99266,100415,101455,102649,115796,111473,125849
00:00:01:52,barium,2,991024,990015,98714,998835,989701,99181,996048,101671,100667,10048,teflon,6,805144,935251,101793,100463,993742,101401,103298,117579,112268,126717
00:00:01:52,barium,3,990533,988759,988694,100248,990105,994218,999535,101279,100541,100058,teflon,1,802654,949292,104591,101844,102633,104353,10563,121567,117411,130355
00:00:01:52,barium,3,990533,988759,988694,100248,990105,994218,999535,101279,100541,100058,teflon,2,802572,940218,102743,988388,997745,100965,102114,116493,111434,126685
00:00:01:52,barium,3,990533,988759,988694,100248,990105,994218,999535,101279,100541,100058,teflon,3,802361,943742,10337,994359,10074,101846,102901,115453,111477,125949
00:00:01:52,barium,3,990533,988759,988694,100248,990105,994218,999535,101279,100541,100058,teflon,4,803833,945602,103853,98331,100642,100929,101928,113532,110443,124997
00:00:01:52,barium,3,990533,988759,988694,100248,990105,994218,999535,101279,100541,100058,teflon,5,805281,942539,103181,99266,100415,101455,102649,115796,111473,125849
00:00:01:52,barium,3,990533,988759,988694,100248,990105,994218,999535,101279,100541,100058,teflon,6,805144,935251,101793,100463,993742,101401,103298,117579,112268,126717
00:00:01:52,barium,4,994728,992588,98947,996127,98644,987947,993093,100322,999897,100051,teflon,1,802654,949292,104591,101844,102633,104353,10563,121567,117411,130355
00:00:01:52,barium,4,994728,992588,98947,996127,98644,987947,993093,100322,999897,100051,teflon,2,802572,940218,102743,988388,997745,100965,102114,116493,111434,126685
00:00:01:52,barium,4,994728,992588,98947,996127,98644,987947,993093,100322,999897,100051,teflon,3,802361,943742,10337,994359,10074,101846,102901,115453,111477,125949
00:00:01:52,barium,4,994728,992588,98947,996127,98644,987947,993093,100322,999897,100051,teflon,4,803833,945602,103853,98331,100642,100929,101928,113532,110443,124997
00:00:01:52,barium,4,994728,992588,98947,996127,98644,987947,993093,100322,999897,100051,teflon,5,805281,942539,103181,99266,100415,101455,102649,115796,111473,125849
00:00:01:52,barium,4,994728,992588,98947,996127,98644,987947,993093,100322,999897,100051,teflon,6,805144,935251,101793,100463,993742,101401,103298,117579,112268,126717
00:00:01:52,barium,5,996245,995786,991303,9900,993493,990568,989108,10010,995155,997264,teflon,1,802654,949292,104591,101844,102633,104353,10563,121567,117411,130355
00:00:01:52,barium,5,996245,995786,991303,9900,993493,990568,989108,10010,995155,997264,teflon,2,802572,940218,102743,988388,997745,100965,102114,116493,111434,126685
00:00:01:52,barium,5,996245,995786,991303,9900,993493,990568,989108,10010,995155,997264,teflon,3,802361,943742,10337,994359,10074,101846,102901,115453,111477,125949
00:00:01:52,barium,5,996245,995786,991303,9900,993493,990568,989108,10010,995155,997264,teflon,4,803833,945602,103853,98331,100642,100929,101928,113532,110443,124997
00:00:01:52,barium,5,996245,995786,991303,9900,993493,990568,989108,10010,995155,997264,teflon,5,805281,942539,103181,99266,100415,101455,102649,115796,111473,125849
00:00:01:52,barium,5,996245,995786,991303,9900,993493,990568,989108,10010,995155,997264,teflon,6,805144,935251,101793,100463,993742,101401,103298,117579,112268,126717
00:00:01:52,barium,6,995428,992908,989074,994368,990646,988319,992599,100436,999597,9984,teflon,1,802654,949292,104591,101844,102633,104353,10563,121567,117411,130355
00:00:01:52,barium,6,995428,992908,989074,994368,990646,988319,992599,100436,999597,9984,teflon,2,802572,940218,102743,988388,997745,100965,102114,116493,111434,126685
00:00:01:52,barium,6,995428,992908,989074,994368,990646,988319,992599,100436,999597,9984,teflon,3,802361,943742,10337,994359,10074,101846,102901,115453,111477,125949
00:00:01:52,barium,6,995428,992908,989074,994368,990646,988319,992599,100436,999597,9984,teflon,4,803833,945602,103853,98331,100642,100929,101928,113532,110443,124997
00:00:01:52,barium,6,995428,992908,989074,994368,990646,988319,992599,100436,999597,9984,teflon,5,805281,942539,103181,99266,100415,101455,102649,115796,111473,125849
00:00:01:52,barium,6,995428,992908,989074,994368,990646,988319,992599,100436,999597,9984,teflon,6,805144,935251,101793,100463,993742,101401,103298,117579,112268,126717
