explained,dataset,cvRsquared,N,covers,width
organic_carbon_percentage,bionutrientMeter10cm,0.4283,1660,0.8596385542168675,0.12733208955223885
organic_carbon_percentage,"bionutrientMeter10cm, scsMetadata10cm",0.4791,1274,0.8846153846153846,0.13743736578382246
organic_carbon_percentage,"scsMetadata10cm, scsMetadata20cm, climateRegion, medFarmPractices, PH_soil_10cm, PH_soil_20cm, respiration_soil_10cm, respiration_soil_20cm",0.5368,974,0.9106776180698152,0.12705479452054788
organic_carbon_percentage,"bionutrientMeter10cm, scsMetadata10cm, climateRegion, medFarmPractices",0.5533,1030,0.9019417475728155,0.1322118826055835
organic_carbon_percentage,"scsMetadata10cm, climateRegion, medFarmPractices, PH_soil_10cm, respiration_soil_10cm",0.5916,977,0.8178096212896623,0.06344628695025233
organic_carbon_percentage,"bionutrientMeter10cm, climateRegion, medFarmPractices",0.6018,1224,0.8937908496732027,0.11798446876103069
organic_carbon_percentage,"scsMetadata10cm, climateRegion, medFarmPractices",0.6319,1037,0.8322082931533269,0.08099498926270572
