<?xml version='1.0' encoding='UTF-8' ?>
<svg xmlns='http://www.w3.org/2000/svg' xmlns:xlink='http://www.w3.org/1999/xlink' viewBox='0 0 720.00 720.00'>
<defs>
  <style type='text/css'><![CDATA[
    line, polyline, polygon, path, rect, circle {
      fill: none;
      stroke: #000000;
      stroke-linecap: round;
      stroke-linejoin: round;
      stroke-miterlimit: 10.00;
    }
  ]]></style>
</defs>
<rect width='100%' height='100%' style='stroke: none; fill: #FFFFFF;'/>
<defs>
  <clipPath id='cpMC4wMHw3MjAuMDB8NzA4LjAyfDExLjk4'>
    <rect x='0.00' y='11.98' width='720.00' height='696.05' />
  </clipPath>
</defs>
<rect x='0.00' y='11.98' width='720.00' height='696.05' style='stroke-width: 1.07; stroke: #FFFFFF; fill: #FFFFFF;' clip-path='url(#cpMC4wMHw3MjAuMDB8NzA4LjAyfDExLjk4)' />
<defs>
  <clipPath id='cpMC4wMHw3MjAuMDB8NzIwLjAwfDAuMDA='>
    <rect x='0.00' y='0.00' width='720.00' height='720.00' />
  </clipPath>
</defs>
<defs>
  <clipPath id='cpMjMuOTB8NjQ3LjM0fDY3OS42MXw1Ni4xOA=='>
    <rect x='23.90' y='56.18' width='623.44' height='623.44' />
  </clipPath>
</defs>
<rect x='23.90' y='56.18' width='623.44' height='623.44' style='stroke-width: 1.07; stroke: none; fill: #EBEBEB;' clip-path='url(#cpMjMuOTB8NjQ3LjM0fDY3OS42MXw1Ni4xOA==)' />
<polyline points='335.62,367.89 335.62,87.35 ' style='stroke-width: 1.07; stroke: #FFFFFF; stroke-linecap: butt;' clip-path='url(#cpMjMuOTB8NjQ3LjM0fDY3OS42MXw1Ni4xOA==)' />
<polyline points='335.62,367.89 599.09,464.27 ' style='stroke-width: 1.07; stroke: #FFFFFF; stroke-linecap: butt;' clip-path='url(#cpMjMuOTB8NjQ3LjM0fDY3OS42MXw1Ni4xOA==)' />
<polyline points='335.62,367.89 154.60,582.23 ' style='stroke-width: 1.07; stroke: #FFFFFF; stroke-linecap: butt;' clip-path='url(#cpMjMuOTB8NjQ3LjM0fDY3OS42MXw1Ni4xOA==)' />
<polyline points='335.62,367.89 196.51,124.26 ' style='stroke-width: 1.07; stroke: #FFFFFF; stroke-linecap: butt;' clip-path='url(#cpMjMuOTB8NjQ3LjM0fDY3OS42MXw1Ni4xOA==)' />
<polyline points='335.62,367.89 335.62,87.35 ' style='stroke-width: 0.53; stroke: #FFFFFF; stroke-linecap: butt;' clip-path='url(#cpMjMuOTB8NjQ3LjM0fDY3OS42MXw1Ni4xOA==)' />
<polyline points='335.62,367.89 565.56,207.16 ' style='stroke-width: 0.53; stroke: #FFFFFF; stroke-linecap: butt;' clip-path='url(#cpMjMuOTB8NjQ3LjM0fDY3OS42MXw1Ni4xOA==)' />
<polyline points='335.62,367.89 599.09,464.27 ' style='stroke-width: 0.53; stroke: #FFFFFF; stroke-linecap: butt;' clip-path='url(#cpMjMuOTB8NjQ3LjM0fDY3OS42MXw1Ni4xOA==)' />
<polyline points='335.62,367.89 407.58,639.06 ' style='stroke-width: 0.53; stroke: #FFFFFF; stroke-linecap: butt;' clip-path='url(#cpMjMuOTB8NjQ3LjM0fDY3OS42MXw1Ni4xOA==)' />
<polyline points='335.62,367.89 154.60,582.23 ' style='stroke-width: 0.53; stroke: #FFFFFF; stroke-linecap: butt;' clip-path='url(#cpMjMuOTB8NjQ3LjM0fDY3OS42MXw1Ni4xOA==)' />
<polyline points='335.62,367.89 56.24,342.32 ' style='stroke-width: 0.53; stroke: #FFFFFF; stroke-linecap: butt;' clip-path='url(#cpMjMuOTB8NjQ3LjM0fDY3OS42MXw1Ni4xOA==)' />
<polyline points='335.62,367.89 196.51,124.26 ' style='stroke-width: 0.53; stroke: #FFFFFF; stroke-linecap: butt;' clip-path='url(#cpMjMuOTB8NjQ3LjM0fDY3OS42MXw1Ni4xOA==)' />
<polyline points='335.62,243.21 343.52,243.46 351.40,244.21 359.21,245.46 366.93,247.20 374.52,249.43 381.96,252.14 389.21,255.31 396.24,258.94 403.03,263.00 409.54,267.49 415.76,272.38 421.66,277.65 427.21,283.29 432.39,289.27 437.18,295.57 441.57,302.16 445.52,309.01 449.04,316.10 452.09,323.40 454.68,330.87 456.79,338.50 458.41,346.24 459.54,354.07 460.16,361.96 460.29,369.87 459.91,377.78 459.04,385.64 457.66,393.43 455.80,401.12 453.45,408.68 450.62,416.07 447.34,423.26 443.60,430.24 439.43,436.96 434.84,443.41 429.85,449.55 424.48,455.36 418.75,460.82 412.69,465.91 406.32,470.60 399.67,474.87 392.75,478.72 385.61,482.12 378.26,485.06 370.75,487.53 363.09,489.52 355.32,491.02 347.47,492.02 339.57,492.52 331.66,492.52 323.76,492.02 315.92,491.02 308.15,489.52 300.49,487.53 292.97,485.06 285.63,482.12 278.48,478.72 271.57,474.87 264.91,470.60 258.54,465.91 252.48,460.82 246.75,455.36 241.38,449.55 236.39,443.41 231.81,436.96 227.63,430.24 223.90,423.26 220.61,416.07 217.79,408.68 215.44,401.12 213.57,393.43 212.20,385.64 211.32,377.78 210.94,369.87 211.07,361.96 211.70,354.07 212.82,346.24 214.44,338.50 216.55,330.87 219.14,323.40 222.20,316.10 225.71,309.01 229.67,302.16 234.05,295.57 238.84,289.27 244.02,283.29 249.57,277.65 255.47,272.38 261.69,267.49 268.21,263.00 274.99,258.94 282.03,255.31 289.27,252.14 296.71,249.43 304.30,247.20 312.02,245.46 319.83,244.21 327.71,243.46 335.62,243.21 ' style='stroke-width: 1.07; stroke: #FFFFFF; stroke-linecap: butt;' clip-path='url(#cpMjMuOTB8NjQ3LjM0fDY3OS42MXw1Ni4xOA==)' />
<polyline points='335.62,87.35 353.41,87.91 371.13,89.60 388.71,92.42 406.08,96.34 423.16,101.35 439.89,107.44 456.19,114.58 472.02,122.74 487.29,131.88 501.96,141.98 515.95,152.98 529.22,164.85 541.70,177.54 553.36,190.99 564.14,205.16 574.01,219.98 582.91,235.40 590.81,251.35 597.69,267.77 603.51,284.59 608.26,301.75 611.90,319.18 614.44,336.80 615.85,354.55 616.13,372.35 615.28,390.13 613.31,407.82 610.22,425.35 606.02,442.65 600.73,459.65 594.38,476.28 586.99,492.48 578.58,508.17 569.19,523.30 558.87,537.80 547.64,551.61 535.56,564.69 522.68,576.98 509.04,588.42 494.70,598.98 479.73,608.60 464.17,617.26 448.10,624.91 431.57,631.52 414.66,637.08 397.42,641.55 379.94,644.92 362.28,647.17 344.52,648.30 326.72,648.30 308.95,647.17 291.29,644.92 273.81,641.55 256.58,637.08 239.66,631.52 223.14,624.91 207.06,617.26 191.51,608.60 176.53,598.98 162.19,588.42 148.56,576.98 135.67,564.69 123.59,551.61 112.37,537.80 102.04,523.30 92.66,508.17 84.25,492.48 76.85,476.28 70.50,459.65 65.21,442.65 61.02,425.35 57.92,407.82 55.95,390.13 55.10,372.35 55.39,354.55 56.80,336.80 59.33,319.18 62.98,301.75 67.72,284.59 73.54,267.77 80.42,251.35 88.33,235.40 97.23,219.98 107.09,205.16 117.87,190.99 129.53,177.54 142.02,164.85 155.28,152.98 169.28,141.98 183.94,131.88 199.22,122.74 215.04,114.58 231.35,107.44 248.08,101.35 265.16,96.34 282.52,92.42 300.10,89.60 317.82,87.91 335.62,87.35 ' style='stroke-width: 1.07; stroke: #FFFFFF; stroke-linecap: butt;' clip-path='url(#cpMjMuOTB8NjQ3LjM0fDY3OS42MXw1Ni4xOA==)' />
<polygon points='335.62,367.89 328.76,362.70 321.91,357.51 315.06,352.31 308.20,347.12 301.35,341.93 294.50,336.73 287.64,331.54 280.79,326.34 273.94,321.15 267.08,315.96 260.23,310.76 253.37,305.57 246.52,300.38 239.67,295.18 232.81,289.99 225.96,284.79 219.11,279.60 212.25,274.41 205.40,269.21 198.55,264.02 191.69,258.83 184.84,253.63 177.99,248.44 171.13,243.24 164.28,238.05 157.43,232.86 150.57,227.66 143.72,222.47 136.87,217.28 131.87,224.10 127.11,231.10 122.59,238.25 118.31,245.55 114.29,252.99 110.52,260.57 107.01,268.27 103.76,276.08 100.78,284.00 98.07,292.01 95.63,300.11 93.47,308.29 91.59,316.54 89.98,324.85 88.66,333.21 87.63,341.60 86.88,350.03 86.42,358.48 86.24,366.94 86.35,375.40 86.75,383.85 87.44,392.28 88.41,400.69 89.66,409.06 91.20,417.38 93.02,425.64 95.12,433.84 97.49,441.96 100.14,449.99 103.06,457.93 106.25,465.77 109.70,473.49 113.41,481.10 117.38,488.57 121.60,495.90 126.07,503.09 130.77,510.12 135.72,516.99 140.89,523.68 146.29,530.20 151.90,536.53 157.73,542.66 163.76,548.60 169.99,554.32 176.41,559.83 183.01,565.12 189.79,570.19 196.74,575.02 203.84,579.61 211.10,583.96 218.50,588.06 226.04,591.90 233.70,595.49 241.48,598.82 249.37,601.88 257.35,604.67 265.43,607.19 273.59,609.43 281.82,611.40 290.11,613.08 298.45,614.49 306.84,615.60 315.26,616.44 323.70,616.99 332.16,617.25 340.62,617.22 349.08,616.91 357.51,616.31 365.93,615.42 374.31,614.25 382.64,612.80 390.92,611.06 399.14,609.04 407.29,606.75 415.35,604.18 423.32,601.34 431.19,598.23 438.94,594.86 446.58,591.22 454.10,587.33 461.47,583.18 468.70,578.79 475.78,574.15 482.70,569.28 489.44,564.17 496.01,558.84 502.40,553.29 508.59,547.53 514.59,541.56 520.37,535.39 525.95,529.02 531.31,522.47 536.44,515.74 541.34,508.85 546.00,501.79 550.42,494.57 554.59,487.21 558.52,479.72 562.18,472.09 565.59,464.35 568.72,456.49 571.60,448.53 574.20,440.48 576.52,432.34 578.57,424.13 580.34,415.86 581.82,407.53 583.03,399.16 583.94,390.74 584.58,382.31 584.92,373.85 584.98,365.39 584.75,356.94 584.24,348.49 583.43,340.07 582.35,331.68 580.98,323.33 579.32,315.03 577.39,306.79 575.18,298.63 572.69,290.54 569.93,282.54 566.90,274.64 563.60,266.85 560.04,259.17 556.23,251.62 552.16,244.21 547.84,236.93 543.27,229.81 538.47,222.84 533.43,216.05 528.16,209.42 522.68,202.98 516.98,196.73 511.07,190.68 504.95,184.83 498.64,179.19 492.15,173.77 485.47,168.57 478.63,163.60 471.61,158.87 464.44,154.37 457.13,150.13 449.67,146.13 442.08,142.39 434.37,138.91 426.54,135.69 418.61,132.74 410.59,130.06 402.48,127.65 394.29,125.52 386.03,123.67 377.72,122.10 369.36,120.81 360.96,119.81 352.53,119.09 344.08,118.66 335.62,118.52 335.62,127.12 335.62,135.72 335.62,144.32 335.62,152.92 335.62,161.51 335.62,170.11 335.62,178.71 335.62,187.31 335.62,195.91 335.62,204.51 335.62,213.11 335.62,221.71 335.62,230.31 335.62,238.91 335.62,247.51 335.62,256.11 335.62,264.70 335.62,273.30 335.62,281.90 335.62,290.50 335.62,299.10 335.62,307.70 335.62,316.30 335.62,324.90 335.62,333.50 335.62,342.10 335.62,350.70 335.62,359.30 335.62,367.89 335.62,367.89 ' style='stroke-width: 3.20; stroke: #A9A9A9; fill: #C77CFF;' clip-path='url(#cpMjMuOTB8NjQ3LjM0fDY3OS42MXw1Ni4xOA==)' />
<polygon points='335.62,367.89 332.86,359.75 330.10,351.61 327.34,343.46 324.58,335.32 321.82,327.17 319.06,319.03 316.30,310.88 313.54,302.74 310.78,294.59 308.02,286.45 305.27,278.31 302.51,270.16 299.75,262.02 296.99,253.87 294.23,245.73 291.47,237.58 288.71,229.44 285.95,221.29 283.19,213.15 280.43,205.01 277.67,196.86 274.91,188.72 272.15,180.57 269.40,172.43 266.64,164.28 263.88,156.14 261.12,147.99 258.36,139.85 255.60,131.71 247.37,134.65 239.26,137.89 231.26,141.40 223.39,145.20 215.66,149.27 208.07,153.60 200.64,158.20 193.38,163.06 186.29,168.17 179.39,173.52 172.67,179.11 166.16,184.94 159.86,190.99 153.77,197.25 147.90,203.73 142.26,210.41 136.87,217.28 143.72,222.47 150.57,227.66 157.43,232.86 164.28,238.05 171.13,243.24 177.99,248.44 184.84,253.63 191.69,258.83 198.55,264.02 205.40,269.21 212.25,274.41 219.11,279.60 225.96,284.79 232.81,289.99 239.67,295.18 246.52,300.38 253.37,305.57 260.23,310.76 267.08,315.96 273.94,321.15 280.79,326.34 287.64,331.54 294.50,336.73 301.35,341.93 308.20,347.12 315.06,352.31 321.91,357.51 328.76,362.70 335.62,367.89 335.62,367.89 ' style='stroke-width: 3.20; stroke: #A9A9A9; fill: #00BFC4;' clip-path='url(#cpMjMuOTB8NjQ3LjM0fDY3OS42MXw1Ni4xOA==)' />
<polygon points='335.62,367.89 334.46,359.37 333.31,350.85 332.16,342.33 331.00,333.81 329.85,325.29 328.70,316.77 327.54,308.24 326.39,299.72 325.24,291.20 324.09,282.68 322.93,274.16 321.78,265.64 320.63,257.12 319.47,248.59 318.32,240.07 317.17,231.55 316.01,223.03 314.86,214.51 313.71,205.99 312.55,197.46 311.40,188.94 310.25,180.42 309.09,171.90 307.94,163.38 306.79,154.86 305.64,146.34 304.48,137.81 303.33,129.29 302.18,120.77 292.71,122.24 283.30,124.07 273.97,126.26 264.73,128.81 255.60,131.71 258.36,139.85 261.12,147.99 263.88,156.14 266.64,164.28 269.40,172.43 272.15,180.57 274.91,188.72 277.67,196.86 280.43,205.01 283.19,213.15 285.95,221.29 288.71,229.44 291.47,237.58 294.23,245.73 296.99,253.87 299.75,262.02 302.51,270.16 305.27,278.31 308.02,286.45 310.78,294.59 313.54,302.74 316.30,310.88 319.06,319.03 321.82,327.17 324.58,335.32 327.34,343.46 330.10,351.61 332.86,359.75 335.62,367.89 335.62,367.89 ' style='stroke-width: 3.20; stroke: #A9A9A9; fill: #7CAE00;' clip-path='url(#cpMjMuOTB8NjQ3LjM0fDY3OS42MXw1Ni4xOA==)' />
<polygon points='335.62,367.89 335.62,359.30 335.62,350.70 335.62,342.10 335.62,333.50 335.62,324.90 335.62,316.30 335.62,307.70 335.62,299.10 335.62,290.50 335.62,281.90 335.62,273.30 335.62,264.70 335.62,256.11 335.62,247.51 335.62,238.91 335.62,230.31 335.62,221.71 335.62,213.11 335.62,204.51 335.62,195.91 335.62,187.31 335.62,178.71 335.62,170.11 335.62,161.51 335.62,152.92 335.62,144.32 335.62,135.72 335.62,127.12 335.62,118.52 324.44,118.77 313.29,119.52 302.18,120.77 303.33,129.29 304.48,137.81 305.64,146.34 306.79,154.86 307.94,163.38 309.09,171.90 310.25,180.42 311.40,188.94 312.55,197.46 313.71,205.99 314.86,214.51 316.01,223.03 317.17,231.55 318.32,240.07 319.47,248.59 320.63,257.12 321.78,265.64 322.93,274.16 324.09,282.68 325.24,291.20 326.39,299.72 327.54,308.24 328.70,316.77 329.85,325.29 331.00,333.81 332.16,342.33 333.31,350.85 334.46,359.37 335.62,367.89 335.62,367.89 ' style='stroke-width: 3.20; stroke: #A9A9A9; fill: #F8766D;' clip-path='url(#cpMjMuOTB8NjQ3LjM0fDY3OS42MXw1Ni4xOA==)' />
<g clip-path='url(#cpMjMuOTB8NjQ3LjM0fDY3OS42MXw1Ni4xOA==)'><text x='433.95' y='623.68' style='font-size: 22.76px; font-family: Liberation Sans;' textLength='37.98px' lengthAdjust='spacingAndGlyphs'>279</text></g>
<g clip-path='url(#cpMjMuOTB8NjQ3LjM0fDY3OS42MXw1Ni4xOA==)'><text x='166.88' y='150.14' style='font-size: 22.76px; font-family: Liberation Sans;' textLength='25.32px' lengthAdjust='spacingAndGlyphs'>31</text></g>
<g clip-path='url(#cpMjMuOTB8NjQ3LjM0fDY3OS42MXw1Ni4xOA==)'><text x='265.41' y='107.52' style='font-size: 22.76px; font-family: Liberation Sans;' textLength='25.32px' lengthAdjust='spacingAndGlyphs'>10</text></g>
<g clip-path='url(#cpMjMuOTB8NjQ3LjM0fDY3OS42MXw1Ni4xOA==)'><text x='316.11' y='101.73' style='font-size: 22.76px; font-family: Liberation Sans;' textLength='12.66px' lengthAdjust='spacingAndGlyphs'>7</text></g>
<g clip-path='url(#cpMjMuOTB8NjQ3LjM0fDY3OS42MXw1Ni4xOA==)'><text x='333.17' y='90.37' style='font-size: 8.80px; fill: #4D4D4D; font-family: Liberation Sans;' textLength='4.89px' lengthAdjust='spacingAndGlyphs'>0</text></g>
<g clip-path='url(#cpMjMuOTB8NjQ3LjM0fDY3OS42MXw1Ni4xOA==)'><text x='591.75' y='467.30' style='font-size: 8.80px; fill: #4D4D4D; font-family: Liberation Sans;' textLength='14.68px' lengthAdjust='spacingAndGlyphs'>100</text></g>
<g clip-path='url(#cpMjMuOTB8NjQ3LjM0fDY3OS42MXw1Ni4xOA==)'><text x='147.26' y='585.26' style='font-size: 8.80px; fill: #4D4D4D; font-family: Liberation Sans;' textLength='14.68px' lengthAdjust='spacingAndGlyphs'>200</text></g>
<g clip-path='url(#cpMjMuOTB8NjQ3LjM0fDY3OS42MXw1Ni4xOA==)'><text x='189.17' y='127.29' style='font-size: 8.80px; fill: #4D4D4D; font-family: Liberation Sans;' textLength='14.68px' lengthAdjust='spacingAndGlyphs'>300</text></g>
<defs>
  <clipPath id='cpMC4wMHw3MjAuMDB8NzIwLjAwfDAuMDA='>
    <rect x='0.00' y='0.00' width='720.00' height='720.00' />
  </clipPath>
</defs>
<polyline points='21.16,243.21 23.90,243.21 ' style='stroke-width: 1.07; stroke: #333333; stroke-linecap: butt;' clip-path='url(#cpMC4wMHw3MjAuMDB8NzIwLjAwfDAuMDA=)' />
<g clip-path='url(#cpMC4wMHw3MjAuMDB8NzIwLjAwfDAuMDA=)'><text x='185.96' y='699.43' style='font-size: 15.00px; font-family: Liberation Sans;' textLength='299.32px' lengthAdjust='spacingAndGlyphs'>Fraction of variance Observed Inside Section</text></g>
<g clip-path='url(#cpMC4wMHw3MjAuMDB8NzIwLjAwfDAuMDA=)'><text transform='translate(13.74,387.91) rotate(-90)' style='font-size: 12.00px; font-family: Liberation Sans;' textLength='40.03px' lengthAdjust='spacingAndGlyphs'>Section</text></g>
<rect x='658.30' y='320.19' width='56.23' height='95.41' style='stroke-width: 1.07; stroke: none; fill: #FFFFFF;' clip-path='url(#cpMC4wMHw3MjAuMDB8NzIwLjAwfDAuMDA=)' />
<g clip-path='url(#cpMC4wMHw3MjAuMDB8NzIwLjAwfDAuMDA=)'><text x='663.77' y='334.38' style='font-size: 11.00px; font-family: Liberation Sans;' textLength='27.52px' lengthAdjust='spacingAndGlyphs'>name</text></g>
<rect x='663.77' y='341.00' width='17.28' height='17.28' style='stroke-width: 1.07; stroke: #FFFFFF; fill: #F2F2F2;' clip-path='url(#cpMC4wMHw3MjAuMDB8NzIwLjAwfDAuMDA=)' />
<rect x='665.90' y='343.13' width='13.03' height='13.03' style='stroke-width: 3.20; stroke: #A9A9A9; stroke-linecap: square; stroke-linejoin: miter; fill: #F8766D;' clip-path='url(#cpMC4wMHw3MjAuMDB8NzIwLjAwfDAuMDA=)' />
<rect x='663.77' y='358.28' width='17.28' height='17.28' style='stroke-width: 1.07; stroke: #FFFFFF; fill: #F2F2F2;' clip-path='url(#cpMC4wMHw3MjAuMDB8NzIwLjAwfDAuMDA=)' />
<rect x='665.90' y='360.41' width='13.03' height='13.03' style='stroke-width: 3.20; stroke: #A9A9A9; stroke-linecap: square; stroke-linejoin: miter; fill: #7CAE00;' clip-path='url(#cpMC4wMHw3MjAuMDB8NzIwLjAwfDAuMDA=)' />
<rect x='663.77' y='375.56' width='17.28' height='17.28' style='stroke-width: 1.07; stroke: #FFFFFF; fill: #F2F2F2;' clip-path='url(#cpMC4wMHw3MjAuMDB8NzIwLjAwfDAuMDA=)' />
<rect x='665.90' y='377.69' width='13.03' height='13.03' style='stroke-width: 3.20; stroke: #A9A9A9; stroke-linecap: square; stroke-linejoin: miter; fill: #00BFC4;' clip-path='url(#cpMC4wMHw3MjAuMDB8NzIwLjAwfDAuMDA=)' />
<rect x='663.77' y='392.84' width='17.28' height='17.28' style='stroke-width: 1.07; stroke: #FFFFFF; fill: #F2F2F2;' clip-path='url(#cpMC4wMHw3MjAuMDB8NzIwLjAwfDAuMDA=)' />
<rect x='665.90' y='394.97' width='13.03' height='13.03' style='stroke-width: 3.20; stroke: #A9A9A9; stroke-linecap: square; stroke-linejoin: miter; fill: #C77CFF;' clip-path='url(#cpMC4wMHw3MjAuMDB8NzIwLjAwfDAuMDA=)' />
<g clip-path='url(#cpMC4wMHw3MjAuMDB8NzIwLjAwfDAuMDA=)'><text x='686.53' y='352.67' style='font-size: 8.80px; font-family: Liberation Sans;' textLength='22.51px' lengthAdjust='spacingAndGlyphs'>100%</text></g>
<g clip-path='url(#cpMC4wMHw3MjAuMDB8NzIwLjAwfDAuMDA=)'><text x='686.53' y='369.95' style='font-size: 8.80px; font-family: Liberation Sans;' textLength='17.61px' lengthAdjust='spacingAndGlyphs'>75%</text></g>
<g clip-path='url(#cpMC4wMHw3MjAuMDB8NzIwLjAwfDAuMDA=)'><text x='686.53' y='387.23' style='font-size: 8.80px; font-family: Liberation Sans;' textLength='17.61px' lengthAdjust='spacingAndGlyphs'>50%</text></g>
<g clip-path='url(#cpMC4wMHw3MjAuMDB8NzIwLjAwfDAuMDA=)'><text x='686.53' y='404.51' style='font-size: 8.80px; font-family: Liberation Sans;' textLength='17.61px' lengthAdjust='spacingAndGlyphs'>25%</text></g>
<g clip-path='url(#cpMC4wMHw3MjAuMDB8NzIwLjAwfDAuMDA=)'><text x='23.90' y='48.41' style='font-size: 11.00px; font-family: Liberation Sans;' textLength='231.71px' lengthAdjust='spacingAndGlyphs'>Antioxidants Variation Chart For Cherry_tomato</text></g>
<g clip-path='url(#cpMC4wMHw3MjAuMDB8NzIwLjAwfDAuMDA=)'><text x='23.90' y='31.22' style='font-size: 20.00px; font-family: Liberation Sans;' textLength='554.76px' lengthAdjust='spacingAndGlyphs'>Comparison of Population in Each Quarter Section of Variance</text></g>
</svg>
