sample_id,lab_id,crop,management,Depth,pH,EC,Agg stability,Respiration,%C,%N,C:N
UF043,12-539,mizuna,till/no BEAM,4,,,30,,3.19,0.25,12.6464646464646
UF043,12-540,mizuna,till/no BEAM,8,6.93,489.9,,54.37,2.29,0.18,12.5384615384615
UF045,12-541,mizuna,till/no BEAM,4,7.26,432.5,76.92,59.56,3.6,0.29,12.5963302752294
UF045,12-542,mizuna,till/no BEAM,8,7.16,294.6,,56.78,2.84,0.21,13.4347826086957
UF047,12-543,mizuna,till/no BEAM,4,7.34,270,40,59.49,3,0.21,14.4324324324324
UF047,12-544,mizuna,till/no BEAM,8,7.15,418.5,,52.93,3.08,0.23,13.6279069767442
UF048,12-545,mizuna,till/BEAM,4,7.03,823.4,59.34,56.53,3.11,0.24,12.9540229885058
UF048,12-546,mizuna,till/BEAM,8,7.05,537.3,,53.9,2.03,0.16,12.5714285714286
UF050,12-547,mizuna,till/BEAM,4,7.07,504.5,21.28,53.79,2.82,0.21,13.2048192771084
UF050,12-548,mizuna,till/BEAM,8,7.1,437.6,,43.24,2.07,0.17,12.03125
UF052,12-549,mizuna,till/BEAM,4,7.22,544.5,38.3,61.79,2.71,0.21,12.6896551724138
UF052,12-550,mizuna,till/BEAM,8,7.24,363.2,,35.38,3.26,0.23,14.1511627906977
UF053,12-551,mizuna,till/no BEAM,4,7.2,463.5,31.76,48.62,2.81,0.2,13.9615384615385
UF053,12-552,mizuna,till/no BEAM,8,6.94,326.8,,37.16,1.7,0.13,12.5263157894737
UF055,12-553,mizuna,till/no BEAM,4,7.25,417.4,15.56,52.59,3.17,0.23,13.6274509803922
UF055,12-554,mizuna,till/no BEAM,8,6.99,429.4,,36.84,2.24,0.16,13.7540983606557
UF057,12-555,mizuna,till/no BEAM,4,7.36,174.9,23.23,41.97,3.11,0.23,13.3125
UF057,12-556,mizuna,till/no BEAM,8,7.12,552.6,,34.9,2.23,0.17,13.4603174603175
UF058,12-557,mizuna,till/BEAM,4,7.25,108.4,42.86,51.74,3.75,0.29,13
UF058,12-558,mizuna,till/BEAM,8,7.3,83.11,,37.19,2.05,0.16,12.8983050847458
UF060,12-559,mizuna,till/BEAM,4,7.41,519.7,38,39.81,3.36,0.24,13.734693877551
UF060,12-560,mizuna,till/BEAM,8,7.12,600.7,,36.64,2.37,0.18,13.5882352941176
UF062,12-561,mizuna,till/BEAM,4,7.43,334.7,21.88,49.01,3.13,0.24,13.0333333333333
UF062,12-562,mizuna,till/BEAM,8,7.22,345,,40.37,2.69,0.18,14.943661971831
UF063,12-563,mizuna,no till/BEAM,4,7.24,565,89.01,52.75,3.05,0.23,13.0555555555556
UF063,12-564,mizuna,no till/BEAM,8,7.24,323.6,,52.96,2.6,0.19,13.7714285714286
UF065,12-565,mizuna,no till/BEAM,4,7.34,500.1,80.95,77.93,5.44,0.41,13.2287581699346
UF065,12-566,mizuna,no till/BEAM,8,7.23,207.4,,31.48,1.96,0.15,13.2459016393443
UF067,12-567,mizuna,no till/BEAM,4,7.38,331.1,60.87,68.6,12.52,0.71,17.5875912408759
UF067,12-568,mizuna,no till/BEAM,8,7.37,461,,51.59,5.63,0.41,13.7733333333333
UF068,12-569,mizuna,no till/no BEAM,4,7.36,462.5,69.41,65.39,3.77,0.27,13.9195402298851
UF068,12-570,mizuna,no till/no BEAM,8,7.03,651.4,,43.04,2.24,0.17,13.0285714285714
UF070,12-571,mizuna,no till/no BEAM,4,7.03,378.5,94.12,,3.82,0.28,13.4130434782609
UF070,12-572,mizuna,no till/no BEAM,8,6.79,482.9,,51.89,2.07,0.16,12.8548387096774
UF072,12-573,mizuna,no till/no BEAM,4,6.96,269.6,30,53.53,2.4,0.19,12.3766233766234
UF072,12-574,mizuna,no till/no BEAM,8,6.93,256.2,,35.28,1.81,0.14,12.8166666666667
UF073,12-575,mizuna,no till/no BEAM,4,7.17,722.2,80.85,74.46,2.82,0.24,11.9375
UF073,12-576,mizuna,no till/no BEAM,8,7.21,356.1,,40.73,2.23,0.17,13.5384615384615
UF075,12-577,mizuna,no till/no BEAM,4,6.97,182.8,81.52,53.24,1.78,0.14,12.4090909090909
UF075,12-578,mizuna,no till/no BEAM,8,7.23,187.9,,52.71,3.98,0.3,13.2954545454545
UF077,12-579,mizuna,no till/no BEAM,4,6.93,667.6,86.9,47.31,2.37,0.18,13.1739130434783
UF077,12-580,mizuna,no till/no BEAM,8,7.04,318.1,,36.28,1.55,0.12,13.1428571428571
UF078,12-581,mizuna,no till/BEAM,4,7.27,837.7,60,53.86,3.45,0.25,13.5904761904762
UF078,12-582,mizuna,no till/BEAM,8,7.36,343.9,,42.28,3.05,0.21,14.5
UF080,12-583,mizuna,no till/BEAM,4,7.3,363.2,97.78,47.68,3.86,0.3,12.7105263157895
UF080,12-584,mizuna,no till/BEAM,8,7.29,202.9,,27.09,1.76,0.14,12.4776119402985
UF082,12-585,mizuna,no till/BEAM,4,7.52,519.4,77.91,60.81,5.26,0.39,13.3636363636364
UF082,12-586,mizuna,no till/BEAM,8,7.29,253.8,,35.94,3.13,0.23,13.6470588235294
UF083,12-587,mizuna,no till/no BEAM,4,7.3,409.5,88.89,73.62,4.11,0.32,12.8613861386139
UF083,12-588,mizuna,no till/no BEAM,8,7.19,251.7,,37.47,2.24,0.18,12.5857142857143
UF085,12-589,mizuna,no till/no BEAM,4,7.07,871.7,91.14,32.05,2.64,0.23,11.7532467532468
UF085,12-590,mizuna,no till/no BEAM,8,7.03,340.1,,28,1.92,0.14,13.7627118644068
UF087,12-591,mizuna,no till/no BEAM,4,7.32,496,72.53,52.74,4.72,0.31,15.1219512195122
UF087,12-592,mizuna,no till/no BEAM,8,7.27,339.7,,30.44,2.22,0.15,14.5789473684211
UF088,12-593,mizuna,no till/BEAM,4,7.46,389.3,82.56,57.6,4.23,0.29,14.6611570247934
UF088,12-594,mizuna,no till/BEAM,8,7.29,274.2,,24.93,1.8,0.14,13.0425531914894
UF090,12-595,mizuna,no till/BEAM,4,7.34,563.5,71.25,68.4,7.44,0.47,15.7801047120419
UF090,12-596,mizuna,no till/BEAM,8,7.14,479.2,,54.38,4.7,0.33,14.4601769911504
UF092,12-597,mizuna,no till/BEAM,4,7.32,306,87.01,63.62,5.77,0.38,15.3086419753086
UF092,12-598,mizuna,no till/BEAM,8,7.23,195,,30.51,2.78,0.2,13.969696969697
UF093,12-599,mizuna,till/BEAM,4,7.5,500.5,,44.16,4.96,0.37,13.3537414965986
UF093,12-600,mizuna,till/BEAM,8,7.26,378.9,,28.62,2.48,0.19,13.3835616438356
UF095,12-602,mizuna,till/BEAM,4,7.04,264.3,66.67,28.33,1.8,0.14,12.4307692307692
UF095,12-601,mizuna,till/BEAM,8,7.35,398.8,,50.63,4.01,0.31,13.0747663551402
UF097,12-603,mizuna,till/BEAM,4,7.28,541.8,59.49,76.6,2.96,0.24,12.5675675675676
UF097,12-604,mizuna,till/BEAM,8,6.97,234.7,,23.7,1.55,0.12,12.4915254237288
UF098,12-605,mizuna,till/no BEAM,4,7.38,417.6,62.37,56.53,2.92,0.23,12.9315068493151
UF098,12-606,mizuna,till/no BEAM,8,6.98,297.7,,28.98,1.5,0.12,12.7391304347826
UF100,12-607,mizuna,till/no BEAM,4,7.31,357.5,48.45,47.77,2.7,0.21,13.0843373493976
UF100,12-608,mizuna,till/no BEAM,8,7.08,171.9,,27.97,1.52,0.12,12.0833333333333
UF102,12-609,mizuna,till/no BEAM,4,6.94,966.7,74.71,60.34,2.6,0.2,12.7549019607843
UF102,12-610,mizuna,till/no BEAM,8,6.68,356,,45.89,2.08,0.13,15.4791666666667
UF103,12-611,mizuna,no till/BEAM,4,7.2,564.1,70.1,50.82,2.53,0.2,12.6021505376344
UF103,12-612,mizuna,no till/BEAM,8,7.11,165.2,,42.81,1.86,0.14,12.9322033898305
UF105,12-613,mizuna,no till/BEAM,4,6.72,642,81.05,51.56,2.22,0.18,12.0434782608696
UF105,12-614,mizuna,no till/BEAM,8,6.87,232.3,,35.1,1.53,0.11,13.425
UF107,12-615,mizuna,no till/BEAM,4,6.53,522,79.55,51.4,2.43,0.21,11.7878787878788
UF107,12-616,mizuna,no till/BEAM,8,6.75,248,,48.83,1.77,0.15,12.0281690140845
UF108,12-617,mizuna,no till/no BEAM,4,6.77,653.4,47.73,67.38,2.03,0.16,13
UF108,12-618,mizuna,no till/no BEAM,8,6.9,381.9,,41.89,1.85,0.15,12.7457627118644
UF110,12-619,mizuna,no till/no BEAM,4,6.93,628.7,65.82,43.62,2.14,0.17,12.3134328358209
UF110,12-620,mizuna,no till/no BEAM,8,6.82,524.3,,49.18,1.62,0.14,11.9333333333333
UF112,12-621,mizuna,no till/no BEAM,4,7,523,56.67,54.19,2.48,0.19,13.3472222222222
UF112,12-622,mizuna,no till/no BEAM,8,6.84,187.4,,41.74,1.82,0.15,12.1929824561403
UF113,12-623,mizuna,till/no BEAM,4,7.31,548.5,62.64,,2.96,0.22,13.6145833333333
UF113,12-624,mizuna,till/no BEAM,8,7.09,269.7,,63.46,2.28,0.17,13.112676056338
UF115,12-625,mizuna,till/no BEAM,4,7.23,798.6,29.17,,2.32,0.19,12.2
UF115,12-626,mizuna,till/no BEAM,8,7.05,536.1,,44.8,2.19,0.16,13.2727272727273
UF117,12-627,mizuna,till/no BEAM,4,7.23,361.5,60.49,,4.07,0.29,14.327868852459
UF117,12-628,mizuna,till/no BEAM,8,7.2,629,,,3.57,0.27,13.495145631068
UF118,12-629,mizuna,till/BEAM,4,7.11,661.1,37.93,64.04,2.88,0.23,12.6746987951807
UF118,12-630,mizuna,till/BEAM,8,7.32,153.2,,40.39,1.9,0.14,13.7924528301887
UF120,12-631,mizuna,till/BEAM,4,7.23,53.93,46.74,,3.29,0.24,13.5189873417722
UF120,12-632,mizuna,till/BEAM,8,7.28,227.5,,48.68,2.5,0.19,12.967032967033
UF122,12-633,mizuna,till/BEAM,4,6.96,306.9,,58.95,2.44,0.18,13.5
UF122,12-634,mizuna,till/BEAM,8,6.74,231.8,,55.68,1.81,0.15,12.0161290322581
UF123,12-636,mustard,till/BEAM,4,7.31,289.8,11.96,59.61,3.43,0.26,13.3303571428571
UF123,12-637,mustard,till/BEAM,8,7.23,288.5,,45.65,2.59,0.2,13.08
UF125,12-638,mustard,till/BEAM,4,7.39,197.9,35.79,70.93,3.14,0.24,13.0112359550562
UF125,12-639,mustard,till/BEAM,8,7.13,348.2,,49.1,2.64,0.21,12.8271604938272
UF127,12-640,mustard,till/BEAM,4,7.25,452.9,62.62,63.1,3.23,0.25,13.1168831168831
UF128,12-641,mustard,till/no BEAM,4,7.1,344.2,10.99,58.76,3.26,0.25,12.9340659340659
UF127,12-642,mustard,till/BEAM,8,7.14,247.3,,18.36,1.98,0.17,11.9473684210526
UF128,12-643,mustard,till/no BEAM,8,7.16,264.9,,45.21,2.32,0.19,12.1034482758621
UF130,12-644,mustard,till/no BEAM,4,7.13,496.8,67.71,53.53,3.27,0.27,12.1428571428571
UF130,12-645,mustard,till/no BEAM,8,7.01,224.8,,42.34,2.49,0.2,12.4567901234568
UF132,12-646,mustard,till/no BEAM,4,6.86,629.6,57.89,66.74,2.86,0.23,12.3582089552239
UF132,12-647,mustard,till/no BEAM,8,6.96,240.1,,51.92,2.16,0.18,12.2755102040816
UF133,12-648,mustard,till/BEAM,4,7.43,384.6,72.09,46.66,3.29,0.25,12.970297029703
UF133,12-649,mustard,till/BEAM,8,7.18,230.3,,35.86,2.18,0.18,12.1428571428571
UF135,12-650,mustard,till/BEAM,4,7.12,885.6,39.18,69.12,4.16,0.31,13.3227848101266
UF135,12-651,mustard,till/BEAM,8,7.12,303.6,,46.52,2.54,0.2,12.4285714285714
UF137,12-652,mustard,till/BEAM,4,7.36,552.4,45.28,55.15,4.03,0.3,13.5478260869565
UF137,12-653,mustard,till/BEAM,8,7.2,358.1,,59.69,3.21,0.25,12.6448598130841
UF138,12-654,mustard,till/no BEAM,4,7.3,833.5,91.67,51.84,3.51,0.27,13.0943396226415
UF138,12-655,mustard,till/no BEAM,8,7.28,80.58,,38.91,2.92,0.22,13.2857142857143
UF140,12-656,mustard,till/no BEAM,4,7.45,349.4,28.72,60.23,3.2,0.25,12.9247311827957
UF140,12-657,mustard,till/no BEAM,8,7.19,344.6,,46.37,2.7,0.21,12.7432432432432
UF142,12-658,mustard,till/no BEAM,4,7.34,306.6,22.22,55.34,2.56,0.2,12.9146341463415
UF142,12-659,mustard,till/no BEAM,8,7.11,148.9,,52.1,2.62,0.19,13.4788732394366
UF145,12-660,mustard,no till/no BEAM,4,7.51,205.4,75,55.02,3.6,0.28,12.631067961165
UF145,12-661,mustard,no till/no BEAM,8,7.4,126,,25.1,2.48,0.19,12.8089887640449
UF147,12-662,mustard,no till/no BEAM,4,7.49,128.2,60.67,49.06,3.91,0.28,14.1578947368421
UF147,12-663,mustard,no till/no BEAM,8,7.29,191.1,,40.24,2.57,0.19,13.3
UF148,12-664,mustard,no till/BEAM,4,7.08,203.1,52.94,57.57,3.15,0.23,13.3666666666667
UF148,12-665,mustard,no till/BEAM,8,7.22,170.8,,43.23,2.52,0.19,13.1168831168831
UF150,12-666,mustard,no till/BEAM,4,6.99,131.7,37.04,48.17,2.74,0.21,12.8271604938272
UF150,12-667,mustard,no till/BEAM,8,6.87,260.7,,21.52,2.42,0.19,12.5060240963855
UF152,12-668,mustard,no till/BEAM,4,7.2,268.4,32.61,22.64,2.81,0.21,13.1797752808989
UF152,12-669,mustard,no till/BEAM,8,7.17,155,,21.52,2.06,0.17,12.3835616438356
UF153,12-670,mustard,no till/BEAM,8,7.19,619,,22.64,2.89,0.23,12.8292682926829
UF157,12-671,mustard,no till/BEAM,4,7.33,519.3,71.74,42.56,3.06,0.24,12.75
UF157,12-672,mustard,no till/BEAM,8,7.24,155.1,,33.27,2.48,0.2,12.6436781609195
UF158,12-673,mustard,no till/no BEAM,4,7.25,222.8,66.67,62.31,8,0.55,14.6138613861386
UF158,12-674,mustard,no till/no BEAM,8,6.87,231.6,,49.38,4.47,0.34,13.168
UF160,12-675,mustard,no till/no BEAM,8,7.66,384.3,,32.52,2.29,0.18,13.013698630137
UF163,12-676,mustard,no till/BEAM,4,7.29,265.5,85.71,34.48,4.1,0.31,13.3365384615385
UF163,12-677,mustard,no till/BEAM,8,7.52,400.6,,32.56,2.37,0.18,13.359375
UF165,12-678,mustard,no till/BEAM,8,7.53,390,,46.6,2.03,0.15,13.15
UF165,12-679,mustard,no till/BEAM,4,7.41,489.8,43.9,34.11,2.8,0.21,13.3855421686747
UF168,12-680,mustard,no till/no BEAM,4,7.25,447.7,51.95,41.46,6.33,0.41,15.3289473684211
UF170,12-681,mustard,no till/no BEAM,4,7.06,294.8,58.62,48.5,5.78,0.39,14.7814569536424
UF170,12-682,mustard,no till/no BEAM,8,7.25,241.7,,42.16,4.21,0.29,14.4426229508197
UF172,12-683,mustard,no till/no BEAM,4,7.06,278.2,14.77,49.6,3.88,0.27,14.0917431192661
UF172,12-684,mustard,no till/no BEAM,8,7.22,390.3,,32.3,3.28,0.24,13.7127659574468
UF173,12-685,mustard,till/no BEAM,4,7.08,320.5,86.96,58.24,3.97,0.34,11.7615894039735
UF173,12-686,mustard,till/no BEAM,8,7.27,463,,45.27,3.79,0.3,12.6616541353383
UF175,12-687,mustard,till/no BEAM,8,7.17,521.5,,40.21,2.99,0.21,14.4756097560976
UF175,12-688,mustard,till/no BEAM,4,7.24,291.8,48.19,34.78,3.49,0.26,13.2389380530973
UF177,12-689,mustard,till/no BEAM,4,7.09,360.3,32.97,48.47,2.99,0.22,13.6043956043956
UF177,12-690,mustard,till/no BEAM,8,7.2,260.3,,41.21,2.57,0.19,13.797619047619
UF197,12-691,mustard,till/BEAM,4,6.88,139.3,16.85,43.22,2.49,0.17,14.5625
UF197,12-692,mustard,till/BEAM,8,6.93,425.7,,28.13,1.98,0.14,14.7678571428571
UF198,12-693,mustard,till/no BEAM,4,7.28,277.2,25,48.57,2.79,0.2,14.16
UF198,12-694,mustard,till/no BEAM,8,7.24,102.1,,35.71,2.29,0.16,14.5238095238095
UF200,12-695,mustard,till/no BEAM,4,7.45,246.3,13.58,37.91,3.15,0.24,13.25
UF200,12-696,mustard,till/no BEAM,8,7.2,178,,33,2.58,0.18,14.6811594202899
UF143,12-697,mustard,no till/no BEAM,4,6.92,513,44.16,38.07,2.59,0.17,14.7727272727273
UF143,12-698,mustard,no till/no BEAM,8,7.27,121.3,,43.39,2.5,0.19,13.5056179775281
UF155,12-699,mustard,no till/BEAM,4,7.22,499.8,35.63,36.04,2.27,0.15,15.25
UF155,12-700,mustard,no till/BEAM,8,7.14,347.6,,34.66,2.04,0.13,15.64
UF162,12-701,mustard,no till/no BEAM,4,7.28,323,25.93,35.8,2.38,0.16,14.9491525423729
UF162,12-702,mustard,no till/no BEAM,8,7.6,206.9,,24.07,3.27,0.23,14.1764705882353
UF153,12-703,mustard,no till/BEAM,4,7.09,409.8,47.62,43.71,2.77,0.19,14.3731343283582
UF160,12-704,mustard,no till/no BEAM,4,7.68,123.1,63.64,41.66,2.13,0.14,15.1724137931034
UF167,12-705,mustard,no till/BEAM,4,7.33,314.3,60.47,45.32,2.84,0.19,14.7866666666667
UF167,12-706,mustard,no till/BEAM,8,7.13,805.9,,54.82,2.85,0.2,14.0229885057471
UF168,12-707,mustard,no till/no BEAM,8,7.11,298.5,,66.27,3.46,0.26,13.196261682243
UF178,12-708,mustard,till/BEAM,4,7.17,443.2,45.35,,,,
UF178,12-709,mustard,till/BEAM,8,6.93,523.9,,56.38,2.75,0.2,13.6708860759494
UF180,12-710,mustard,till/BEAM,4,7.23,310.6,44.71,75.55,4.11,0.33,12.5196850393701
UF180,12-711,mustard,till/BEAM,8,7.36,464.5,,56.93,2.82,0.2,14.3924050632911
UF182,12-712,mustard,till/BEAM,4,7.3,424.8,29.21,55.04,3.22,0.23,14.2441860465116
UF182,12-713,mustard,till/BEAM,8,7.36,345.5,,33.53,2.39,0.16,14.7368421052632
UF183,12-714,mustard,no till/no BEAM,4,7.22,546.3,23.71,65.37,3.62,0.3,11.9246575342466
UF185,12-715,mustard,no till/no BEAM,4,7.43,624.7,17.72,53.78,2.19,0.16,13.8709677419355
UF185,12-716,mustard,no till/no BEAM,8,7.09,387.6,,42.7,2.13,0.15,14.3888888888889
UF183,12-717,mustard,no till/no BEAM,8,7.14,473.3,,55.12,2.95,0.22,13.2886597938144
UF187,12-718,mustard,no till/no BEAM,4,7.22,331.1,41.46,45.61,2.9,0.23,12.8842105263158
UF187,12-719,mustard,no till/no BEAM,8,7.13,379.3,,31.28,2.25,0.16,14.3793103448276
UF188,12-720,mustard,no till/BEAM,4,7.17,485.3,26.67,36.82,2.26,0.16,13.85
UF188,12-721,mustard,no till/BEAM,8,6.9,415.9,,32.36,2.05,0.15,14.0172413793103
UF190,12-722,mustard,no till/BEAM,4,7.03,183.1,37.5,53.34,2.52,0.17,14.5
UF190,12-723,mustard,no till/BEAM,8,7.25,223.6,,52.71,2.33,0.15,15.68
UF192,12-724,mustard,no till/BEAM,4,7.03,589.3,53.13,58.77,2.59,0.19,13.5652173913043
UF192,12-725,mustard,no till/BEAM,8,7.35,52.93,,38.4,2.17,0.16,13.9411764705882
UF193,12-726,mustard,till/BEAM,4,7.16,133.8,56.99,29.52,3.16,0.22,14.4871794871795
UF193,12-727,mustard,till/BEAM,8,7.21,242.6,,34.65,2.07,0.14,14.2222222222222
UF195,12-728,mustard,till/BEAM,4,7.27,307.6,45.24,40.18,2.95,0.22,13.1071428571429
UF195,12-729,mustard,till/BEAM,8,7.16,78.46,,28.47,2.03,0.14,14.8
UF202,12-730,mustard,till/no BEAM,4,6.89,338.5,40,61.92,2.31,0.17,13.1621621621622
UF202,12-731,mustard,till/no BEAM,8,6.68,163.4,,40.39,3.65,0.29,12.607476635514
