factor,explained,N,plantings
tillage.light_tillage,Antioxidants,60,18
tillage.heavy_tillage,Antioxidants,45,14
tillage.none,Antioxidants,84,28
tillage.light_tillage,Polyphenols,60,18
tillage.heavy_tillage,Polyphenols,45,14
tillage.none,Polyphenols,79,28
tillage.light_tillage,Proteins,60,18
tillage.heavy_tillage,Proteins,45,14
tillage.none,Proteins,84,28
tillage.light_tillage,Ca,36,10
tillage.heavy_tillage,Ca,24,8
tillage.none,Ca,57,19
tillage.light_tillage,Fe,36,10
tillage.heavy_tillage,Fe,24,8
tillage.none,Fe,57,19
tillage.light_tillage,K,36,10
tillage.heavy_tillage,K,24,8
tillage.none,K,57,19
tillage.light_tillage,Mg,36,10
tillage.heavy_tillage,Mg,24,8
tillage.none,Mg,57,19
tillage.light_tillage,S,36,10
tillage.heavy_tillage,S,24,8
tillage.none,S,57,19
tillage.light_tillage,Zn,36,10
tillage.heavy_tillage,Zn,24,8
tillage.none,Zn,57,19
