Type,median_10cm_organic_carbon_percentage,median_10cm_respiration_soil,max_10cm_organic_carbon_percentage,max_10cm_respiration_soil,min_10cm_organic_carbon_percentage,min_10cm_respiration_soil,range_10cm_organic_carbon_percentage,range_10cm_respiration_soil,sd_10cm_organic_carbon_percentage,sd_10cm_respiration_soil,ratio_10cm_organic_carbon_percentage,ratio_10cm_respiration_soil,median_20cm_organic_carbon_percentage,median_20cm_respiration_soil,max_20cm_organic_carbon_percentage,max_20cm_respiration_soil,min_20cm_organic_carbon_percentage,min_20cm_respiration_soil,range_20cm_organic_carbon_percentage,range_20cm_respiration_soil,sd_20cm_organic_carbon_percentage,sd_20cm_respiration_soil,ratio_20cm_organic_carbon_percentage,ratio_20cm_respiration_soil
apple,NA,NA,-Inf,-Inf,Inf,Inf,-Inf,-Inf,NA,NA,NA,NA,NA,NA,-Inf,-Inf,Inf,Inf,-Inf,-Inf,NA,NA,NA,NA
beet,4.28,24.439999999999998,30.44,77.12,0.83,3.71,29.610000000000003,73.41000000000001,4.599339082955289,15.655794670836208,36.674698795180724,20.787061994609164,3.355,19.145,55.82,56.45,0.54,1.78,55.28,54.67,5.5970631032988045,12.944988200599974,103.37037037037037,31.713483146067418
blueberry,2.64,23.585,26.17,72.45,1.1,6,25.07,66.45,4.377971155614658,17.98450738503429,23.79090909090909,12.075000000000001,2.3,16.47,17,51.58,0.8,4.97,16.2,46.61,2.7880852762381134,12.647100052456377,21.25,10.378269617706238
bok_choi,5.84,37.325,28.57,74.09,2.74,2.93,25.83,71.16,5.9704823108682135,19.948995281878492,10.427007299270072,25.28668941979522,3.9850000000000003,29.44,21.22,73.91,1.64,5.26,19.58,68.64999999999999,4.716111501259029,18.42080571739364,12.939024390243903,14.051330798479087
carrot,4.61,28.99,23.62,80.33,1.89,10.09,21.73,70.24,3.6893902657597906,16.775999170741457,12.497354497354499,7.961347869177403,3.565,22.43,17.68,51.21,0.52,4.38,17.16,46.83,2.4534831521389298,10.893097470919194,34,11.691780821917808
grapes,4.595,28.35,6.02,46.85,2.16,16.1,3.8599999999999994,30.75,1.6630935030839364,14.91939096165345,2.7870370370370368,2.9099378881987574,4.01,16.54,4.72,30.27,1.64,10.1,3.08,20.17,1.3736763325713472,9.277880684725364,2.8780487804878048,2.997029702970297
kale,5.735,22.79,32.6,76.15,1.41,7.19,31.19,68.96000000000001,7.383869035303377,19.342402643472553,23.120567375886527,10.591098748261475,3.7,19.68,16.5,69.11,0.51,1.73,15.99,67.38,3.16752001315033,14.833328220237053,32.35294117647059,39.947976878612714
leeks,4.74,43.84,24.72,75.49,2.96,11.84,21.759999999999998,63.64999999999999,7.515086223881996,20.45798233027004,8.35135135135135,6.375844594594594,2.47,25.63,13.47,52.5,0.57,15.2,12.9,37.3,3.71419952280947,13.292034241819959,23.631578947368425,3.4539473684210527
lettuce,5.6,25.05,31.29,78.87,1.77,5.07,29.52,73.80000000000001,5.738793664810814,17.534160996463285,17.677966101694913,15.55621301775148,4.32,17.86,18.06,56.84,1.51,3.67,16.549999999999997,53.17,4.188304638476152,14.206489087470361,11.960264900662251,15.48773841961853
mizuna,6.395,54.315,12.17,70.42,4.51,12.1,7.66,58.32,1.4409397194651397,16.085585813584274,2.698447893569845,5.819834710743802,5.51,42.045,9.72,70.03,3.21,6.19,6.510000000000001,63.84,1.1378942067725153,16.88237908033042,3.0280373831775704,11.31340872374798
mustard_greens,4.705,43.22,17.11,73.39,2.31,9.4,14.799999999999999,63.99,4.651686140247256,16.371535426532915,7.406926406926407,7.807446808510638,4,33.769999999999996,17.44,65.28,1.74,6.66,15.700000000000001,58.620000000000005,4.454304377271509,15.658869615063677,10.022988505747128,9.801801801801801
Other,NA,NA,-Inf,-Inf,Inf,Inf,-Inf,-Inf,NA,NA,NA,NA,NA,NA,-Inf,-Inf,Inf,Inf,-Inf,-Inf,NA,NA,NA,NA
peppers,5.35,36.05,26.41,69.72,1.02,6.01,25.39,63.71,3.6371958035474705,15.251841030702288,25.892156862745097,11.600665557404326,3.88,28.55,12.73,69.77,1.29,2.97,11.440000000000001,66.8,2.2317219237839736,16.232936335625958,9.868217054263566,23.491582491582488
potato,2.84,20.53,28.77,76.88,0.44,2.82,28.33,74.06,3.196155562057556,15.496070859955893,65.38636363636364,27.26241134751773,2.47,15.33,29.98,59.31,0.5,1.31,29.48,58,2.6547014524378674,12.365848730579968,59.96,45.274809160305345
spinach,5.78,36.57,9.56,70.37,2.75,10,6.8100000000000005,60.370000000000005,1.708232739092976,15.682346928072144,3.4763636363636365,7.037000000000001,3.9699999999999998,23.28,10.72,41.33,1.86,6.54,8.860000000000001,34.79,1.772501236930636,9.805482362930846,5.763440860215054,6.319571865443425
squash_butternut,NA,NA,-Inf,-Inf,Inf,Inf,-Inf,-Inf,NA,NA,NA,NA,NA,14.91,-Inf,69.23,Inf,3.94,-Inf,65.29,NA,15.813136653468092,NA,17.571065989847718
swiss_chard,4.984999999999999,27.7,29.28,72.34,2.74,7.6,26.54,64.74000000000001,5.540849131289947,17.48232347783536,10.686131386861314,9.51842105263158,3.61,24.325,13.76,65.1,1.66,4.99,12.1,60.10999999999999,2.279131060817912,12.930176601605424,8.289156626506024,13.046092184368735
tomato,NA,NA,-Inf,-Inf,Inf,Inf,-Inf,-Inf,NA,NA,NA,NA,NA,NA,-Inf,-Inf,Inf,Inf,-Inf,-Inf,NA,NA,NA,NA
zucchini,4.9,23.14,23.16,77.67,1.75,4.04,21.41,73.63,4.388856669815735,19.84668761069326,13.234285714285715,19.225247524752476,3.585,21.799999999999997,19.83,71.88,1.6,3.6,18.229999999999997,68.28,3.8935467751025437,17.623900342712503,12.393749999999999,19.966666666666665
