explained,dataset,cvRsquared,covers,width
20cm,bionutrientMeter20cm,0.2936,0.8544710695499708,0.049602313810556756
20cm,"bionutrientMeter20cm, scsMetadata20cm",0.3353,0.869598180439727,0.04391610920267596
10cm,bionutrientMeter10cm,0.4109,0.8650602409638555,0.13712686567164178
10cm,"bionutrientMeter10cm, scsMetadata10cm",0.4808,0.8846153846153846,0.1371510379384396
20cm,"bionutrientMeter20cm, scsMetadata20cm, climateRegion, medFarmPractices",0.534,0.9062200956937799,0.0817780794027825
10cm,"scsMetadata10cm, scsMetadata20cm, climateRegion, medFarmPractices, PH_soil_10cm, PH_soil_20cm, respiration_soil_10cm, respiration_soil_20cm",0.5418,0.8363252375923971,0.07354001441961068
10cm,"scsMetadata10cm, climateRegion, medFarmPractices, PH_soil_10cm, respiration_soil_10cm",0.5731,0.8188331627430911,0.06669069935111752
20cm,"bionutrientMeter20cm, climateRegion, medFarmPractices",0.5782,0.8696701528559936,0.06105834464043419
20cm,"scsMetadata10cm, scsMetadata20cm, climateRegion, medFarmPractices, PH_soil_10cm, PH_soil_20cm, respiration_soil_10cm, respiration_soil_20cm",0.5884,0.7934668071654373,0.06552706552706554
20cm,"scsMetadata20cm, climateRegion, medFarmPractices, PH_soil_20cm",0.5971,0.7924528301886793,0.06780626780626782
20cm,"scsMetadata20cm, climateRegion, medFarmPractices, respiration_soil_20cm",0.5974,0.7814885496183206,0.03936206311503224
10cm,"scsMetadata10cm, climateRegion, medFarmPractices",0.6039,0.789778206364513,0.05905511811023621
10cm,"bionutrientMeter10cm, scsMetadata10cm, climateRegion, medFarmPractices",0.6061,0.8922330097087379,0.12020400858983536
10cm,"bionutrientMeter10cm, climateRegion, medFarmPractices",0.61240000000000006,0.8627450980392157,0.0868690434168726
