explained,species,dataset,cvRsquared,N,mtry,covers,width,model
10cm,soil,1-10cm,0.4015,281,21,0.9893238434163701,0.02905569007263922,NA
20cm,soil,1-20cm,0.4573,290,2,0.9862068965517241,0.03971587399629398,NA
10cm,soil,3-10cm,0.4631,267,22,0.9887640449438202,0.024818401937046007,NA
20cm,soil,2-20cm,0.5245,249,1,1,0.10772104607721045,NA
10cm,soil,2-10cm,0.5656,243,14,0.9794238683127572,0.0181598062953995,NA
20cm,soil,3-20cm,0.5718,276,29,0.9818840579710145,0.020660901791229154,NA
20cm,soil,4-20cm,0.6072,238,2,0.9831932773109243,0.1242216687422167,NA
20cm,soil,5-20cm,0.6727,238,4,0.9747899159663865,0.1330635118306351,NA
10cm,soil,4-10cm,0.6818,232,2,0.9870689655172413,0.12288135593220338,NA
10cm,soil,5-10cm,0.6835,234,37,0.9615384615384616,0.044188861985472144,NA
20cm,soil,6-20cm,0.6898,238,15,0.9537815126050421,0.04856787048567871,NA
20cm,soil,7-20cm,0.6919,235,5,0.9872340425531915,0.10834371108343713,NA
10cm,soil,7-10cm,0.721,229,14,0.9694323144104804,0.04721549636803872,NA
10cm,soil,6-10cm,0.7386,234,29,0.9572649572649573,0.03347457627118659,NA
