crop,antioxidants_orig,antioxidants_dry,antioxidants_raw,antioxidants_final,polyphenols_orig,polyphenols_dry,polyphenols_raw,polyphenols_final,moisture_content,antioxidants,polyphenols
apple 2020,1432.834,88080.602,14309.537,12683.606,70.834,434.111,70.748,62.512,0.835,NA,NA
apple 2021,NA,NA,NA,NA,NA,NA,NA,NA,0.834,4572.585,79.812
beet 2020,772.914,85185.765,10023.158,10563.035,92.783,1045.274,120.269,129.614,0.878,NA,NA
beet 2021,NA,NA,NA,NA,NA,NA,NA,NA,0.888,7133.359,66.152
blueberry 2020,1571.351,129827.605,20313.415,20512.761,273.447,2303.908,353.241,364.017,0.847,NA,NA
bok_choy_bok_choi_pak_choy 2020,332.05,71979.366,4308.365,3383.03,84.638,1802.675,109.806,84.726,0.938,NA,NA
bok_choy_bok_choi_pak_choy 2021,NA,NA,NA,NA,NA,NA,NA,NA,0.937,6278.987,109.004
butternut_squash 2021,NA,NA,NA,NA,NA,NA,NA,NA,0.923,25.286,9.401
carrot 2020,84.934,1105.701,122.907,129.367,89.706,84.681,9.186,9.908,0.891,NA,NA
carrot 2021,NA,NA,NA,NA,NA,NA,NA,NA,0.889,274.939,15.504
cherry_tomato 2021,NA,NA,NA,NA,NA,NA,NA,NA,0.882,2447.719,52.774
Eggplant 2021,NA,NA,NA,NA,NA,NA,NA,NA,NA,NA,NA
EGGPLANT 2021,NA,NA,NA,NA,NA,NA,NA,NA,NA,NA,NA
grapes 2020,358.388,14075.836,2856.722,2744.788,149.275,608.343,118.572,118.627,0.803,NA,NA
grapes 2021,NA,NA,NA,NA,NA,NA,NA,NA,0.81,1347.616,147.803
kale 2020,992.139,93244.834,12826.159,9697.463,279.625,2622.072,361.08,272.695,0.862,NA,NA
kale 2021,NA,NA,NA,NA,NA,NA,NA,NA,0.826,13196.956,268.06
leeks 2020,107.918,4057.988,431.523,689.857,147.176,563.814,58.761,95.849,0.886,NA,NA
leeks 2021,NA,NA,NA,NA,NA,NA,NA,NA,0.85,2119.04,36.814
lettuce 2020,251.265,18682.725,1011.946,990.184,93.573,684.414,38.052,36.274,0.945,NA,NA
lettuce 2021,NA,NA,NA,NA,NA,NA,NA,NA,0.942,1095.346,46.179
mizuna 2020,1152.244,135231.714,14976.287,10142.379,174.778,2078.523,227.123,155.889,0.889,NA,NA
mustard_greens 2020,730.53,88854.527,9482.265,8263.471,207.027,2520.292,268.761,234.387,0.893,NA,NA
mustard_greens 2021,NA,NA,NA,NA,NA,NA,NA,NA,0.887,15166.796,113.72
nectarine 2021,NA,NA,NA,NA,NA,NA,NA,NA,0.897,357.326,27.06
oats 2020,353.8,3813.741,3536.61,3401.857,80.332,87.483,80.265,78.035,0.075,NA,NA
oats 2021,NA,NA,NA,NA,NA,NA,NA,NA,0.094,NA,NA
Other 2020,187.3,NA,NA,NA,46.93,NA,NA,NA,0.769,NA,NA
peach 2021,NA,NA,NA,NA,NA,NA,NA,NA,0.877,876.828,48.626
pear 2021,NA,NA,NA,NA,NA,NA,NA,NA,0.828,275.061,43.047
peppers 2020,1967.745,108756.104,9835.858,7069.147,246.548,1386.638,123.125,90.131,0.916,NA,NA
peppers 2021,NA,NA,NA,NA,NA,NA,NA,NA,0.916,10319.468,157.797
potato 2020,60.771,662.655,126.354,137.832,228.924,242.446,45.983,50.429,0.805,NA,NA
potato 2021,NA,NA,NA,NA,NA,NA,NA,NA,0.793,421.099,52.809
roma tomato 2021,NA,NA,NA,NA,NA,NA,NA,NA,0.926,2364.117,31.556
spinach 2020,172.532,15660.676,1378.788,1346.818,330.665,2880.604,263.912,247.732,0.909,NA,NA
spinach 2021,NA,NA,NA,NA,NA,NA,NA,NA,0.888,5097.442,112.386
squash 2020,79.183,2838.203,160.306,161.778,176.99,622.555,35.526,35.486,0.944,NA,NA
squash 2021,NA,NA,NA,NA,NA,NA,NA,NA,0.942,135.148,25.245
squash_butternut 2020,47.132,747.63,77.636,101.677,94.221,205.364,16.003,27.929,0.917,NA,NA
swiss_chard 2020,145.541,19269.426,1887.083,1406.668,218.449,2944.79,282.791,214.97,0.902,NA,NA
swiss_chard 2021,NA,NA,NA,NA,NA,NA,NA,NA,0.882,5181.028,136.06
tomato 2020,197.968,67870.754,3557.369,3732.892,49.283,1719.594,88.649,94.577,0.948,NA,NA
tomato 2021,NA,NA,NA,NA,NA,NA,NA,NA,0.934,2327.195,32.101
wheat 2020,423.455,3658.052,3384.598,3145.925,133.783,116.035,106.928,99.79,0.085,NA,NA
wheat 2021,NA,NA,NA,NA,NA,NA,NA,NA,0.112,NA,NA
zucchini 2020,86.712,3497.381,173.204,181.864,141.35,568.311,28.193,29.552,0.95,NA,NA
NA,259.173,NA,NA,NA,100.162,NA,NA,NA,1,NA,NA
NA,NA,NA,NA,NA,NA,NA,NA,NA,NA,NA,NA
