explained,dataset,Accuracy_oats,N_oats,Accuracy_wheat,N_wheat
antiQuartile,c-min,0.589625850340136,145,0.6647005772005772,219
antiQuartile,c-min-nir-who,0.6810826210826211,145,0.7301757369614512,214
antiQuartile,c-min-vis-who,0.6831942349589408,145,0.7827330077330077,219
antiQuartile,c-no-nir-who,0.6328971304599473,458,0.6029181929181929,229
antiQuartile,c-no-vis-who,0.6770502213795931,461,0.7116652742968532,234
antiQuartile,f-c-med,0.6419510119510119,145,0.7153094087876697,194
antiQuartile,f-c-med-nir-pro,0.6667962519936205,144,0.7732227032227033,187
antiQuartile,f-c-med-nir-who,0.6729205492363387,145,0.7260846560846561,189
antiQuartile,f-c-med-vis-pro,0.6331295410242779,145,0.8427513227513227,194
antiQuartile,f-c-med-vis-who,0.7708374033374034,145,0.8217460317460318,194
antiQuartile,f-max,0.766984126984127,112,0.7733333333333333,183
antiQuartile,f-max-nir-pro,0.6224664224664225,111,0.893200699083052,176
antiQuartile,f-max-nir-who,0.7337301587301587,112,0.7949808128379556,178
antiQuartile,f-max-soil,0.7201700009392317,112,0.7822398589065256,183
antiQuartile,f-max-soil-nir-pro,0.6343121693121693,111,0.8481184392949099,176
antiQuartile,f-max-soil-nir-who,0.5742951492951494,112,0.8336507936507936,178
antiQuartile,f-max-soil-vis-pro,0.665929440929441,112,0.8744179894179894,183
antiQuartile,f-max-soil-vis-who,0.7310198573356468,112,0.833994708994709,183
antiQuartile,f-max-vis-pro,0.7115384615384616,112,0.8330687830687831,183
antiQuartile,f-max-vis-who,0.7073979591836734,112,0.847037037037037,183
bqiQuartile,c-min,0.8076479076479076,85,0.8099206349206349,135
bqiQuartile,c-min-nir-who,0.6928571428571428,85,0.6814814814814815,133
bqiQuartile,c-min-vis-who,0.6466727716727717,85,0.7483560090702948,135
bqiQuartile,c-no-nir-who,0.5739910669887787,393,0.7022222222222222,148
bqiQuartile,c-no-vis-who,0.49603419828397183,396,0.6855026455026455,150
bqiQuartile,f-c-med,0.8275925925925925,85,0.7658730158730158,111
bqiQuartile,f-c-med-nir-pro,0.7110042735042735,85,0.8727777777777778,108
bqiQuartile,f-c-med-nir-who,0.6825396825396826,85,0.7546153846153846,109
bqiQuartile,f-c-med-vis-pro,0.8191609977324263,85,0.864957264957265,111
bqiQuartile,f-c-med-vis-who,0.8275890775890776,85,0.8022222222222222,111
bqiQuartile,f-max,0.8666666666666667,52,0.7511904761904762,111
bqiQuartile,f-max-nir-pro,0.7344155844155844,52,0.7886904761904762,108
bqiQuartile,f-max-nir-who,0.7388888888888889,52,0.7715419501133787,109
bqiQuartile,f-max-soil,0.8910714285714285,52,0.6722222222222222,111
bqiQuartile,f-max-soil-nir-pro,0.7595238095238095,52,0.8631326462208815,108
bqiQuartile,f-max-soil-nir-who,0.7431818181818182,52,0.7667800453514739,109
bqiQuartile,f-max-soil-vis-pro,0.7935897435897435,52,0.8551587301587301,111
bqiQuartile,f-max-soil-vis-who,0.75,52,0.8,111
bqiQuartile,f-max-vis-pro,0.8861111111111111,52,0.8353174603174603,111
bqiQuartile,f-max-vis-who,0.9083333333333333,52,0.8042735042735043,111
polyQuartile,c-min,0.7260565555302397,144,0.7448411627358996,214
polyQuartile,c-min-nir-who,0.7226599326599327,144,0.5811765304412363,210
polyQuartile,c-min-vis-who,0.6463980463980464,144,0.6652082821432667,214
polyQuartile,c-no-nir-who,0.5944822615474905,462,0.7003862912686442,225
polyQuartile,c-no-vis-who,0.5716530336696256,465,0.5186191513642494,229
polyQuartile,f-c-med,0.6888034188034188,144,0.7522364164521027,190
polyQuartile,f-c-med-nir-pro,0.699047619047619,143,0.726984126984127,184
polyQuartile,f-c-med-nir-who,0.7212250712250712,144,0.6632297332297332,186
polyQuartile,f-c-med-vis-pro,0.8042568542568542,144,0.7547418967587035,190
polyQuartile,f-c-med-vis-who,0.6564811650337966,144,0.6859802043422732,190
polyQuartile,f-max,0.7571428571428571,111,0.7743642414230649,179
polyQuartile,f-max-nir-pro,0.7565656565656566,110,0.6755699855699856,173
polyQuartile,f-max-nir-who,0.7845502645502646,111,0.6734948482316904,175
polyQuartile,f-max-soil,0.7356928256928257,111,0.7783022533022533,179
polyQuartile,f-max-soil-nir-pro,0.8352758352758353,110,0.7125490196078431,173
polyQuartile,f-max-soil-nir-who,0.7477825745682889,111,0.7157218442932729,175
polyQuartile,f-max-soil-vis-pro,0.8491946088099934,111,0.766441609073188,179
polyQuartile,f-max-soil-vis-who,0.6479875283446712,111,0.7103174603174603,179
polyQuartile,f-max-vis-pro,0.8407003620161515,111,0.7965747845031732,179
polyQuartile,f-max-vis-who,0.7473462435000897,111,0.7295117845117846,179
proteinsQuartile,c-min,0.6006349206349206,145,0.7432671957671958,219
proteinsQuartile,c-min-nir-who,0.5179533429533429,145,0.7322354497354497,214
proteinsQuartile,c-min-vis-who,0.5559446000622471,145,0.6212610229276896,219
proteinsQuartile,c-no-nir-who,0.4593455567049335,464,0.6921552028218695,229
proteinsQuartile,c-no-vis-who,0.5277739599370034,467,0.6199287910157475,234
proteinsQuartile,f-c-med,0.5681002529216815,145,0.6869488536155203,194
proteinsQuartile,f-c-med-nir-pro,0.5986416361416361,144,0.7404991304991305,187
proteinsQuartile,f-c-med-nir-who,0.4974498715570144,145,0.6205026455026454,189
proteinsQuartile,f-c-med-vis-pro,0.5402534113060429,145,0.6738952745849297,194
proteinsQuartile,f-c-med-vis-who,0.5168986568986569,145,0.6456613756613756,194
proteinsQuartile,f-max,0.5701715468796215,112,0.6696296296296296,183
proteinsQuartile,f-max-nir-pro,0.5342657342657342,111,0.705508721298195,176
proteinsQuartile,f-max-nir-who,0.5280677655677656,112,0.6848148148148148,178
proteinsQuartile,f-max-soil,0.5720826792255364,112,0.6979012345679012,183
proteinsQuartile,f-max-soil-nir-pro,0.46572712418300655,111,0.7400809212573919,176
proteinsQuartile,f-max-soil-nir-who,0.509817532894456,112,0.6189092389092389,178
proteinsQuartile,f-max-soil-vis-pro,0.519973544973545,112,0.6609259259259259,183
proteinsQuartile,f-max-soil-vis-who,0.5900226757369614,112,0.6755555555555556,183
proteinsQuartile,f-max-vis-pro,0.5814851814851815,112,0.6329100529100529,183
proteinsQuartile,f-max-vis-who,0.6165608465608465,112,0.6298148148148148,183
