crop,sample_size,antioxidants,polyphenols,density or length,moisture_content,brix,dry_weight_percentage,whole_crop_weight,volume,organic_carbon_content_0to10cm,organic_carbon_content_10to20cm
apple 2021,88,3179.353,61.918,0.926,0.846,13.518,3.765,NA,713.784,5.502,4.588
beet 2020,117,10108.615,124.716,1.001,0.879,10.691,1.845,86.767,83.889,5.284,4.53
beet 2021,77,8143.357,67.594,1.004,0.888,10.326,1.931,213.555,262.039,5.729,4.279
blueberry 2021,2,7252.665,134.118,1.011,0.878,11.45,3.269,NA,7.5,NA,NA
bok_choy_bok_choi_pak_choy 2020,47,2694.941,101.294,17.18,0.929,4.442,1.319,NA,NA,8.351,5.915
bok_choy_bok_choi_pak_choy 2021,9,3768.469,57.864,15.611,0.944,4.138,1.385,NA,0,6.711,5.581
butternut_squash 2021,29,170.402,13.992,NA,0.911,7.757,2.496,2070.493,0,5.05,4.13
carrot 2020,311,124.508,8.779,0.882,0.892,8.411,1.642,85.636,75.665,5.944,4.264
carrot 2021,119,210.128,12.441,1.013,0.887,10.162,2.438,NA,238.714,5.653,4.783
cherry_tomato 2021,2,1907.737,42.411,0.991,0.92,7.4,2.655,NA,100,NA,NA
grapes 2020,6,7414.874,300.344,NA,0.83,11.4,2.328,NA,2.16,4.4,3.403
grapes 2021,6,1292.846,104.596,1.135,0.793,19.6,4.911,NA,37.833,3.38,2.82
kale 2020,78,9161.453,364.011,22.047,0.872,8.786,1.706,NA,NA,5.897,3.942
kale 2021,64,9388.607,205.264,22.239,0.841,10.536,2.349,NA,0,6.042,4.323
leeks 2020,15,326.499,98.617,48.713,0.876,10.638,2.049,NA,NA,8.247,3.987
leeks 2021,3,607.677,35.031,41.033,0.887,8.8,2.125,NA,0,NA,NA
lettuce 2020,49,1740.86,67.197,14.792,0.945,3.651,1.247,NA,NA,6.129,5.323
lettuce 2021,82,1255.615,36.973,15.488,0.93,4.343,1.546,NA,0,5.894,4.108
mizuna 2020,11,11796.517,285.487,17.1,0.906,5.05,1.253,NA,NA,6.564,5.701
mizuna 2021,1,13458.516,177.335,9.6,0.885,NA,1.385,NA,0,7.13,3.76
mustard_greens 2020,19,16873.908,436.323,18.194,0.897,7.322,1.39,NA,NA,6.829,6.231
mustard_greens 2021,9,10481.352,165.423,27.367,0.889,8.889,1.657,NA,0,11.009,6.85
nectarine 2021,6,227.969,22.346,0.941,0.882,10.567,2.959,NA,445.333,NA,NA
oats 2020,123,3283.314,125.175,NA,0.104,NA,8.997,NA,NA,3.715,3.662
oats 2021,76,1974.179,41.247,NA,0.067,NA,16.505,NA,0,3.66,3.45
peach 2021,6,824.076,41.266,1.02,0.874,11.375,3.124,NA,324.167,NA,NA
pear 2021,27,887.592,39.055,0.996,0.841,13.556,3.752,NA,508.222,NA,NA
peppers 2020,90,6875.864,107.688,0.494,0.916,6.182,1.535,81.258,136.069,5.508,3.752
peppers 2021,82,7523.59,113.092,11.052,0.92,6.85,2.066,0,18674.037,6.693,5.422
potato 2020,112,101.548,46.856,0.979,0.814,5.023,2.68,134.457,81.91,4.928,4.25
potato 2021,105,201.368,40.306,1.174,0.788,6.674,4.304,191,420.562,5.942,5.331
roma tomato 2021,25,1652.838,23.05,1.036,0.926,5.533,2.111,NA,209.32,6.027,4.53
spinach 2020,41,506.853,260.476,11.888,0.902,7.417,1.416,NA,NA,5.662,4.161
spinach 2021,94,3940.009,88.422,15.08,0.887,7.693,1.671,NA,0,6.188,5.669
squash 2020,75,152.269,34.11,0.748,0.945,3.962,1.401,550.377,193.238,5.73,4.458
squash 2021,43,129.591,23.369,0.901,0.95,4.338,1.517,520,442.884,5.902,4.22
swiss_chard 2020,64,1112.116,231.363,21.517,0.901,6.672,1.473,NA,NA,5.17,3.725
swiss_chard 2021,72,3674.743,88.861,25.886,0.881,9.493,1.801,NA,0,7.731,7.278
tomato 2021,24,2092.093,27.195,1.03,0.934,5.496,2.175,382.2,374.292,NA,NA
wheat 2020,237,3231.517,103.501,NA,0.083,NA,15.823,NA,NA,3.293,2.833
wheat 2021,34,1984.431,45.083,NA,0.109,NA,16.333,NA,0,1.922,2.634
zucchini 2020,63,143.994,30.513,0.86,0.949,3.537,1.365,224.814,205.894,6.524,5.269
NA,85,NA,NA,21.2,1,NA,NA,NA,NA,6.266,4.816
NA,65,NA,NA,NA,NA,NA,6.599,NA,NA,NA,NA
