farm,crop,till,notill,conservation_till,beam,nobeam,none,antioxidants,polyphenols,density or length,moisture_content,brix,dry_weight_percentage,whole_crop_weight,volume,organic_carbon_content_0to10cm,organic_carbon_content_10to20cm
Full Belly,squash,FALSE,TRUE,FALSE,FALSE,FALSE,FALSE,119.13934889489241,16.80644749012019,0.9576333333333333,0.9397636676355456,5.416666666666667,1.3478333333333334,136.98833333333334,430,NA,NA
Full Belly,squash,TRUE,FALSE,FALSE,FALSE,FALSE,FALSE,174.2967629274126,20.559558532406506,0.9361666666666666,0.9393721461909974,4.983333333333333,1.3513333333333333,64.36833333333333,206.66666666666666,NA,NA
Full Belly,tomato,FALSE,TRUE,FALSE,FALSE,FALSE,FALSE,1139.5859730477034,27.708492261050882,0.96846,0.927741506065896,6,1.6605,114.105,365.8333333333333,NA,NA
Full Belly,tomato,TRUE,FALSE,FALSE,FALSE,FALSE,FALSE,875.0690196737636,25.667346641676293,0.9592333333333334,0.9260019391880582,6.366666666666667,1.7471666666666668,46.08166666666667,246.66666666666666,NA,NA
OVP,beet,FALSE,TRUE,FALSE,FALSE,TRUE,FALSE,5667.718746811435,52.3298031131828,0.8515040966357564,0.8854335436389944,10.175,1.6095833333333334,195.38333333333333,296.6666666666667,NA,NA
OVP,beet,FALSE,TRUE,FALSE,TRUE,FALSE,FALSE,7086.743672501409,61.05384132866833,0.9195073127128575,0.8879203003682012,10.454545454545455,1.604818181818182,180.04545454545453,221.8181818181818,NA,NA
OVP,beet,TRUE,FALSE,FALSE,FALSE,TRUE,FALSE,5767.28599387242,53.00732055144859,0.9573501748136548,0.8858584760770338,10.925,1.70725,240.7,260,NA,NA
OVP,beet,TRUE,FALSE,FALSE,TRUE,FALSE,FALSE,6851.608500954061,57.02694401299834,0.9639214593764669,0.8897430588242241,9.775,1.67425,235.3,243.33333333333334,NA,NA
OVP,spinach,FALSE,TRUE,FALSE,FALSE,TRUE,FALSE,3822.0969477715844,87.7227985868766,14.74375,0.8895113533781789,7.89375,1.6715,NA,0,NA,NA
OVP,spinach,FALSE,TRUE,FALSE,TRUE,FALSE,FALSE,3731.0848734962756,79.70159036691241,15.86875,0.8856389743101861,7.91875,1.744625,NA,0,NA,NA
OVP,spinach,TRUE,FALSE,FALSE,FALSE,TRUE,FALSE,4157.512818540832,89.10686540923892,18.8125,0.890011545021278,7.80625,1.596,NA,0,NA,NA
OVP,spinach,TRUE,FALSE,FALSE,TRUE,FALSE,FALSE,3845.622729111464,85.74956874569429,14.86875,0.8769033466124806,8.275,1.6915625,NA,0,NA,NA
OVP,swiss_chard,FALSE,TRUE,FALSE,FALSE,TRUE,FALSE,3085.942884284098,81.0346027953441,27.333333333333332,0.8829029556067007,9.858333333333333,1.7527777777777778,NA,0,NA,NA
OVP,swiss_chard,FALSE,TRUE,FALSE,TRUE,FALSE,FALSE,3015.662570029358,67.1653633723867,27.15,0.8659932872211753,9.925,1.925125,NA,0,NA,NA
OVP,swiss_chard,TRUE,FALSE,FALSE,FALSE,TRUE,FALSE,4116.82816067818,82.06394936068784,26.466666666666665,0.8915765696245137,9.591666666666667,1.6894444444444445,NA,0,NA,NA
OVP,swiss_chard,TRUE,FALSE,FALSE,TRUE,FALSE,FALSE,3927.4137952258816,85.30356655896203,26.991666666666667,0.8794602965713009,9.925,1.8131111111111111,NA,0,NA,NA
Park Farming,roma tomato,TRUE,FALSE,FALSE,FALSE,FALSE,FALSE,2553.262276876253,30.451220120375616,1.057475,0.9337790580755627,5.641666666666667,2.5991666666666666,104.69583333333334,333.3333333333333,NA,NA
San Juan Ranch,lettuce,FALSE,FALSE,FALSE,FALSE,TRUE,FALSE,527.2321449319373,32.086022627285864,15.966666666666667,0.9379648197144813,6.816666666666666,1.5266666666666668,NA,0,NA,NA
San Juan Ranch,lettuce,FALSE,FALSE,FALSE,TRUE,FALSE,FALSE,505.0444413676207,25.968392064257106,17.833333333333332,0.9374151712738117,5.416666666666667,1.6236666666666666,NA,0,NA,NA
San Juan Ranch,swiss_chard,FALSE,FALSE,FALSE,FALSE,TRUE,FALSE,3355.0436991715837,93.68181832821045,27,0.8877259997067719,8.116666666666667,1.8033333333333332,NA,0,NA,NA
San Juan Ranch,swiss_chard,FALSE,FALSE,FALSE,TRUE,FALSE,FALSE,3406.2600228685824,96.13768143775472,28.583333333333332,0.8848057005888407,8.983333333333333,1.8121666666666667,NA,0,NA,NA
Santa Ana Ranch,carrot,TRUE,FALSE,FALSE,FALSE,FALSE,FALSE,25.324623217391263,4.338825961364135,1.0235916666666667,0.8763578174471995,10.166666666666666,1.8513333333333333,65.08083333333333,191.25,NA,NA
Santa Ana Ranch,peppers,FALSE,FALSE,TRUE,FALSE,FALSE,FALSE,8366.480073565213,96.02991060780718,0.48736,0.9159571642125001,6.55,2.1498333333333335,223.45,917.5,NA,NA
Santa Ana Ranch,peppers,TRUE,FALSE,FALSE,FALSE,FALSE,FALSE,8246.874424388665,83.40519785973308,0.5474333333333333,0.9118436344771643,7.1,1.4803333333333333,277.7083333333333,941.6666666666666,NA,NA
Santa Ana Ranch,tomato,FALSE,FALSE,TRUE,FALSE,FALSE,FALSE,3100.7327772069266,20.415013401289478,1.2110333333333334,0.9370794987673345,4.95,3.1835,231.23333333333335,586.6666666666666,NA,NA
NA,butternut_squash,NA,NA,NA,NA,NA,TRUE,193.16604322905823,11.939085547707263,NA,0.9132659808607426,7.591304347826087,2.5629545454545455,1806.121739130435,0,NA,NA
NA,EGGPLANT,NA,NA,NA,NA,NA,TRUE,NA,NA,NA,NA,NA,NA,NA,0,NA,NA
