factor,family,N_soil10.loi.xrf.Na,N_soil10.loi.xrf.Mg,N_soil10.loi.xrf.Al,N_soil10.loi.xrf.Si,N_soil10.loi.xrf.P,N_soil10.loi.xrf.S,N_soil10.loi.xrf.K,N_soil10.loi.xrf.Ca,N_soil10.loi.xrf.Ti,N_soil10.loi.xrf.V,N_soil10.loi.xrf.Cr,N_soil10.loi.xrf.Mn,N_soil10.loi.xrf.Fe,N_soil10.loi.xrf.Co,N_soil10.loi.xrf.Ni,N_soil10.loi.xrf.Cu,N_soil10.loi.xrf.Zn,N_soil20.loi.xrf.Na,N_soil20.loi.xrf.Mg,N_soil20.loi.xrf.Al,N_soil20.loi.xrf.Si,N_soil20.loi.xrf.P,N_soil20.loi.xrf.S,N_soil20.loi.xrf.K,N_soil20.loi.xrf.Ca,N_soil20.loi.xrf.Ti,N_soil20.loi.xrf.V,N_soil20.loi.xrf.Cr,N_soil20.loi.xrf.Mn,N_soil20.loi.xrf.Fe,N_soil20.loi.xrf.Co,N_soil20.loi.xrf.Ni,N_soil20.loi.xrf.Cu,N_soil20.loi.xrf.Zn,p.value_soil10.loi.xrf.Na,p.value_soil10.loi.xrf.Mg,p.value_soil10.loi.xrf.Al,p.value_soil10.loi.xrf.Si,p.value_soil10.loi.xrf.P,p.value_soil10.loi.xrf.S,p.value_soil10.loi.xrf.K,p.value_soil10.loi.xrf.Ca,p.value_soil10.loi.xrf.Ti,p.value_soil10.loi.xrf.V,p.value_soil10.loi.xrf.Cr,p.value_soil10.loi.xrf.Mn,p.value_soil10.loi.xrf.Fe,p.value_soil10.loi.xrf.Co,p.value_soil10.loi.xrf.Ni,p.value_soil10.loi.xrf.Cu,p.value_soil10.loi.xrf.Zn,p.value_soil20.loi.xrf.Na,p.value_soil20.loi.xrf.Mg,p.value_soil20.loi.xrf.Al,p.value_soil20.loi.xrf.Si,p.value_soil20.loi.xrf.P,p.value_soil20.loi.xrf.S,p.value_soil20.loi.xrf.K,p.value_soil20.loi.xrf.Ca,p.value_soil20.loi.xrf.Ti,p.value_soil20.loi.xrf.V,p.value_soil20.loi.xrf.Cr,p.value_soil20.loi.xrf.Mn,p.value_soil20.loi.xrf.Fe,p.value_soil20.loi.xrf.Co,p.value_soil20.loi.xrf.Ni,p.value_soil20.loi.xrf.Cu,p.value_soil20.loi.xrf.Zn,intervalMin_soil10.loi.xrf.Na,intervalMin_soil10.loi.xrf.Mg,intervalMin_soil10.loi.xrf.Al,intervalMin_soil10.loi.xrf.Si,intervalMin_soil10.loi.xrf.P,intervalMin_soil10.loi.xrf.S,intervalMin_soil10.loi.xrf.K,intervalMin_soil10.loi.xrf.Ca,intervalMin_soil10.loi.xrf.Ti,intervalMin_soil10.loi.xrf.V,intervalMin_soil10.loi.xrf.Cr,intervalMin_soil10.loi.xrf.Mn,intervalMin_soil10.loi.xrf.Fe,intervalMin_soil10.loi.xrf.Co,intervalMin_soil10.loi.xrf.Ni,intervalMin_soil10.loi.xrf.Cu,intervalMin_soil10.loi.xrf.Zn,intervalMin_soil20.loi.xrf.Na,intervalMin_soil20.loi.xrf.Mg,intervalMin_soil20.loi.xrf.Al,intervalMin_soil20.loi.xrf.Si,intervalMin_soil20.loi.xrf.P,intervalMin_soil20.loi.xrf.S,intervalMin_soil20.loi.xrf.K,intervalMin_soil20.loi.xrf.Ca,intervalMin_soil20.loi.xrf.Ti,intervalMin_soil20.loi.xrf.V,intervalMin_soil20.loi.xrf.Cr,intervalMin_soil20.loi.xrf.Mn,intervalMin_soil20.loi.xrf.Fe,intervalMin_soil20.loi.xrf.Co,intervalMin_soil20.loi.xrf.Ni,intervalMin_soil20.loi.xrf.Cu,intervalMin_soil20.loi.xrf.Zn,intervalMax_soil10.loi.xrf.Na,intervalMax_soil10.loi.xrf.Mg,intervalMax_soil10.loi.xrf.Al,intervalMax_soil10.loi.xrf.Si,intervalMax_soil10.loi.xrf.P,intervalMax_soil10.loi.xrf.S,intervalMax_soil10.loi.xrf.K,intervalMax_soil10.loi.xrf.Ca,intervalMax_soil10.loi.xrf.Ti,intervalMax_soil10.loi.xrf.V,intervalMax_soil10.loi.xrf.Cr,intervalMax_soil10.loi.xrf.Mn,intervalMax_soil10.loi.xrf.Fe,intervalMax_soil10.loi.xrf.Co,intervalMax_soil10.loi.xrf.Ni,intervalMax_soil10.loi.xrf.Cu,intervalMax_soil10.loi.xrf.Zn,intervalMax_soil20.loi.xrf.Na,intervalMax_soil20.loi.xrf.Mg,intervalMax_soil20.loi.xrf.Al,intervalMax_soil20.loi.xrf.Si,intervalMax_soil20.loi.xrf.P,intervalMax_soil20.loi.xrf.S,intervalMax_soil20.loi.xrf.K,intervalMax_soil20.loi.xrf.Ca,intervalMax_soil20.loi.xrf.Ti,intervalMax_soil20.loi.xrf.V,intervalMax_soil20.loi.xrf.Cr,intervalMax_soil20.loi.xrf.Mn,intervalMax_soil20.loi.xrf.Fe,intervalMax_soil20.loi.xrf.Co,intervalMax_soil20.loi.xrf.Ni,intervalMax_soil20.loi.xrf.Cu,intervalMax_soil20.loi.xrf.Zn
alfalfa_meal,amendments,55,55,55,55,55,55,55,55,55,55,NA,55,55,55,55,55,55,70,70,70,70,70,70,70,70,70,70,70,70,70,70,70,70,70,0.0026821755377859423,0.015560674959267773,0.03668556731399344,0.8750568898558047,4.0651291811490505e-4,0.019994185284738692,0.4085856805074783,0.12719549493267268,0.33063581443300705,0.8011730954624464,NA,0.2045192860572919,8.612704589051161e-4,0.14267423509695423,0.3077190624394412,0.012407485107932553,0.2499248738916153,6.61766994424348e-5,0.5621526233705687,7.948645993974011e-4,0.37271885762122914,0.0018285304076428284,0.750832837149059,0.001920363514740751,0.8449920992475857,0.23442402167622803,0.618455792550644,0.2209058044721021,0.6444015598813655,0.0013183327317203624,0.5247958670632586,0.022865867547613175,0.15368871572262388,0.37744815423754613,-0.1,-0.1,-0.9,-2.9,-0.1,0.2,0.2,-0.1,-0,-93.8,NA,-41.6,-0,0.1,-23.3,-41.6,-45.9,-0,-0.1,-0.8,-2.3,-0.1,0.1,0.3,-0.2,-0,-80.7,-14.4,-76.6,0.1,0.2,-28.3,-31.9,-30.9,-0,-0,-0.2,-0.9,-0,0.8,0.4,0.2,0,0.2,NA,104.2,0.4,2.8,-9.7,-19.6,-14.3,-0,0,-0.1,-0.5,-0,0.6,0.5,0,0,12.6,-1.7,68.5,0.5,3,-14.7,-13.5,-7.3
all_purpose,amendments,20,20,20,20,20,20,20,20,20,NA,20,20,20,20,20,20,20,21,21,21,21,21,21,21,21,21,21,21,21,21,21,21,21,21,0.038663832446667476,0.6253184680763402,0.07093612085528715,0.3971060226104088,0.39065268313691554,0.21617135158511788,0.6155505408498081,0.7252079059398953,0.2719489727018165,NA,0.8027771431184811,0.13302702824585727,0.179634777831236,0.46186379535403904,0.1816235508981481,0.5590458517177622,0.5943738172749984,0.07159454852722368,0.33890326170458274,0.2211555878514287,0.10948868807732365,0.900478060179662,0.3913575749294438,0.2707966851140087,0.2051939039746168,0.043985266076754855,0.625168654327281,0.452517654403262,0.23717338990802073,0.2492732668349753,0.7523764464529958,0.21506211460601923,0.733466555124094,0.7799659993267732,-0.1,-0.1,-0.3,-1.7,-0.1,0,0.2,-0.1,-0.1,NA,-7.5,-11.8,0,-0,-35.8,-34.3,-17.4,-0.1,-0.1,-0.5,-1.9,-0.1,0.1,0.2,-0,-0.1,-130.1,-9.4,-5.7,0,-0.1,-32.2,-34.7,-14.4,-0,0,0.7,1,-0,0.9,0.5,0.4,0,NA,13.6,220.1,0.7,4.2,-8,-2.3,20.7,-0,0,0.5,0.9,-0.1,1,0.5,0.4,-0,34.9,10.7,237.4,0.7,4.8,-6.9,-4.3,25.5
azomite,amendments,9,NA,9,9,9,9,9,9,9,9,9,9,9,9,9,9,9,8,NA,8,8,8,8,8,8,8,8,NA,8,8,8,8,8,8,0.10036236777221287,NA,0.12844459637341293,0.2314501711375097,0.10079397212184635,0.5865681420507185,0.8232252763464893,0.3069005793309228,0.09663026870081624,0.27555528582666017,0.7525757091696295,0.5805898372405478,0.18550478226735126,0.7100788482223053,0.31188826032610606,0.8841124638382751,0.7457237016275405,0.17962238564990166,NA,0.569554670841377,0.5361237623806135,0.5106135309313349,0.5556899860082201,0.58391374899291,0.8992100687720959,0.1724246515156402,0.6169539930888088,NA,0.3846725847756723,0.3969983676659818,0.4863312362228763,0.8401789037123671,0.71456659905003,0.7436740940207016,-0.1,NA,-1.1,-4.6,-0.1,-0.2,-0,0.3,-0.1,-81.3,-13.3,-113.8,-0.3,-3.4,-31.9,-31.9,-10.1,-0.1,NA,-0.7,-2.6,-0.1,-0.5,0,0.1,-0.1,-101.1,NA,-98.1,-0.2,-3.2,-38.4,-23.1,16.4,0,NA,0.8,0.5,0,1,0.3,0.9,-0,114.6,16.7,240.3,0.7,3.8,4.8,13,41.1,0,NA,1.1,2.7,-0,0.8,0.4,0.6,0,156.8,NA,312,0.9,4.5,-8.9,27.4,74.5
blood_meal,amendments,17,17,17,17,17,17,17,17,17,17,17,17,17,17,17,17,17,17,17,17,17,17,17,17,NA,17,17,17,17,17,17,17,17,17,0.2756601888077848,0.11630606403850227,0.0846324703433779,0.7312368441607302,0.30084061010039537,0.21923321889474548,0.6739232739510678,0.8618567002622314,0.6325461629386039,0.969413526573109,0.7147442787417644,0.7846212174102226,0.07082997927813195,0.8537135011696853,0.22852653943514742,0.8199448263169415,0.4978017115666418,0.16148180685817126,0.6486629529910012,0.24100781920680267,0.8384489056327517,0.7298641447590895,0.9357240627054034,0.032435135481554696,NA,0.11230732623544246,0.9234240071280442,0.8767936818451483,0.36566265534847814,0.010719486309970874,0.20750219217957058,0.43823524676051967,0.9135796369675361,0.823944059016953,-0.1,-0.3,-1.1,-0.5,-0.1,1,-0,-0.5,-0,-297,-3.9,105.9,-0.5,0.8,-11.4,-93.7,-93.2,-0.1,-0.3,-1.5,-0.8,-0.1,0.7,0,NA,-0.1,-233.9,-8,17.4,-0.5,-0.9,-10.1,-74.1,-64.8,0,-0.2,0.1,2.7,-0,1.9,0.3,-0,0.1,-155.5,17.2,355.1,0.2,5.5,9.3,-59,-47.7,-0,-0.2,-0.2,2.8,-0.1,1.5,0.4,NA,0,-66.4,14.7,282.9,0.2,4.5,12.6,-40.8,-25.7
boron,amendments,18,18,18,18,18,18,18,18,18,18,18,18,18,18,18,18,18,15,15,15,15,15,15,15,15,15,15,15,15,15,15,15,15,15,0.3346885451369193,0.014274876420916922,0.12957461113500682,0.05687558827362445,0.07377231133749369,0.3149061091057873,0.48488421503672446,0.08350378253914456,0.29966614162428273,0.950735919557525,0.3163472937579897,0.07433139146695379,0.4238621723771265,0.34144120320514165,0.2764501548005032,0.7328105296499954,0.9387568976412455,0.007687176034254246,0.04114927080766377,0.3915736587064782,0.09136208275390659,0.03258798027461119,0.16774077978100443,0.3185719210122476,0.6163756671467773,0.6058334879186207,0.19372730223211423,0.637468483162895,0.03212090317036331,0.9137062260850812,0.1495739911919717,0.0887069737494877,0.5538875577444882,0.4729987953102142,-0,-0.2,-2.6,-3.7,-0.1,0.3,-0.3,-0.5,0.1,-303.3,-68.7,-251.9,-1.5,-5.3,15.6,-60.7,-68.2,0,-0.2,-2.5,-1.7,-0.1,0.1,-0.4,-0.8,0.2,-461.4,-68.7,-249.7,-1.5,-4.8,23.5,-72.4,-91.3,0.1,-0,-1,2.1,-0,1.1,0.2,-0,0.2,-119.7,-43.6,52.1,-0.8,-0.5,36.5,-24.7,-38.1,0.2,-0,-0.6,4.6,0,1.4,0.1,-0.3,0.3,-174.9,-40.7,130.7,-0.7,2.3,51.3,-18.6,-42.4
calcium,amendments,17,17,17,17,17,17,17,17,17,17,17,17,17,17,17,17,16,16,16,16,16,16,16,16,NA,16,16,16,16,16,NA,16,16,16,0.28778631175616876,0.27253707813029315,0.2773755900565344,0.11199048084288744,0.6046053141010833,0.06685991860316447,0.2615143458018865,0.7407370076602751,0.7219149438906668,0.39936890578527817,0.4748146436029245,0.3144570499654066,0.9641879453375957,0.976568961906716,0.06923988794437473,0.5885808195647853,0.5756454327795746,0.0014417803747297053,0.5254486807685357,0.2298332217227047,0.08250553673187475,0.32432405340776144,0.7134547637779813,0.6119121262468896,NA,0.11049167798322747,0.45943641168893934,0.5799669839459485,0.16188059023651502,0.7110243782103185,NA,0.08027812859227955,0.5926235244058911,0.8359027711036691,-0.1,-0.2,-2.3,1.8,-0.1,-0.2,-0.8,-0.4,-0.1,-97.5,-2,-192.4,-1.6,-6.7,21.3,-44.4,-91.8,-0,-0.3,-2,2.2,-0.2,0.3,-0.9,NA,-0.1,-208.6,5.1,-60.1,-1.4,NA,29.9,-60.7,-97,0,-0,-1.3,8.3,-0,0.7,-0.6,0.1,0,46.9,21,108.2,-0.8,-1.9,52.8,-12.2,-51.4,0,-0.1,-0.9,8.3,-0.1,1.1,-0.6,NA,0.1,-34.3,30.5,264.3,-0.6,NA,73.7,-25.3,-49.7
compost,amendments,20,20,20,20,20,20,NA,20,NA,20,20,20,20,20,20,20,20,20,20,20,20,20,20,20,20,20,20,20,20,20,20,20,20,20,0.08262601852287431,0.12198354625759135,0.1146132088604923,0.6602790822929883,0.12852821962339042,0.20016922975099088,NA,0.07602331877117274,NA,0.6440762564236533,0.46324490381943045,0.8553844233271976,0.9778463416108909,0.8085778467178597,0.4518927353314099,0.3709129285658835,0.9491684768311814,0.5996367650329706,0.5354573361646241,0.4017848673621217,0.2924538217825957,0.5199275953141939,0.13064818853232027,0.363575600721741,0.211348981077509,7.286678215224466e-4,0.5129228755767263,0.4546632852233682,0.8329104853954461,0.6001789340038958,0.5709586549223529,0.29575065556801955,0.26011179049528144,0.28214137380883264,0,0.1,0,1,0.1,-1.4,NA,-0.3,NA,49.1,-13.6,-244.7,-0.7,-6.1,1.8,30.4,41.8,-0,0.1,-0.1,0.1,0,-1.4,-0.1,-0.2,-0,59.9,-20.7,-285.9,-0.8,-7,-5.1,34.2,55.6,0.1,0.2,1,3.8,0.2,-0.5,NA,0.1,NA,171.8,7.9,-3,-0.1,-2.2,19.7,61.2,70.2,0.1,0.3,0.9,3.7,0.1,-0.5,0.2,0.2,0.1,205,3,-21,-0.1,-2,15.1,66.2,110.4
compost_tea,amendments,17,17,17,17,17,17,17,17,17,17,17,17,17,17,17,17,16,16,16,16,16,16,16,16,NA,16,16,16,16,16,NA,16,16,16,0.28778631175616876,0.27253707813029315,0.2773755900565344,0.11199048084288744,0.6046053141010833,0.06685991860316447,0.2615143458018865,0.7407370076602751,0.7219149438906668,0.39936890578527817,0.4748146436029245,0.3144570499654066,0.9641879453375957,0.976568961906716,0.06923988794437473,0.5885808195647853,0.5756454327795746,0.0014417803747297053,0.5254486807685357,0.2298332217227047,0.08250553673187475,0.32432405340776144,0.7134547637779813,0.6119121262468896,NA,0.11049167798322747,0.45943641168893934,0.5799669839459485,0.16188059023651502,0.7110243782103185,NA,0.08027812859227955,0.5926235244058911,0.8359027711036691,-0.1,-0.2,-2.3,1.8,-0.1,-0.2,-0.8,-0.4,-0.1,-97.5,-2,-192.4,-1.6,-6.7,21.3,-44.4,-91.8,-0,-0.3,-2,2.2,-0.2,0.3,-0.9,NA,-0.1,-208.6,5.1,-60.1,-1.4,NA,29.9,-60.7,-97,0,-0,-1.3,8.3,-0,0.7,-0.6,0.1,0,46.9,21,108.2,-0.8,-1.9,52.8,-12.2,-51.4,0,-0.1,-0.9,8.3,-0.1,1.1,-0.6,NA,0.1,-34.3,30.5,264.3,-0.6,NA,73.7,-25.3,-49.7
compost_with_chicken_manure_and_peatmoss,amendments,14,14,14,14,14,14,14,14,14,14,14,14,NA,14,14,14,14,16,16,16,16,16,16,16,16,16,16,NA,16,16,16,16,16,NA,0.09098186706146064,0.08812968139177904,0.49935005223734197,0.3764293309806526,0.586165838725809,0.7487820366689248,0.38940770382087525,0.6911524847745352,0.40820218655960944,0.832207089087465,0.5017866280167239,0.6776813920747025,NA,0.840652750980603,0.8463006525039987,0.7972163868829047,0.7930433703071438,0.3898903742253796,0.7667673245962836,0.46124691074300295,0.5217610332977185,0.7031251623574057,0.6826649494284958,0.4740115605105433,0.6976256865301651,0.02047301698114127,0.5882073103141066,NA,0.5539708513316537,0.573193424899334,0.6262114598755412,0.896913598787999,0.8559396885775228,NA,-0.1,-0,-1.9,-7,-0.2,-0.3,0.1,-0,-0.1,-10.7,-10.2,-236.1,NA,-3.7,-28.8,-28.6,-33.8,-0.1,-0.1,-0.1,-0.5,-0.1,-0.2,0.2,0.1,-0.1,-78.5,NA,2.3,-0,-2.2,-34.9,-23.8,NA,-0.1,0.1,0,-0.3,-0.1,0.5,0.4,0.4,-0,139.7,14.4,70.9,NA,1.9,12.1,4.7,6.4,-0,0.1,1.1,3.1,-0.1,0.6,0.5,0.5,-0,105.3,NA,300.8,0.8,3.3,-11.9,10.3,NA
copper_sulfate,amendments,20,20,20,20,20,20,20,20,20,20,20,20,20,20,20,20,20,20,20,20,20,20,20,20,20,20,20,20,20,20,20,20,20,20,0.5535594534120853,0.10160560439565271,0.34871789668021097,0.25645143867681103,0.39562723002182854,0.329644822059858,0.24701994765766264,0.6111073252318913,0.07527093625971902,0.3073658241843592,0.052893997870000695,0.07684801763020417,0.22376630765160513,0.7544594239138254,0.9688898428386976,0.8348359166757778,0.38224697371605876,0.12483915584029476,0.05037666355822963,0.1705975035333997,0.11887254386120384,0.1621260670118204,0.5659977239494619,0.3920128722472008,0.7850890201749031,0.0069925990919486695,0.8002514344874357,0.26101779907582956,0.037026773316705425,0.5411150097094648,0.11196070664554807,0.4259563706168417,0.8229131098437241,0.3955567868487264,-0,-0.1,-2.4,-2.7,-0.1,0,0.1,-0.3,0,-172.7,-62.5,-247.9,-1.2,-5.4,10.7,-34.1,-59.7,-0,-0.2,-2.5,-1.1,-0.1,-0,0.1,-0.4,0.1,-244.2,-62.8,-248.3,-1.3,-5.7,16.3,-39.4,-47,0,0,-1,2.7,-0,0.8,0.5,0.1,0.1,-36.3,-33.2,-5.6,-0.5,-1.2,28.8,0.8,-18.3,0.1,-0,-1.2,4,-0,0.8,0.6,-0,0.2,-77.2,-32.9,29.2,-0.6,0,38.4,-6.1,-10.3
donald_stoner_compost,amendments,7,7,NA,7,7,7,7,7,7,7,7,7,7,7,7,7,7,13,13,13,13,13,13,13,13,13,13,13,13,13,13,13,13,13,0.7016482362476958,0.35061284029645695,NA,0.6737047769391198,0.15795048380885127,0.6118992236988063,0.7289259088173493,0.8885601560121815,0.4888336599399964,0.8222559402161717,0.41941315342260943,0.5626294384549324,0.7432492566815864,0.6513627801377193,0.5454342728442731,0.9478014785792634,0.7766448446058161,0.6146834301347986,0.18204853103464794,0.16127459158017088,0.05702820831956513,0.03611299895594788,0.8538325466233769,0.9260161023309007,0.9509651042495797,0.011537709840675661,0.6347232400777574,0.6519399754101889,0.5928588093178397,0.11886427285912646,0.31515038771996406,0.7299460262192121,0.7861196116573641,0.7020440333214903,0,-0.7,NA,-3.8,-0.1,2.7,0.8,-1.1,0.1,-880.4,-44.2,222.1,-0.6,5.7,-0.7,-202.7,-211.5,0,-0.7,-0.5,1.1,-0.1,2.4,0.9,-0.8,0.1,-833.7,-43.5,261.1,-0.4,6.7,16.8,-180.3,-169.9,0.2,-0.5,NA,4.1,0,4,1.1,-0.4,0.3,-604.3,-9.1,635.9,0.4,13.6,26.9,-143.6,-136,0.2,-0.5,1,5.7,0,3.4,1.1,-0.4,0.3,-626.5,-16.7,602.4,0.5,13.2,38.3,-131.7,-116.8
down_to_earth,amendments,17,NA,17,17,17,17,17,17,17,17,17,17,17,17,17,NA,17,18,18,18,18,18,NA,18,18,18,NA,NA,18,18,18,18,18,NA,0.13233699896537401,NA,0.317044951973215,0.666036064126243,0.10918635625249794,0.7329324301219009,0.7888447772123625,0.4721581942207079,0.10281273201597954,0.38940490220296325,0.8262931148736296,0.458338177397471,0.5934122296437931,0.41272145036300406,0.7238981899585963,NA,0.8123419991072415,0.08702399347453055,0.75169436697121506,0.8524736327781871,0.5067767048451073,0.6400341313123044,NA,0.04695807447577936,0.84872611234398,0.01606522749629292,NA,NA,0.4825400587854365,0.617592566962651,0.7823720725920724,0.2685529047516786,0.863156671309484,NA,-0.1,NA,0,-0.9,-0.1,-0.1,0.2,0.1,-0.1,-81.6,-0.8,36.5,0.1,-0.6,-42.6,NA,-3,-0.1,-0.1,-0.1,-1.1,-0.1,NA,0.2,0.1,-0.1,NA,NA,23.7,0.1,-0.8,-37.8,-27.2,NA,0,NA,1.2,2.1,-0,0.6,0.4,0.5,0,51.7,21.4,295.7,0.9,4.2,-19.5,NA,31.5,0,0,1,2.2,-0.1,NA,0.4,0.5,-0,NA,NA,307.8,0.9,4.5,-16.1,4.9,NA
feather_meal,amendments,46,46,46,46,46,46,46,46,46,46,46,46,46,46,46,46,46,45,45,45,45,45,45,45,45,45,45,45,45,45,NA,45,45,45,0.2600532306227495,3.9883991078226e-4,0.004072181290798966,0.008964791003029127,0.0024348051236483146,0.233762273864755,0.3461748833048381,0.2082195785022088,0.6305749825773708,0.29347840875546716,0.7430581198239605,0.5718485546984529,0.5884833629472436,0.4315967227163754,0.22894471877223643,0.6861506380683762,0.37230078225066404,0.0011375810178597728,0.006523885129582937,0.021772080437440677,0.10952873133960327,0.026580617159214524,0.6054674459555085,0.7728860870599006,0.5659581603448689,0.03913877405417173,0.24961844688524784,0.7946471149029272,0.06671599205293581,0.7064210378070954,NA,0.9167112114907796,0.8722380690644995,0.5233745344811359,-0,-0.2,-1.7,-1.3,-0.1,0.3,-0.3,-0.5,0.1,-224.8,-45.6,-111.2,-1.1,-3.4,15.3,-46.9,-59.2,0,-0.1,-1,-0.5,-0.1,0.1,-0.3,-0.6,0.1,-216.8,-44.1,-159.6,-0.9,NA,10.8,-36.4,-50,0,-0.1,-0.5,2.3,-0,0.9,0.1,-0.2,0.1,-121.2,-27.3,63.7,-0.7,-0.1,30.5,-19.3,-31.4,0.1,-0,0.4,2.7,-0,0.7,0,-0.3,0.2,-99.9,-24.7,29.2,-0.4,NA,26.3,-8.6,-20.7
fish_emulsion,amendments,23,23,23,23,23,23,23,23,23,23,23,23,23,23,23,23,23,23,23,23,23,23,23,23,23,23,23,23,23,23,23,23,23,23,0.006439653850127045,0.12407449188996811,0.17280119395577123,0.010907058912306611,0.858346343796625,0.8254791335355475,0.0501532556447905,0.0034990318648867318,8.757873613364647e-4,0.3382951417616975,0.026239820056013153,0.43762314379816636,0.05330952239186081,0.2772170638504687,0.3397031112975673,0.2382723454296642,0.7510005630015776,0.0067551009466942,0.19053866234719846,0.7025260666892659,0.059049378959559896,0.4421418407945624,0.2300890444903961,0.016339885548498457,0.24828937635882103,0.0037885251721897144,0.1510852271248873,0.12393837728844705,0.7579150078628475,0.08892055701677293,0.21884842574944047,0.39952447936503627,0.1998666528527576,0.4514588961263212,-0.1,-0.4,-2.4,-7.5,-0.1,1.9,0,-0.5,-0.1,-329.2,-31.9,40.4,-1,-2.3,-5.1,-130.1,-133.9,-0.1,-0.2,-2.3,-3.5,-0.1,0.2,0.1,-0.6,-0,-302.6,-35.1,-238.7,-1.1,-3.3,32.5,-86.8,-112,-0,-0.2,-1.5,-2.5,-0.1,2.8,0.8,0.1,0,-162.1,-8.1,338.5,-0.4,2.7,20.4,-90.7,-87.7,0,-0.1,-1.3,3,-0.1,1.6,0.8,-0.3,0.1,-66.4,-7.2,0.4,-0.4,1.7,51.1,-20.3,-51.7
fish_seaweed,amendments,17,17,17,17,17,17,17,17,17,17,17,17,17,17,17,17,16,16,16,16,16,16,16,16,NA,16,16,16,16,16,NA,16,16,16,0.28778631175616876,0.27253707813029315,0.2773755900565344,0.11199048084288744,0.6046053141010833,0.06685991860316447,0.2615143458018865,0.7407370076602751,0.7219149438906668,0.39936890578527817,0.4748146436029245,0.3144570499654066,0.9641879453375957,0.976568961906716,0.06923988794437473,0.5885808195647853,0.5756454327795746,0.0014417803747297053,0.5254486807685357,0.2298332217227047,0.08250553673187475,0.32432405340776144,0.7134547637779813,0.6119121262468896,NA,0.11049167798322747,0.45943641168893934,0.5799669839459485,0.16188059023651502,0.7110243782103185,NA,0.08027812859227955,0.5926235244058911,0.8359027711036691,-0.1,-0.2,-2.3,1.8,-0.1,-0.2,-0.8,-0.4,-0.1,-97.5,-2,-192.4,-1.6,-6.7,21.3,-44.4,-91.8,-0,-0.3,-2,2.2,-0.2,0.3,-0.9,NA,-0.1,-208.6,5.1,-60.1,-1.4,NA,29.9,-60.7,-97,0,-0,-1.3,8.3,-0,0.7,-0.6,0.1,0,46.9,21,108.2,-0.8,-1.9,52.8,-12.2,-51.4,0,-0.1,-0.9,8.3,-0.1,1.1,-0.6,NA,0.1,-34.3,30.5,264.3,-0.6,NA,73.7,-25.3,-49.7
fishbone_meal,amendments,6,NA,NA,6,6,6,6,NA,6,6,6,6,6,6,6,6,6,6,6,NA,NA,6,NA,6,6,6,6,6,6,6,6,6,6,6,0.8106070700766276,NA,NA,0.8188588506048269,0.6051943007927983,0.8079816511466886,0.9256423342186277,NA,0.5846778868275323,0.797364885786388,0.8535508800022245,0.8775661471496858,0.9900272879231566,0.877562337726978,0.7738878627619897,0.8863277239564884,0.7866694088268342,0.20325442980951758,0.702423096091015,NA,NA,0.5684204711841656,NA,0.6652731305473543,0.8234519210208411,0.23673256272003673,0.8795228769919824,0.809399422694471,0.9380157395089317,0.5859888830383968,0.8961797195890812,0.9548035142426206,0.8649890549606424,0.9066182085766681,-0.1,NA,NA,-1.4,-0.1,-0.3,0.1,NA,-0.1,-139.9,-8.6,1.5,0.1,-1.2,-44,-29.8,0.6,-0.1,-0.1,NA,NA,-0.1,NA,0,0,-0.2,-150.3,-8.4,10.6,-0.1,-2,-44.1,-31.9,2,0.1,NA,NA,4.4,0,0.9,0.5,NA,0,85,27.8,402.3,1.3,6.7,-16.6,20.2,58,0,0.1,NA,NA,-0,NA,0.4,0.7,0,124.9,30,464.6,1.1,6.8,-12.5,24.7,67
green_sand,amendments,7,7,7,7,7,7,7,7,7,7,7,7,7,7,7,7,7,7,7,7,7,7,7,7,7,7,NA,NA,7,7,7,7,7,7,0.22758515885355393,0.17966171503534384,0.8927425366471617,0.8583767878947909,0.697995190793671,0.43106212194639204,0.8016186020660299,0.8703138567202424,0.028104713847587153,0.5800805738478989,0.8402771360246025,0.7531397975025592,0.9436763204034091,0.6578495760592414,0.9877096915678989,0.4526796535655273,0.531870045727422,0.36551237481583776,0.4906087535583002,0.9184080102375964,0.887534404417595,0.53215264250755,0.5371628778699298,0.7071578376117071,0.5206899251178803,0.5039905568203379,NA,NA,0.6892476920246979,0.9455391432417961,0.8339041462708519,0.9223045846642258,0.6982487752916644,0.8225075769115396,-0.1,-0.4,-3,-3.5,-0.1,1.5,-0.3,-0.6,-0,-407.9,-17.3,-63,-1.4,-2.3,5,-134.4,-145.2,-0.1,-0.3,-3.1,-3.4,-0.2,0.3,-0.3,-0.6,-0.1,NA,NA,-309.8,-1.5,-5.8,6.6,-77.3,-86.8,0,-0.2,-1.5,2,-0,2.8,-0,0.1,0.1,-184.6,15.9,324.6,-0.3,5,30.2,-81.4,-84.6,-0,-0.1,-1.6,2.4,-0.1,1.7,0,0.1,0,NA,NA,108.1,-0.3,2,35.8,-25.1,-29.9
gypsum,amendments,40,40,40,40,40,40,40,40,40,40,40,NA,40,40,40,40,40,39,39,39,39,39,39,39,39,39,39,39,39,39,39,39,39,39,0.003563461543057995,0.006712111026762568,0.44556051706731703,0.5679512692221822,0.15430131904680144,0.08191594858536651,0.49404621047124403,0.1392730109466922,0.8367061683466748,0.9572404447882027,0.6691065434604642,NA,0.9572151232778634,0.7512253398899715,0.7774372206904623,0.470930870170166,0.11849151749581815,0.5875451318381771,0.056314531308928335,0.24905624011444663,0.28078940781186434,0.5942217051217189,0.37773267734183863,0.3633898269243612,0.0837040853910182,0.810201490850393,0.9903898438289696,0.5802224429132493,0.40876172652734727,0.07465537868488088,0.44884857344333395,0.745020886916941,0.699914995631822,0.7328998744689652,-0,-0.1,-0.3,-0.3,-0.1,0.1,0.3,-0.5,-0,-123.1,-0.4,NA,0.2,1.5,0.9,-28.1,-25.1,-0,-0.1,0.1,1.3,-0.1,0.1,0.3,-0.4,-0,-145.8,4.5,30.5,0.2,2,-2.3,-29.2,-24.1,0,-0,0.4,2.6,-0,0.7,0.4,-0.2,0,-27.2,14.4,NA,0.7,4.6,15.3,-3.7,2.6,0,-0,0.8,3.8,-0.1,0.7,0.5,-0.1,0,-27.3,20.2,216.7,0.8,5.7,12.1,-5.3,1.6
kelp_meal,amendments,11,11,11,11,11,11,11,11,11,11,11,NA,11,11,11,11,11,11,11,11,11,NA,11,11,NA,11,11,11,11,11,11,11,11,11,0.5897589024203884,0.7109705810718203,0.16928078649765255,0.4651443277648368,0.44925019141276573,0.9276195311536864,0.23377344993561602,0.42676652964327,0.8380464797615716,0.5331148390179512,0.5685302178840241,NA,0.44334212295068404,0.6251075217192511,0.1990502917560461,0.301451923612501,0.41505464254605434,0.04787334646643548,0.4811890405688114,0.09301107001296036,0.22321497519435504,NA,0.3652893924308732,0.5866915412227492,NA,0.8134772711873335,0.7374293557656693,0.29668457410647725,0.40140354025292047,0.87443539668637,0.8327015342480837,0.2433600944630045,0.36290028639195626,0.41679915853379307,-0.1,-0.3,-2.1,-1.6,-0.1,0.7,-0.2,-0.4,-0.1,-294.1,-13.2,NA,-0.9,-1.4,14.3,-100.5,-107.4,-0.1,-0.3,-2.5,-1.3,NA,0.4,-0.2,NA,-0.1,-239.1,-14.6,-153.8,-1,-3.3,14.7,-70.8,-65.5,0,-0.1,-0.5,4.2,-0,1.9,0,0.1,0.1,-79.6,17,NA,-0.1,4.4,39.8,-6.4,13.5,0,-0.1,-0.5,4.8,NA,1.4,0.1,NA,0.1,-18.2,17.4,228.3,-0.1,4,43.6,-17.6,-2.7
manganese_sulfate,amendments,9,9,NA,9,9,9,NA,NA,9,NA,9,9,NA,9,9,9,9,9,9,9,9,9,NA,9,9,9,9,NA,9,9,NA,9,9,9,0.1719041595724113,0.6999542576221598,NA,0.9774634558221738,0.10079397212184635,0.7124404226677652,NA,NA,0.5038867885111642,NA,0.6521091016438296,0.7320791610628496,NA,0.8787595109643099,0.6734222669618201,0.42176458195095484,0.794086059467465,0.478156447221385,0.8819563572086584,0.559221908384854,0.9803067490688284,0.6344763560806015,NA,0.2598757011594515,0.5623483458559217,0.14811624908486964,0.39534174905619973,NA,0.6739799985184949,0.39805377319562846,NA,0.8560767378345546,0.6599296824094119,0.5550183864161682,0,-0.1,NA,3.8,-0.1,-0.5,NA,NA,-0.1,NA,-6.3,-19.7,NA,-2,31.5,7,21.6,-0.1,-0.1,-1.5,0.8,-0.1,NA,-0.1,-0.2,-0.1,-38.4,NA,-155.4,-0.8,NA,10.7,4.6,40,0.1,0.1,NA,8.1,0,0.6,NA,NA,0,NA,24.2,325.8,NA,3.9,56.7,51.7,72.5,0,0.1,0.1,5.8,-0,NA,0.2,0.3,0,198,NA,228.5,0.2,NA,38.8,53.2,109.8
nutrilive_vitality,amendments,17,17,17,17,17,17,17,17,17,17,17,17,17,17,17,17,16,16,16,16,16,16,16,16,NA,16,16,16,16,16,NA,16,16,16,0.28778631175616876,0.27253707813029315,0.2773755900565344,0.11199048084288744,0.6046053141010833,0.06685991860316447,0.2615143458018865,0.7407370076602751,0.7219149438906668,0.39936890578527817,0.4748146436029245,0.3144570499654066,0.9641879453375957,0.976568961906716,0.06923988794437473,0.5885808195647853,0.5756454327795746,0.0014417803747297053,0.5254486807685357,0.2298332217227047,0.08250553673187475,0.32432405340776144,0.7134547637779813,0.6119121262468896,NA,0.11049167798322747,0.45943641168893934,0.5799669839459485,0.16188059023651502,0.7110243782103185,NA,0.08027812859227955,0.5926235244058911,0.8359027711036691,-0.1,-0.2,-2.3,1.8,-0.1,-0.2,-0.8,-0.4,-0.1,-97.5,-2,-192.4,-1.6,-6.7,21.3,-44.4,-91.8,-0,-0.3,-2,2.2,-0.2,0.3,-0.9,NA,-0.1,-208.6,5.1,-60.1,-1.4,NA,29.9,-60.7,-97,0,-0,-1.3,8.3,-0,0.7,-0.6,0.1,0,46.9,21,108.2,-0.8,-1.9,52.8,-12.2,-51.4,0,-0.1,-0.9,8.3,-0.1,1.1,-0.6,NA,0.1,-34.3,30.5,264.3,-0.6,NA,73.7,-25.3,-49.7
nutrisprout,amendments,26,26,26,26,26,26,26,26,26,26,26,26,26,26,26,26,26,26,26,26,26,26,26,26,26,26,26,26,26,26,26,26,26,26,2.1836813269477674e-5,0.817955220655854,0.07002048303242928,0.17887693795334864,0.2587345220564664,0.645464507575849,0.553195651752421,0.6778893505781659,0.0012022678479452246,0.2023725288239657,0.8306342331670782,0.17595601824888932,0.5919302365363692,0.20797319269930398,0.2512671464568297,0.7961244897087657,0.8102904874186688,0.9260208355464563,0.026151240142501857,0.467966696214078,0.0851235417931204,0.042760925491225704,0.7196887734641239,0.007584293655201296,0.8124161366310663,4.314860078244725e-4,0.2790421058279873,0.7987852012606732,0.8720664315632028,0.313877179931247,0.979662155616477,0.5410763338655308,0.2593776855734236,0.2919409444266662,0.1,-0.3,-1.2,4.7,-0.1,0.6,-0.1,-0.8,0.1,-362.2,-16.1,79.5,-0.7,1.4,62.7,-70.1,-25.6,0.1,-0.2,-1.2,5.3,-0.1,0.4,-0,-0.7,0.1,-333.6,-18.8,43.1,-0.8,0.4,68,-64.2,-25.4,0.1,-0.2,-0.3,7.8,0,1.3,0.1,-0.5,0.2,-214.5,1.5,328.3,-0.1,5.5,83.6,-39.6,6.7,0.2,-0.1,-0.4,8.4,-0,1.2,0.2,-0.5,0.2,-180.8,-0.1,323.9,-0.1,4.8,88.4,-24.2,21.2
potash,amendments,14,14,14,14,14,14,14,14,14,14,14,14,14,14,14,NA,14,14,14,14,14,14,NA,14,14,14,14,14,14,14,14,14,14,14,0.09098186706146064,0.39313421417438227,0.841307307169308,0.7902539928374162,0.6674450430016865,0.6115357587807175,0.6646674540269575,0.9273422452994011,0.03140488372356752,0.8209704241822213,0.7923478455673261,0.9935258512118801,0.9066357055538807,0.8448850124315745,0.701591329482039,NA,0.84488920151293,0.0064719815865161056,0.2658634555299311,0.24915990082483275,0.30360521764730153,0.386176204686448,NA,0.8715912383144583,0.6340202862962997,0.014814002970729745,0.5482190243720221,0.9897490241419603,0.25929615819462676,0.6801848238122231,0.4387370546731861,0.3836998641256999,0.8458363089240111,0.3509403671321278,-0.1,-0,-1.8,-5.2,-0,-0.6,-0.1,0.1,-0.1,29.2,6.4,-334.2,-0.9,-6.6,-8,NA,-31.4,-0.2,-0,-1.9,-5,-0,NA,-0.1,0.2,-0.1,19.4,5.4,-361.8,-1,-7.5,4.5,-14.4,-31.2,-0.1,0.1,-0.7,-1.9,0.1,0.1,0.1,0.5,-0,170.9,31.9,-59.9,-0.1,-1.7,10.7,NA,3.6,-0.1,0.1,-0.5,0.9,0.1,NA,0.1,0.6,-0,197,32.1,-21.5,-0.1,-1.4,30.2,22,16.6
potassium_sulfate,amendments,86,86,86,86,86,86,86,86,86,86,86,86,86,86,86,86,86,84,84,NA,84,84,84,84,84,84,84,84,84,84,84,84,84,84,1.3083611819515368e-4,0.5085440604234477,0.7779015087594754,0.9263756428970399,0.00255637276948524,0.10674644007527667,0.46168839982150006,0.5221889253744201,2.005787396040497e-8,0.5874902597332337,0.07197420972394321,0.7303076191972901,0.0024555485327106357,0.10523871722122008,0.13222971876019796,0.1930982987907738,0.12402470163070442,0.0018846178893269798,0.7627151882233963,NA,0.7960282422233966,0.010630038213780198,0.4079946463597196,0.14498106251119622,0.9755240707097578,1.3739861666444233e-4,0.8390056254876956,0.02122413963025224,0.4090854978250316,0.09995675236277957,0.7955214961429686,0.09995210783056217,0.2290305430736723,0.319215278020524,0,-0,-0.4,2.5,-0.1,-0.1,0.2,-0.5,0,-103.8,-16.8,-87.9,-0.5,-1.7,15.8,-12.6,-22.6,0,-0,NA,2.4,-0.1,-0.2,0.1,-0.5,0,-100.7,-15.9,-75.8,-0.4,-1,13.3,-9.2,-11.4,0.1,0,0.2,4.4,-0,0.3,0.4,-0.3,0.1,-33.3,-3.2,41.4,-0.1,0.8,27.6,6.4,0.5,0.1,0,NA,4.3,-0,0.2,0.3,-0.3,0.1,-15.8,-1.2,62,0,1.8,24.9,12.5,14.2
pro_grow,amendments,5,5,5,5,5,5,5,5,5,5,NA,5,5,5,5,5,5,7,7,7,7,7,NA,7,7,7,7,7,7,7,7,7,7,7,0.2595533774789043,0.3611324047918934,0.38803193049541507,0.48197710872895533,0.6191633019586193,0.7353210721603365,0.5792880412735095,0.6975635691520725,0.991267868081185,0.8206152573955554,NA,0.7412197724000056,0.6887809260619451,0.9236168895645792,0.916370232706448,0.3115270368487568,0.5437091456701199,0.02155550658347985,0.846770115921651,0.09525678395295023,0.15444631739550324,0.1549945424838497,NA,0.3549709976209151,0.7872793386026087,0.2743705243569888,0.9513936382924186,0.5600631868696506,0.1916568785148995,0.5475898871254266,0.9145615958077138,0.41892394630007557,0.3975076299396883,0.44173038131700876,0.1,-0.3,-1.7,-9.2,0.4,0.2,-0.2,0.5,0.2,-435.2,NA,-55.9,0.5,7.3,-51.9,-77.6,-88.8,0,-0.2,-2.6,-10.5,0.3,NA,-0.4,0.4,0.2,-347.2,-15.6,-216.9,0.4,5,-49.8,-69.4,-86.7,0.2,-0,0.6,-0.8,0.8,1.6,0.1,1.3,0.4,-182.3,NA,449.5,1.8,16.1,-15.2,-13.2,-16.4,0.2,0.1,-0.2,-2.8,0.5,NA,0,1.1,0.3,-83,22.2,260.6,1.5,13,-7.6,-12.6,-2.1
proboost,amendments,18,18,18,18,18,18,18,18,18,18,18,18,18,18,18,18,NA,18,18,18,18,18,NA,18,18,18,18,18,18,18,18,18,18,18,0.031905600247834016,0.03455548825993353,0.12328912709690484,0.14962142553748561,0.05534336832250857,0.7717550951407219,0.5761739409478857,0.5945603231805459,0.0866896049703999,0.8054202026303633,0.5535277181277861,0.36695860667891245,0.445299916049628,0.41050722091109665,0.26406070212729493,0.7737085185386773,NA,0.009707215996681319,0.5067435212797984,0.019561597042436096,0.033728698515037056,0.04432954562977956,NA,0.8996417439072654,0.7309957010114263,0.01616039061312187,0.32451600678845427,0.4342113153269423,0.08993854885212832,0.4993593535486979,0.17238275912186188,0.6019566355215492,0.8114230052748272,0.20098364466212948,-0.1,-0,-1.3,-4.3,0,-0.6,-0.1,0,-0.1,3.8,9.1,-250.2,-0.7,-5.1,-3.7,-12.4,NA,-0.1,0,-1.2,-3.5,0,NA,-0.1,0.2,-0.1,1.7,11.8,-243.5,-0.7,-5.8,8,-11.3,-21.3,-0,0.1,0,0.9,0.1,0.1,0.1,0.5,-0,130.8,31.9,-1.3,0,-0.4,15.7,17.5,NA,-0,0.1,0.3,2.1,0.1,NA,0.1,0.5,-0,158.7,36,31.7,-0.1,-0.2,28.4,21.1,23.6
progro,amendments,10,10,10,10,10,10,NA,10,10,10,10,10,10,10,10,10,NA,10,10,10,10,10,NA,10,NA,10,10,10,10,10,NA,10,NA,10,0.8776714597295443,0.734389269837102,0.0828523292638144,0.12752311471304814,0.7454170123626938,0.7920871446289117,NA,0.7541551339563239,0.8558109625234852,0.6598404080818614,0.9155680671033936,0.27895763724760425,0.8706085403734796,0.6169920633816632,0.6644994430597171,0.85806489802114,NA,0.2817127962447471,0.7704490052605342,0.9967526014279294,0.9683549655976408,0.7961646177031567,NA,0.5030033554399431,NA,0.12853527120958458,0.8467512520842797,0.7294603528567156,0.8988231787797691,0.5805109810234937,NA,0.538291142696115,NA,0.7711163049565761,-0,-0.1,-0.7,-3.1,-0.1,-0.6,NA,-0.3,-0.1,-71.2,13.7,-202.7,-0.4,-3.1,6.3,-14.4,NA,0,0,0.3,2.2,0,NA,-0,NA,-0.1,-131.8,26.5,26.1,-0.3,NA,25.2,NA,14.5,0.1,0.1,0.9,3.7,0.1,0.3,NA,0.3,0,102.3,41.8,133.4,0.5,3.1,32.8,24.8,NA,0.1,0.2,1.6,6.9,0.1,NA,0.3,NA,0.1,84,56.6,388,0.7,NA,53.1,NA,60.4
revita,amendments,7,7,7,7,7,7,7,7,7,7,7,7,7,7,7,7,7,7,7,7,7,7,7,7,7,7,NA,NA,7,7,7,7,7,7,0.22758515885355393,0.17966171503534384,0.8927425366471617,0.8583767878947909,0.697995190793671,0.43106212194639204,0.8016186020660299,0.8703138567202424,0.028104713847587153,0.5800805738478989,0.8402771360246025,0.7531397975025592,0.9436763204034091,0.6578495760592414,0.9877096915678989,0.4526796535655273,0.531870045727422,0.36551237481583776,0.4906087535583002,0.9184080102375964,0.887534404417595,0.53215264250755,0.5371628778699298,0.7071578376117071,0.5206899251178803,0.5039905568203379,NA,NA,0.6892476920246979,0.9455391432417961,0.8339041462708519,0.9223045846642258,0.6982487752916644,0.8225075769115396,-0.1,-0.4,-3,-3.5,-0.1,1.5,-0.3,-0.6,-0,-407.9,-17.3,-63,-1.4,-2.3,5,-134.4,-145.2,-0.1,-0.3,-3.1,-3.4,-0.2,0.3,-0.3,-0.6,-0.1,NA,NA,-309.8,-1.5,-5.8,6.6,-77.3,-86.8,0,-0.2,-1.5,2,-0,2.8,-0,0.1,0.1,-184.6,15.9,324.6,-0.3,5,30.2,-81.4,-84.6,-0,-0.1,-1.6,2.4,-0.1,1.7,0,0.1,0,NA,NA,108.1,-0.3,2,35.8,-25.1,-29.9
seasalt,amendments,12,12,12,12,12,12,12,12,12,NA,12,NA,12,12,12,12,12,12,12,12,12,12,12,12,NA,12,12,12,NA,12,12,12,12,12,0.08423723477709673,0.306179853224893,0.757755698353992,0.8628824580584935,0.6125078896803441,0.5573831758434613,0.32987479998133545,0.7374970573190622,0.5946375812074522,NA,0.8998387675062258,NA,0.429625777645651,0.6641456441105653,0.5602360244985398,0.81107036927299,0.5787779965252542,0.2377172327423537,0.5254153357043969,0.6146571792774499,0.8762557526954002,0.42168833087018137,0.9467745128997729,0.4450046868059467,NA,0.22903659892769554,0.8784524142329816,1,NA,0.7127500337856769,0.7295484955199674,0.3035668281434052,0.9224722368545579,0.7930898275049107,0,0.1,-0.2,4.6,-0.1,-1.2,0.2,-0.6,-0.1,NA,11.7,NA,-0.5,-5,19.5,19.6,23.8,-0,0.1,-0.5,4.3,-0.1,-1.3,0.2,NA,-0.1,12.7,6,NA,-0.7,-6.5,29.1,27.1,39.9,0.1,0.2,1,8.4,-0,-0.3,0.5,-0.1,0,NA,37.3,NA,0.3,0.7,47,55.9,68.2,0.1,0.3,0.8,8.6,-0,-0.3,0.5,NA,0,208.7,33.1,NA,0.2,-0.1,54.9,67.3,87.6
sodium_molybdate,amendments,11,11,NA,11,11,11,NA,11,11,NA,11,NA,11,11,11,11,11,11,11,11,11,11,11,11,11,11,11,11,11,11,11,11,11,11,0.06761034273801035,0.6267492050174694,NA,0.9438847674718491,0.11641201486798997,0.8080622818176353,NA,0.5903237570522948,0.4605150527593755,NA,0.6078857365700756,NA,0.8710690412074116,0.839136036366381,0.5908709389623135,0.39889691008393624,0.851918078943744,0.38763618759264307,0.4343236968648929,0.690358971323122,0.5025121074483427,0.569075547044144,0.7249470581726447,0.27009013445781715,0.5821340303975941,0.11036260026682687,0.7846639974657993,0.558378572626031,0.52248991998387,0.4582770117980308,0.7257599093736795,0.341340486691249,0.40795876098278544,0.3895493815072674,-0,-0.1,NA,4,-0.1,-0.4,NA,-0.4,-0.1,NA,-0.1,NA,-0.5,-2.2,24.4,2.5,7.6,-0.1,-0.1,-1.4,1.4,-0.1,-0.6,-0.1,-0.2,-0.1,-76.8,-0.7,-73.4,-0.7,-4.7,15.2,-10,24.5,0.1,0.1,NA,7.9,-0,0.5,NA,0.2,0,NA,27.4,NA,0.4,3.2,50.4,43.4,60.2,0,0.1,0,5.8,-0,0.6,0.2,0.3,0,146.4,28.6,274.2,0.2,2.4,40.2,40.9,95.5
sodium_selenate,amendments,11,11,NA,11,11,11,NA,11,11,NA,11,NA,11,11,11,11,11,11,11,11,11,11,11,11,11,11,11,11,11,11,11,11,11,11,0.06761034273801035,0.6267492050174694,NA,0.9438847674718491,0.11641201486798997,0.8080622818176353,NA,0.5903237570522948,0.4605150527593755,NA,0.6078857365700756,NA,0.8710690412074116,0.839136036366381,0.5908709389623135,0.39889691008393624,0.851918078943744,0.38763618759264307,0.4343236968648929,0.690358971323122,0.5025121074483427,0.569075547044144,0.7249470581726447,0.27009013445781715,0.5821340303975941,0.11036260026682687,0.7846639974657993,0.558378572626031,0.52248991998387,0.4582770117980308,0.7257599093736795,0.341340486691249,0.40795876098278544,0.3895493815072674,-0,-0.1,NA,4,-0.1,-0.4,NA,-0.4,-0.1,NA,-0.1,NA,-0.5,-2.2,24.4,2.5,7.6,-0.1,-0.1,-1.4,1.4,-0.1,-0.6,-0.1,-0.2,-0.1,-76.8,-0.7,-73.4,-0.7,-4.7,15.2,-10,24.5,0.1,0.1,NA,7.9,-0,0.5,NA,0.2,0,NA,27.4,NA,0.4,3.2,50.4,43.4,60.2,0,0.1,0,5.8,-0,0.6,0.2,0.3,0,146.4,28.6,274.2,0.2,2.4,40.2,40.9,95.5
solubor,amendments,15,15,NA,15,15,15,NA,15,15,NA,15,NA,NA,NA,15,15,15,15,15,NA,15,15,15,15,15,15,NA,15,15,15,15,15,15,15,0.030476597148121096,0.634272280511924,NA,1,0.0851570692650808,0.8026656635544043,NA,0.7378945263386641,0.3670448743861568,NA,0.5123097883753964,NA,NA,NA,0.8061542347302929,0.2888053522850127,0.6908728223302602,0.8653123389877985,0.170419464683343,NA,0.682963238623891,0.33933317808741537,0.3629662297434009,0.5067948139370216,0.2700328663467061,0.26691065686981763,NA,0.6386495996162739,0.9947229115254865,0.6237528352051611,0.8960697413442196,0.7634652193293776,0.841425264885335,0.5627805510442039,-0,-0.1,NA,4,-0.1,-0.4,NA,-0.3,-0.1,NA,0.1,NA,NA,NA,29.3,9.5,23.6,-0.1,-0.2,NA,2.6,-0.1,-0.4,-0.1,-0.2,-0.1,NA,2.3,6.4,-0.6,-2.8,21.5,-16.1,14.1,0.1,0,NA,7.3,-0,0.4,NA,0.2,0,NA,24.9,NA,NA,NA,51.1,45.2,75.3,0,0,NA,6.2,-0,0.7,0.2,0.2,0,NA,27.4,317.8,0.2,3.3,44.2,30.5,77.1
sulfur,amendments,14,14,14,14,14,14,NA,14,14,14,14,14,14,14,14,14,14,16,16,16,16,16,16,16,16,16,NA,NA,16,16,16,16,NA,16,0.7690345177750184,0.633616882159225,0.6500789746538672,0.28249238259266213,0.26017279585701164,0.5107754601120535,NA,0.19079245710909867,0.17809793652607603,0.7557659378195776,0.7888757466739715,0.7217472544034182,0.13542526691339374,0.22942434684839827,0.33244399365312644,0.8590278138339758,0.619349775426744,0.532189106739188,0.5350397339330921,0.5185423757373296,0.3335742686586208,0.4748687413251931,0.7356523308669269,0.4096465422196617,0.36622997140237096,0.34378605328407325,NA,NA,0.5772333272758836,0.2996979474905646,0.4721406785507183,0.8647358039356263,NA,0.5186651372225755,0,-0.1,-0.8,0.9,-0,-0.1,NA,0,-0,-201.4,-5,31.4,0,1.4,2,-16.5,-13.9,-0,-0.1,-1.6,-3.5,-0,-0.3,-0.2,0.1,-0,NA,NA,-104.2,-0.2,-1.1,-10.9,NA,-7.4,0.1,0,0.4,5.2,0.1,0.8,NA,0.5,0.1,-21.2,19,316,0.7,7.7,40.5,30.3,44.2,0.1,0,-0.3,2.2,0.1,0.6,0.1,0.5,0.1,NA,NA,182.8,0.6,5.6,19.4,NA,64.5
tennessee_brown_rock_phosphate,amendments,14,14,14,14,14,14,14,NA,14,14,14,14,14,14,14,14,14,13,13,13,13,13,13,13,13,13,13,13,13,13,13,13,13,13,0.003413275207693488,0.34401479302954735,0.22373999256797883,0.3221816337177885,0.3500913047377164,0.4901097045339646,0.7755737874452632,NA,0.27340375221870405,0.6989201370418645,0.7667554439126169,0.4713012768089748,0.5783781879724414,0.6449977467208975,0.9002700799518485,0.7571367001487384,0.8888612173358981,0.3341829987307456,0.7429148676793664,0.5629440048987424,0.7420092391513415,0.5781039535931995,0.7662704211220087,0.2693423278226629,0.5368664075757872,0.08307563796873678,0.6398046192654767,0.6133204245941848,0.7964012840038355,0.6389864490072801,0.8924263555636625,0.9595550341872169,0.5275999128708919,0.8253720895944416,-0,-0.1,-1.2,1.6,-0.1,-0.4,-0,NA,-0.1,-84.6,-1.4,-93.3,-0.6,-2.5,23.5,-3.9,-0.1,-0.1,-0.1,-1.7,-0.2,-0.2,-0.6,-0.1,-0.3,-0.1,-27.5,0.2,-188.6,-0.8,-5.3,11.2,-2.9,10,0,0,0.1,5.3,-0,0.5,0.2,NA,0,72.2,22,192.4,0.2,2.4,45.8,36.1,48,-0,0.1,-0.5,4.4,-0.1,0.4,0.2,0.1,-0,162.5,26.3,116.7,0.1,0.8,34.5,39.7,83.7
zinc_sulfate,amendments,15,15,NA,15,15,15,NA,15,15,NA,15,NA,NA,NA,15,15,15,15,15,NA,15,15,15,15,15,15,NA,15,15,15,15,15,15,15,0.030476597148121096,0.634272280511924,NA,1,0.0851570692650808,0.8026656635544043,NA,0.7378945263386641,0.3670448743861568,NA,0.5123097883753964,NA,NA,NA,0.8061542347302929,0.2888053522850127,0.6908728223302602,0.8653123389877985,0.170419464683343,NA,0.682963238623891,0.33933317808741537,0.3629662297434009,0.5067948139370216,0.2700328663467061,0.26691065686981763,NA,0.6386495996162739,0.9947229115254865,0.6237528352051611,0.8960697413442196,0.7634652193293776,0.841425264885335,0.5627805510442039,-0,-0.1,NA,4,-0.1,-0.4,NA,-0.3,-0.1,NA,0.1,NA,NA,NA,29.3,9.5,23.6,-0.1,-0.2,NA,2.6,-0.1,-0.4,-0.1,-0.2,-0.1,NA,2.3,6.4,-0.6,-2.8,21.5,-16.1,14.1,0.1,0,NA,7.3,-0,0.4,NA,0.2,0,NA,24.9,NA,NA,NA,51.1,45.2,75.3,0,0,NA,6.2,-0,0.7,0.2,0.2,0,NA,27.4,317.8,0.2,3.3,44.2,30.5,77.1
none,amendments,506,506,506,506,506,506,506,506,506,506,506,506,506,506,506,506,506,533,533,533,533,533,533,533,533,533,533,533,533,533,533,533,533,533,2.463010960159269e-31,0.7147936551250449,2.147872895160387e-20,2.1190582364679842e-19,1.3252263123625783e-4,1.9272676883070358e-19,2.4502565814462643e-36,2.1124734182719354e-17,8.167078809831582e-56,9.488254209178772e-14,2.719880430112702e-25,4.019254227296522e-16,1.5266311967764668e-29,4.224714593686713e-25,0.002130124285979304,1.405911016519711e-14,1.9741228227308822e-7,1.0965277016188023e-14,0.02665383843143835,7.38118574774732e-18,1.7898509024833646e-25,0.007077849114071317,6.135470677486302e-23,2.6871145379310974e-37,1.3289697399465509e-18,9.024158786350503e-66,1.9837774723274097e-11,1.622802266158828e-23,1.5819558456366795e-17,1.8740403846177162e-36,1.1963877829870081e-25,0.02148947590434083,1.9205012740884933e-17,0.0023370911025424354,0.25,-0.2,4.05,17.35,0.2,2.9,1.45,1.2,0.35,-286.45,92.2,713.25,2.3,15.55,22.05,-79.7,86.5,0.25,-0.2,4.4,17.45,0.2,2.95,1.45,1.05,0.35,-337.45,93.25,742.9,2.45,16.7,19.85,-88.45,71.15,0.25,-0.15,4.35,18.35,0.2,3.1,1.55,1.3,0.35,-246.35,97.7,768.1,2.45,16.7,26.7,-71.45,96.2,0.3,-0.2,4.65,18.45,0.2,3.2,1.5,1.15,0.4,-285.9,99.45,801.2,2.6,18.05,24.7,-78.3,82.35
worm_castings,amendments,NA,13,13,13,13,13,13,13,13,13,13,13,13,13,13,13,NA,13,13,13,13,13,13,13,13,13,13,13,13,NA,13,13,13,13,NA,0.4722003987862549,0.2863700111264639,0.022027530839646082,0.7685401445234148,0.1924111074877855,0.0704082423317648,0.19078071496331314,0.37733545407190455,0.6456391159087993,0.3557947890203117,0.8905031082330062,0.6973458954793481,0.7268407556614704,0.570990779060367,0.43974387394949566,NA,0.18230488271694237,0.40037134253843454,0.03625531749704986,0.6347111569437203,0.029931335915615465,0.4205617306025228,0.7943022638301025,0.07144607676366284,6.963189829071472e-4,0.7159481012915925,0.8087851443488021,0.20967877229542126,NA,0.6385245758187847,0.43629008228099675,0.807406789844995,0.8531869754955421,NA,-0.2,-0.4,-0.5,0,-0.6,-0.9,-0.7,-0,-179.1,-30.6,-66.2,-1.3,-4.6,1.5,-15.3,NA,-0,-0.1,0.8,-3,-0.1,-0.8,-0.9,-0.8,-0,-140.7,-40.5,-215.8,NA,-2.3,-26.1,-3.6,-2,NA,-0,1.1,6.8,0.1,0.5,-0.5,0.3,0.2,-14.6,0.4,256.5,-0.5,0.5,49.5,26.1,NA,0.1,0,4.2,1.8,0,0.4,-0.6,0.2,0.3,69.1,-13.2,145.5,NA,4.4,8.9,49,46.4
epsom_salt,amendments,NA,NA,NA,NA,NA,NA,NA,NA,NA,NA,NA,NA,NA,NA,NA,NA,NA,8,8,8,8,8,8,8,8,8,8,8,8,8,8,8,8,8,NA,NA,NA,NA,NA,NA,NA,NA,NA,NA,NA,NA,NA,NA,NA,NA,NA,0.24431419743186403,0.7137625140653108,0.7144830783663059,0.6833476886536958,0.5114328376530353,0.9482017854895909,0.36935140912369047,0.9535934629428292,0.11728289854445899,0.785388914637631,0.3760101728722909,0.5109229698143779,0.8134531646553206,0.8117812972652481,0.7471227742171568,0.8047240888244265,0.5094590332978625,NA,NA,NA,NA,NA,NA,NA,NA,NA,NA,NA,NA,NA,NA,NA,NA,NA,0.2,-0.6,1.1,3.9,-0,1.6,-0.8,-1.1,0.3,-1052.2,-40,338.2,-1.4,4.9,43.3,-172.8,-130.2,NA,NA,NA,NA,NA,NA,NA,NA,NA,NA,NA,NA,NA,NA,NA,NA,NA,0.3,-0.3,2.8,9.3,0.1,3.1,-0.5,-0.6,0.5,-668.7,1.2,756.3,-0.2,13.4,76.9,-97.8,-61.3
holiday_brook_farm,amendments,NA,NA,NA,NA,NA,NA,NA,NA,NA,NA,NA,NA,NA,NA,NA,NA,NA,30,30,30,NA,30,30,30,30,30,30,30,30,30,30,30,30,30,NA,NA,NA,NA,NA,NA,NA,NA,NA,NA,NA,NA,NA,NA,NA,NA,NA,0.7202633526604052,0.05837960244976152,0.7418344438880278,NA,0.3647262888818467,0.3475720213140778,0.003332727220795865,0.6026649792095213,2.61480177599446e-5,0.2872686677181009,0.4033038379543017,0.42841967578830886,0.44932823713443926,0.597670939066157,0.5869128117846056,0.4341584797079497,0.48416650914468573,NA,NA,NA,NA,NA,NA,NA,NA,NA,NA,NA,NA,NA,NA,NA,NA,NA,-0,-0,-0,NA,-0,-0.2,0.6,-0.3,-0,-107.6,-20.8,-63.5,0.4,1.2,-49.8,-33.9,-35.3,NA,NA,NA,NA,NA,NA,NA,NA,NA,NA,NA,NA,NA,NA,NA,NA,NA,0,0.1,0.8,NA,0,0.6,0.7,-0,0.1,15.6,-2.3,148.4,1.1,5.3,-36,-7,-4.4
