Crop,Variable,Samples,R2,F test p-value,trimmed R2,"F test p-value, trimmed",t test p.val (Intercept),t test p.val organic_carbon_percentage_10cm,t test p.val organic_carbon_percentage_20cm,coefficient_Intercept,coefficient_carbon_10cm,coefficient_carbon_20cm
oats,Polyphenols,114,0.0922561992867037,0.001723988625194517,0.30344184635034765,1.852796172041593e-8,0,0.1221,3e-4,113.97,-2.27,5.81
oats,Antioxidants,114,0.11633371491955757,3.8776763083636645e-4,0.2826970775821124,7.25237701004744e-8,0,0.0592,1e-4,2505.32,-145.58,321.67
wheat,Polyphenols,162,0.04736022433332676,0.007820720034101503,0.176988395228736,7.963681465383843e-7,0,0,0.0289,67.94,14.63,-5.75
oats,Proteins,114,0.02092874415447865,0.11475335348265503,0.0050353289135851576,0.29401241000408307,0,0.122,0.1793,9.95,0.21,-0.18
wheat,Proteins,162,-0.010092945844916157,0.8225089300379831,-0.005804086665864849,0.5461502697223481,0,0.2792,0.4571,8.15,-0.28,0.16
wheat,Antioxidants,162,0.014371910563981571,0.11711255613278282,-0.013398995659140711,0.904078390944829,0,0.7985,0.9937,2336.33,43.18,1.15
