<?xml version='1.0' encoding='UTF-8' ?>
<svg xmlns='http://www.w3.org/2000/svg' xmlns:xlink='http://www.w3.org/1999/xlink' viewBox='0 0 720.00 720.00'>
<defs>
  <style type='text/css'><![CDATA[
    line, polyline, polygon, path, rect, circle {
      fill: none;
      stroke: #000000;
      stroke-linecap: round;
      stroke-linejoin: round;
      stroke-miterlimit: 10.00;
    }
  ]]></style>
</defs>
<rect width='100%' height='100%' style='stroke: none; fill: #FFFFFF;'/>
<rect x='0.00' y='0.00' width='720.00' height='720.00' style='stroke-width: 1.07; stroke: #FFFFFF; fill: #FFFFFF;' />
<defs>
  <clipPath id='cpMzYuMzd8NzE0LjUyfDY4MS4wNnwzNy44Mg=='>
    <rect x='36.37' y='37.82' width='678.15' height='643.23' />
  </clipPath>
</defs>
<rect x='36.37' y='37.82' width='678.15' height='643.23' style='stroke-width: 1.07; stroke: none; fill: #EBEBEB;' clip-path='url(#cpMzYuMzd8NzE0LjUyfDY4MS4wNnwzNy44Mg==)' />
<polyline points='36.37,581.37 714.52,581.37 ' style='stroke-width: 0.53; stroke: #FFFFFF; stroke-linecap: butt;' clip-path='url(#cpMzYuMzd8NzE0LjUyfDY4MS4wNnwzNy44Mg==)' />
<polyline points='36.37,440.46 714.52,440.46 ' style='stroke-width: 0.53; stroke: #FFFFFF; stroke-linecap: butt;' clip-path='url(#cpMzYuMzd8NzE0LjUyfDY4MS4wNnwzNy44Mg==)' />
<polyline points='36.37,299.56 714.52,299.56 ' style='stroke-width: 0.53; stroke: #FFFFFF; stroke-linecap: butt;' clip-path='url(#cpMzYuMzd8NzE0LjUyfDY4MS4wNnwzNy44Mg==)' />
<polyline points='36.37,158.65 714.52,158.65 ' style='stroke-width: 0.53; stroke: #FFFFFF; stroke-linecap: butt;' clip-path='url(#cpMzYuMzd8NzE0LjUyfDY4MS4wNnwzNy44Mg==)' />
<polyline points='134.98,681.06 134.98,37.82 ' style='stroke-width: 0.53; stroke: #FFFFFF; stroke-linecap: butt;' clip-path='url(#cpMzYuMzd8NzE0LjUyfDY4MS4wNnwzNy44Mg==)' />
<polyline points='296.24,681.06 296.24,37.82 ' style='stroke-width: 0.53; stroke: #FFFFFF; stroke-linecap: butt;' clip-path='url(#cpMzYuMzd8NzE0LjUyfDY4MS4wNnwzNy44Mg==)' />
<polyline points='457.49,681.06 457.49,37.82 ' style='stroke-width: 0.53; stroke: #FFFFFF; stroke-linecap: butt;' clip-path='url(#cpMzYuMzd8NzE0LjUyfDY4MS4wNnwzNy44Mg==)' />
<polyline points='618.75,681.06 618.75,37.82 ' style='stroke-width: 0.53; stroke: #FFFFFF; stroke-linecap: butt;' clip-path='url(#cpMzYuMzd8NzE0LjUyfDY4MS4wNnwzNy44Mg==)' />
<polyline points='36.37,651.82 714.52,651.82 ' style='stroke-width: 1.07; stroke: #FFFFFF; stroke-linecap: butt;' clip-path='url(#cpMzYuMzd8NzE0LjUyfDY4MS4wNnwzNy44Mg==)' />
<polyline points='36.37,510.92 714.52,510.92 ' style='stroke-width: 1.07; stroke: #FFFFFF; stroke-linecap: butt;' clip-path='url(#cpMzYuMzd8NzE0LjUyfDY4MS4wNnwzNy44Mg==)' />
<polyline points='36.37,370.01 714.52,370.01 ' style='stroke-width: 1.07; stroke: #FFFFFF; stroke-linecap: butt;' clip-path='url(#cpMzYuMzd8NzE0LjUyfDY4MS4wNnwzNy44Mg==)' />
<polyline points='36.37,229.10 714.52,229.10 ' style='stroke-width: 1.07; stroke: #FFFFFF; stroke-linecap: butt;' clip-path='url(#cpMzYuMzd8NzE0LjUyfDY4MS4wNnwzNy44Mg==)' />
<polyline points='36.37,88.20 714.52,88.20 ' style='stroke-width: 1.07; stroke: #FFFFFF; stroke-linecap: butt;' clip-path='url(#cpMzYuMzd8NzE0LjUyfDY4MS4wNnwzNy44Mg==)' />
<polyline points='54.35,681.06 54.35,37.82 ' style='stroke-width: 1.07; stroke: #FFFFFF; stroke-linecap: butt;' clip-path='url(#cpMzYuMzd8NzE0LjUyfDY4MS4wNnwzNy44Mg==)' />
<polyline points='215.61,681.06 215.61,37.82 ' style='stroke-width: 1.07; stroke: #FFFFFF; stroke-linecap: butt;' clip-path='url(#cpMzYuMzd8NzE0LjUyfDY4MS4wNnwzNy44Mg==)' />
<polyline points='376.87,681.06 376.87,37.82 ' style='stroke-width: 1.07; stroke: #FFFFFF; stroke-linecap: butt;' clip-path='url(#cpMzYuMzd8NzE0LjUyfDY4MS4wNnwzNy44Mg==)' />
<polyline points='538.12,681.06 538.12,37.82 ' style='stroke-width: 1.07; stroke: #FFFFFF; stroke-linecap: butt;' clip-path='url(#cpMzYuMzd8NzE0LjUyfDY4MS4wNnwzNy44Mg==)' />
<polyline points='699.38,681.06 699.38,37.82 ' style='stroke-width: 1.07; stroke: #FFFFFF; stroke-linecap: butt;' clip-path='url(#cpMzYuMzd8NzE0LjUyfDY4MS4wNnwzNy44Mg==)' />
<rect x='67.20' y='489.78' width='25.69' height='162.04' style='stroke-width: 1.07; stroke: #BEBEBE; stroke-linecap: square; stroke-linejoin: miter; fill: #7AC5CD;' clip-path='url(#cpMzYuMzd8NzE0LjUyfDY4MS4wNnwzNy44Mg==)' />
<rect x='92.88' y='243.19' width='25.69' height='408.63' style='stroke-width: 1.07; stroke: #BEBEBE; stroke-linecap: square; stroke-linejoin: miter; fill: #7AC5CD;' clip-path='url(#cpMzYuMzd8NzE0LjUyfDY4MS4wNnwzNy44Mg==)' />
<rect x='118.57' y='67.06' width='25.69' height='584.76' style='stroke-width: 1.07; stroke: #BEBEBE; stroke-linecap: square; stroke-linejoin: miter; fill: #7AC5CD;' clip-path='url(#cpMzYuMzd8NzE0LjUyfDY4MS4wNnwzNy44Mg==)' />
<rect x='144.26' y='348.87' width='25.69' height='302.95' style='stroke-width: 1.07; stroke: #BEBEBE; stroke-linecap: square; stroke-linejoin: miter; fill: #7AC5CD;' clip-path='url(#cpMzYuMzd8NzE0LjUyfDY4MS4wNnwzNy44Mg==)' />
<rect x='169.95' y='377.05' width='25.69' height='274.77' style='stroke-width: 1.07; stroke: #BEBEBE; stroke-linecap: square; stroke-linejoin: miter; fill: #7AC5CD;' clip-path='url(#cpMzYuMzd8NzE0LjUyfDY4MS4wNnwzNy44Mg==)' />
<rect x='195.63' y='433.42' width='25.69' height='218.40' style='stroke-width: 1.07; stroke: #BEBEBE; stroke-linecap: square; stroke-linejoin: miter; fill: #7AC5CD;' clip-path='url(#cpMzYuMzd8NzE0LjUyfDY4MS4wNnwzNy44Mg==)' />
<rect x='221.32' y='496.82' width='25.69' height='155.00' style='stroke-width: 1.07; stroke: #BEBEBE; stroke-linecap: square; stroke-linejoin: miter; fill: #7AC5CD;' clip-path='url(#cpMzYuMzd8NzE0LjUyfDY4MS4wNnwzNy44Mg==)' />
<rect x='247.01' y='560.23' width='25.69' height='91.59' style='stroke-width: 1.07; stroke: #BEBEBE; stroke-linecap: square; stroke-linejoin: miter; fill: #7AC5CD;' clip-path='url(#cpMzYuMzd8NzE0LjUyfDY4MS4wNnwzNy44Mg==)' />
<rect x='272.70' y='609.55' width='25.69' height='42.27' style='stroke-width: 1.07; stroke: #BEBEBE; stroke-linecap: square; stroke-linejoin: miter; fill: #7AC5CD;' clip-path='url(#cpMzYuMzd8NzE0LjUyfDY4MS4wNnwzNy44Mg==)' />
<rect x='298.38' y='609.55' width='25.69' height='42.27' style='stroke-width: 1.07; stroke: #BEBEBE; stroke-linecap: square; stroke-linejoin: miter; fill: #7AC5CD;' clip-path='url(#cpMzYuMzd8NzE0LjUyfDY4MS4wNnwzNy44Mg==)' />
<rect x='324.07' y='616.59' width='25.69' height='35.23' style='stroke-width: 1.07; stroke: #BEBEBE; stroke-linecap: square; stroke-linejoin: miter; fill: #7AC5CD;' clip-path='url(#cpMzYuMzd8NzE0LjUyfDY4MS4wNnwzNy44Mg==)' />
<rect x='349.76' y='644.78' width='25.69' height='7.05' style='stroke-width: 1.07; stroke: #BEBEBE; stroke-linecap: square; stroke-linejoin: miter; fill: #7AC5CD;' clip-path='url(#cpMzYuMzd8NzE0LjUyfDY4MS4wNnwzNy44Mg==)' />
<rect x='375.45' y='637.73' width='25.69' height='14.09' style='stroke-width: 1.07; stroke: #BEBEBE; stroke-linecap: square; stroke-linejoin: miter; fill: #7AC5CD;' clip-path='url(#cpMzYuMzd8NzE0LjUyfDY4MS4wNnwzNy44Mg==)' />
<rect x='401.13' y='623.64' width='25.69' height='28.18' style='stroke-width: 1.07; stroke: #BEBEBE; stroke-linecap: square; stroke-linejoin: miter; fill: #7AC5CD;' clip-path='url(#cpMzYuMzd8NzE0LjUyfDY4MS4wNnwzNy44Mg==)' />
<rect x='426.82' y='637.73' width='25.69' height='14.09' style='stroke-width: 1.07; stroke: #BEBEBE; stroke-linecap: square; stroke-linejoin: miter; fill: #7AC5CD;' clip-path='url(#cpMzYuMzd8NzE0LjUyfDY4MS4wNnwzNy44Mg==)' />
<rect x='452.51' y='644.78' width='25.69' height='7.05' style='stroke-width: 1.07; stroke: #BEBEBE; stroke-linecap: square; stroke-linejoin: miter; fill: #7AC5CD;' clip-path='url(#cpMzYuMzd8NzE0LjUyfDY4MS4wNnwzNy44Mg==)' />
<rect x='478.20' y='644.78' width='25.69' height='7.05' style='stroke-width: 1.07; stroke: #BEBEBE; stroke-linecap: square; stroke-linejoin: miter; fill: #7AC5CD;' clip-path='url(#cpMzYuMzd8NzE0LjUyfDY4MS4wNnwzNy44Mg==)' />
<rect x='503.88' y='644.78' width='25.69' height='7.05' style='stroke-width: 1.07; stroke: #BEBEBE; stroke-linecap: square; stroke-linejoin: miter; fill: #7AC5CD;' clip-path='url(#cpMzYuMzd8NzE0LjUyfDY4MS4wNnwzNy44Mg==)' />
<rect x='529.57' y='644.78' width='25.69' height='7.05' style='stroke-width: 1.07; stroke: #BEBEBE; stroke-linecap: square; stroke-linejoin: miter; fill: #7AC5CD;' clip-path='url(#cpMzYuMzd8NzE0LjUyfDY4MS4wNnwzNy44Mg==)' />
<rect x='555.26' y='651.82' width='25.69' height='0.00' style='stroke-width: 1.07; stroke: #BEBEBE; stroke-linecap: square; stroke-linejoin: miter; fill: #7AC5CD;' clip-path='url(#cpMzYuMzd8NzE0LjUyfDY4MS4wNnwzNy44Mg==)' />
<rect x='580.95' y='651.82' width='25.69' height='0.00' style='stroke-width: 1.07; stroke: #BEBEBE; stroke-linecap: square; stroke-linejoin: miter; fill: #7AC5CD;' clip-path='url(#cpMzYuMzd8NzE0LjUyfDY4MS4wNnwzNy44Mg==)' />
<rect x='606.63' y='644.78' width='25.69' height='7.05' style='stroke-width: 1.07; stroke: #BEBEBE; stroke-linecap: square; stroke-linejoin: miter; fill: #7AC5CD;' clip-path='url(#cpMzYuMzd8NzE0LjUyfDY4MS4wNnwzNy44Mg==)' />
<rect x='632.32' y='651.82' width='25.69' height='0.00' style='stroke-width: 1.07; stroke: #BEBEBE; stroke-linecap: square; stroke-linejoin: miter; fill: #7AC5CD;' clip-path='url(#cpMzYuMzd8NzE0LjUyfDY4MS4wNnwzNy44Mg==)' />
<rect x='658.01' y='644.78' width='25.69' height='7.05' style='stroke-width: 1.07; stroke: #BEBEBE; stroke-linecap: square; stroke-linejoin: miter; fill: #7AC5CD;' clip-path='url(#cpMzYuMzd8NzE0LjUyfDY4MS4wNnwzNy44Mg==)' />
<defs>
  <clipPath id='cpMC4wMHw3MjAuMDB8NzIwLjAwfDAuMDA='>
    <rect x='0.00' y='0.00' width='720.00' height='720.00' />
  </clipPath>
</defs>
<g clip-path='url(#cpMC4wMHw3MjAuMDB8NzIwLjAwfDAuMDA=)'><text x='26.55' y='654.85' style='font-size: 8.80px; fill: #4D4D4D; font-family: Liberation Sans;' textLength='4.89px' lengthAdjust='spacingAndGlyphs'>0</text></g>
<g clip-path='url(#cpMC4wMHw3MjAuMDB8NzIwLjAwfDAuMDA=)'><text x='21.65' y='513.94' style='font-size: 8.80px; fill: #4D4D4D; font-family: Liberation Sans;' textLength='9.79px' lengthAdjust='spacingAndGlyphs'>20</text></g>
<g clip-path='url(#cpMC4wMHw3MjAuMDB8NzIwLjAwfDAuMDA=)'><text x='21.65' y='373.04' style='font-size: 8.80px; fill: #4D4D4D; font-family: Liberation Sans;' textLength='9.79px' lengthAdjust='spacingAndGlyphs'>40</text></g>
<g clip-path='url(#cpMC4wMHw3MjAuMDB8NzIwLjAwfDAuMDA=)'><text x='21.65' y='232.13' style='font-size: 8.80px; fill: #4D4D4D; font-family: Liberation Sans;' textLength='9.79px' lengthAdjust='spacingAndGlyphs'>60</text></g>
<g clip-path='url(#cpMC4wMHw3MjAuMDB8NzIwLjAwfDAuMDA=)'><text x='21.65' y='91.23' style='font-size: 8.80px; fill: #4D4D4D; font-family: Liberation Sans;' textLength='9.79px' lengthAdjust='spacingAndGlyphs'>80</text></g>
<polyline points='33.63,651.82 36.37,651.82 ' style='stroke-width: 1.07; stroke: #333333; stroke-linecap: butt;' clip-path='url(#cpMC4wMHw3MjAuMDB8NzIwLjAwfDAuMDA=)' />
<polyline points='33.63,510.92 36.37,510.92 ' style='stroke-width: 1.07; stroke: #333333; stroke-linecap: butt;' clip-path='url(#cpMC4wMHw3MjAuMDB8NzIwLjAwfDAuMDA=)' />
<polyline points='33.63,370.01 36.37,370.01 ' style='stroke-width: 1.07; stroke: #333333; stroke-linecap: butt;' clip-path='url(#cpMC4wMHw3MjAuMDB8NzIwLjAwfDAuMDA=)' />
<polyline points='33.63,229.10 36.37,229.10 ' style='stroke-width: 1.07; stroke: #333333; stroke-linecap: butt;' clip-path='url(#cpMC4wMHw3MjAuMDB8NzIwLjAwfDAuMDA=)' />
<polyline points='33.63,88.20 36.37,88.20 ' style='stroke-width: 1.07; stroke: #333333; stroke-linecap: butt;' clip-path='url(#cpMC4wMHw3MjAuMDB8NzIwLjAwfDAuMDA=)' />
<polyline points='54.35,683.80 54.35,681.06 ' style='stroke-width: 1.07; stroke: #333333; stroke-linecap: butt;' clip-path='url(#cpMC4wMHw3MjAuMDB8NzIwLjAwfDAuMDA=)' />
<polyline points='215.61,683.80 215.61,681.06 ' style='stroke-width: 1.07; stroke: #333333; stroke-linecap: butt;' clip-path='url(#cpMC4wMHw3MjAuMDB8NzIwLjAwfDAuMDA=)' />
<polyline points='376.87,683.80 376.87,681.06 ' style='stroke-width: 1.07; stroke: #333333; stroke-linecap: butt;' clip-path='url(#cpMC4wMHw3MjAuMDB8NzIwLjAwfDAuMDA=)' />
<polyline points='538.12,683.80 538.12,681.06 ' style='stroke-width: 1.07; stroke: #333333; stroke-linecap: butt;' clip-path='url(#cpMC4wMHw3MjAuMDB8NzIwLjAwfDAuMDA=)' />
<polyline points='699.38,683.80 699.38,681.06 ' style='stroke-width: 1.07; stroke: #333333; stroke-linecap: butt;' clip-path='url(#cpMC4wMHw3MjAuMDB8NzIwLjAwfDAuMDA=)' />
<g clip-path='url(#cpMC4wMHw3MjAuMDB8NzIwLjAwfDAuMDA=)'><text x='51.91' y='692.04' style='font-size: 8.80px; fill: #4D4D4D; font-family: Liberation Sans;' textLength='4.89px' lengthAdjust='spacingAndGlyphs'>0</text></g>
<g clip-path='url(#cpMC4wMHw3MjAuMDB8NzIwLjAwfDAuMDA=)'><text x='210.72' y='692.04' style='font-size: 8.80px; fill: #4D4D4D; font-family: Liberation Sans;' textLength='9.79px' lengthAdjust='spacingAndGlyphs'>50</text></g>
<g clip-path='url(#cpMC4wMHw3MjAuMDB8NzIwLjAwfDAuMDA=)'><text x='369.52' y='692.04' style='font-size: 8.80px; fill: #4D4D4D; font-family: Liberation Sans;' textLength='14.68px' lengthAdjust='spacingAndGlyphs'>100</text></g>
<g clip-path='url(#cpMC4wMHw3MjAuMDB8NzIwLjAwfDAuMDA=)'><text x='530.78' y='692.04' style='font-size: 8.80px; fill: #4D4D4D; font-family: Liberation Sans;' textLength='14.68px' lengthAdjust='spacingAndGlyphs'>150</text></g>
<g clip-path='url(#cpMC4wMHw3MjAuMDB8NzIwLjAwfDAuMDA=)'><text x='692.04' y='692.04' style='font-size: 8.80px; fill: #4D4D4D; font-family: Liberation Sans;' textLength='14.68px' lengthAdjust='spacingAndGlyphs'>200</text></g>
<g clip-path='url(#cpMC4wMHw3MjAuMDB8NzIwLjAwfDAuMDA=)'><text x='270.39' y='710.37' style='font-size: 20.00px; font-family: Liberation Sans;' textLength='210.12px' lengthAdjust='spacingAndGlyphs'>Amount Of Polyphenols</text></g>
<g clip-path='url(#cpMC4wMHw3MjAuMDB8NzIwLjAwfDAuMDA=)'><text transform='translate(15.80,456.16) rotate(-90)' style='font-size: 15.00px; font-family: Liberation Sans;' textLength='193.43px' lengthAdjust='spacingAndGlyphs'>Specimens Within the Range</text></g>
<g clip-path='url(#cpMC4wMHw3MjAuMDB8NzIwLjAwfDAuMDA=)'><text x='36.37' y='26.12' style='font-size: 30.00px; font-family: Liberation Sans;' textLength='468.56px' lengthAdjust='spacingAndGlyphs'>Polyphenols Histogram For Lettuce</text></g>
</svg>
