factor,family,N_beet_Antioxidants,N_beet_BQI,N_beet_Brix,N_beet_Polyphenols,N_carrot_Antioxidants,N_carrot_BQI,N_carrot_Brix,N_carrot_Polyphenols,N_zucchini_BQI,N_zucchini_Brix,N_zucchini_Antioxidants,N_zucchini_Polyphenols,N_peppers_Antioxidants,N_peppers_BQI,N_peppers_Brix,N_peppers_Polyphenols,N_potato_Antioxidants,N_potato_BQI,N_potato_Brix,N_potato_Polyphenols,N_grapes_Antioxidants,N_grapes_BQI,N_grapes_Brix,N_grapes_Polyphenols,N_tomato_Antioxidants,N_tomato_BQI,N_tomato_Brix,N_tomato_Polyphenols,p.value_beet_Antioxidants,p.value_beet_BQI,p.value_beet_Brix,p.value_beet_Polyphenols,p.value_carrot_Antioxidants,p.value_carrot_BQI,p.value_carrot_Brix,p.value_carrot_Polyphenols,p.value_zucchini_BQI,p.value_zucchini_Brix,p.value_zucchini_Antioxidants,p.value_zucchini_Polyphenols,p.value_peppers_Antioxidants,p.value_peppers_BQI,p.value_peppers_Brix,p.value_peppers_Polyphenols,p.value_potato_Antioxidants,p.value_potato_BQI,p.value_potato_Brix,p.value_potato_Polyphenols,p.value_grapes_Antioxidants,p.value_grapes_BQI,p.value_grapes_Brix,p.value_grapes_Polyphenols,p.value_tomato_Antioxidants,p.value_tomato_BQI,p.value_tomato_Brix,p.value_tomato_Polyphenols,intervalMin_beet_Antioxidants,intervalMin_beet_BQI,intervalMin_beet_Brix,intervalMin_beet_Polyphenols,intervalMin_carrot_Antioxidants,intervalMin_carrot_BQI,intervalMin_carrot_Brix,intervalMin_carrot_Polyphenols,intervalMin_zucchini_BQI,intervalMin_zucchini_Brix,intervalMin_zucchini_Antioxidants,intervalMin_zucchini_Polyphenols,intervalMin_peppers_Antioxidants,intervalMin_peppers_BQI,intervalMin_peppers_Brix,intervalMin_peppers_Polyphenols,intervalMin_potato_Antioxidants,intervalMin_potato_BQI,intervalMin_potato_Brix,intervalMin_potato_Polyphenols,intervalMin_grapes_Antioxidants,intervalMin_grapes_BQI,intervalMin_grapes_Brix,intervalMin_grapes_Polyphenols,intervalMin_tomato_Antioxidants,intervalMin_tomato_BQI,intervalMin_tomato_Brix,intervalMin_tomato_Polyphenols,intervalMax_beet_Antioxidants,intervalMax_beet_BQI,intervalMax_beet_Brix,intervalMax_beet_Polyphenols,intervalMax_carrot_Antioxidants,intervalMax_carrot_BQI,intervalMax_carrot_Brix,intervalMax_carrot_Polyphenols,intervalMax_zucchini_BQI,intervalMax_zucchini_Brix,intervalMax_zucchini_Antioxidants,intervalMax_zucchini_Polyphenols,intervalMax_peppers_Antioxidants,intervalMax_peppers_BQI,intervalMax_peppers_Brix,intervalMax_peppers_Polyphenols,intervalMax_potato_Antioxidants,intervalMax_potato_BQI,intervalMax_potato_Brix,intervalMax_potato_Polyphenols,intervalMax_grapes_Antioxidants,intervalMax_grapes_BQI,intervalMax_grapes_Brix,intervalMax_grapes_Polyphenols,intervalMax_tomato_Antioxidants,intervalMax_tomato_BQI,intervalMax_tomato_Brix,intervalMax_tomato_Polyphenols
amendments.inoculant,amendments,1,1,1,1,1,1,1,1,1,1,NA,NA,NA,NA,NA,NA,NA,NA,NA,NA,NA,NA,NA,NA,NA,NA,NA,NA,1,1,1,1,1,1,1,1,1,1,NA,NA,NA,NA,NA,NA,NA,NA,NA,NA,NA,NA,NA,NA,NA,NA,NA,NA,1,1,1,1,1,1,1,1,1,1,NA,NA,NA,NA,NA,NA,NA,NA,NA,NA,NA,NA,NA,NA,NA,NA,NA,NA,1,1,1,1,1,1,1,1,1,1,NA,NA,NA,NA,NA,NA,NA,NA,NA,NA,NA,NA,NA,NA,NA,NA,NA,NA
amendments.lime,amendments,1,1,1,1,NA,NA,NA,NA,NA,1,1,4,NA,NA,NA,NA,NA,NA,NA,NA,NA,NA,NA,NA,NA,NA,NA,NA,1,1,1,1,NA,NA,NA,NA,NA,1,1,4,NA,NA,NA,NA,NA,NA,NA,NA,NA,NA,NA,NA,NA,NA,NA,NA,1,1,1,1,NA,NA,NA,NA,NA,1,1,4,NA,NA,NA,NA,NA,NA,NA,NA,NA,NA,NA,NA,NA,NA,NA,NA,1,1,1,1,NA,NA,NA,NA,NA,1,1,4,NA,NA,NA,NA,NA,NA,NA,NA,NA,NA,NA,NA,NA,NA,NA,NA
amendments.mulch,amendments,1,NA,1,1,1,1,1,1,1,1,1,4,1,1,1,1,1,1,1,1,NA,NA,NA,NA,NA,NA,NA,NA,1,NA,1,1,1,1,1,1,1,1,1,4,1,1,1,1,1,1,1,1,NA,NA,NA,NA,NA,NA,NA,NA,1,NA,1,1,1,1,1,1,1,1,1,4,1,1,1,1,1,1,1,1,NA,NA,NA,NA,NA,NA,NA,NA,1,NA,1,1,1,1,1,1,1,1,1,4,1,1,1,1,1,1,1,1,NA,NA,NA,NA,NA,NA,NA,NA
amendments.none,amendments,1,1,1,1,1,1,1,1,1,1,1,4,1,1,1,1,1,1,1,1,1,1,1,1,1,1,1,1,1,1,1,1,1,1,1,1,1,1,1,4,1,1,1,1,1,1,1,1,1,1,1,1,1,1,1,1,1,1,1,1,1,1,1,1,1,1,1,4,1,1,1,1,1,1,1,1,1,1,1,1,1,1,1,1,1,1,1,1,1,1,1,1,1,1,1,4,1,1,1,1,1,1,1,1,1,1,1,1,1,1,1,1
amendments.organic_amendment,amendments,1,1,1,1,1,1,1,1,1,1,1,4,1,NA,1,1,1,1,1,1,NA,NA,NA,NA,NA,NA,NA,NA,1,1,1,1,1,1,1,1,1,1,1,4,1,NA,1,1,1,1,1,1,NA,NA,NA,NA,NA,NA,NA,NA,1,1,1,1,1,1,1,1,1,1,1,4,1,NA,1,1,1,1,1,1,NA,NA,NA,NA,NA,NA,NA,NA,1,1,1,1,1,1,1,1,1,1,1,4,1,NA,1,1,1,1,1,1,NA,NA,NA,NA,NA,NA,NA,NA
farm_practices.biodynamic,farm_practices,1,1,1,1,1,1,1,1,1,1,1,4,NA,NA,NA,NA,1,1,1,1,NA,NA,NA,NA,NA,NA,NA,NA,1,1,1,1,1,1,1,1,1,1,1,4,NA,NA,NA,NA,1,1,1,1,NA,NA,NA,NA,NA,NA,NA,NA,1,1,1,1,1,1,1,1,1,1,1,4,NA,NA,NA,NA,1,1,1,1,NA,NA,NA,NA,NA,NA,NA,NA,1,1,1,1,1,1,1,1,1,1,1,4,NA,NA,NA,NA,1,1,1,1,NA,NA,NA,NA,NA,NA,NA,NA
farm_practices.biological,farm_practices,1,1,1,1,1,1,1,NA,1,1,1,4,1,1,1,1,1,1,1,1,NA,NA,NA,NA,NA,NA,NA,NA,1,1,1,1,1,1,1,NA,1,1,1,4,1,1,1,1,1,1,1,1,NA,NA,NA,NA,NA,NA,NA,NA,1,1,1,1,1,1,1,NA,1,1,1,4,1,1,1,1,1,1,1,1,NA,NA,NA,NA,NA,NA,NA,NA,1,1,1,1,1,1,1,NA,1,1,1,4,1,1,1,1,1,1,1,1,NA,NA,NA,NA,NA,NA,NA,NA
farm_practices.certified_organic,farm_practices,1,1,1,1,1,1,1,1,NA,1,1,4,1,1,1,1,1,1,1,1,1,1,1,1,1,1,1,NA,1,1,1,1,1,1,1,1,NA,1,1,4,1,1,1,1,1,1,1,1,1,1,1,1,1,1,1,NA,1,1,1,1,1,1,1,1,NA,1,1,4,1,1,1,1,1,1,1,1,1,1,1,1,1,1,1,NA,1,1,1,1,1,1,1,1,NA,1,1,4,1,1,1,1,1,1,1,1,1,1,1,1,1,1,1,NA
farm_practices.greenhouse,farm_practices,NA,NA,NA,NA,NA,NA,NA,NA,NA,1,1,4,NA,NA,NA,NA,NA,NA,NA,NA,NA,NA,NA,NA,NA,NA,NA,NA,NA,NA,NA,NA,NA,NA,NA,NA,NA,1,1,4,NA,NA,NA,NA,NA,NA,NA,NA,NA,NA,NA,NA,NA,NA,NA,NA,NA,NA,NA,NA,NA,NA,NA,NA,NA,1,1,4,NA,NA,NA,NA,NA,NA,NA,NA,NA,NA,NA,NA,NA,NA,NA,NA,NA,NA,NA,NA,NA,NA,NA,NA,NA,1,1,4,NA,NA,NA,NA,NA,NA,NA,NA,NA,NA,NA,NA,NA,NA,NA,NA
farm_practices.hydroponic,farm_practices,NA,NA,NA,NA,NA,NA,NA,NA,NA,NA,NA,NA,NA,NA,NA,NA,NA,NA,NA,NA,NA,NA,NA,NA,1,1,1,NA,NA,NA,NA,NA,NA,NA,NA,NA,NA,NA,NA,NA,NA,NA,NA,NA,NA,NA,NA,NA,NA,NA,NA,NA,1,1,1,NA,NA,NA,NA,NA,NA,NA,NA,NA,NA,NA,NA,NA,NA,NA,NA,NA,NA,NA,NA,NA,NA,NA,NA,NA,1,1,1,NA,NA,NA,NA,NA,NA,NA,NA,NA,NA,NA,NA,NA,NA,NA,NA,NA,NA,NA,NA,NA,NA,NA,NA,NA,1,1,1,NA
farm_practices.irrigation,farm_practices,NA,1,1,NA,1,1,1,1,NA,1,1,4,1,1,1,1,1,1,1,1,NA,NA,NA,NA,NA,NA,NA,NA,NA,1,1,NA,1,1,1,1,NA,1,1,4,1,1,1,1,1,1,1,1,NA,NA,NA,NA,NA,NA,NA,NA,NA,1,1,NA,1,1,1,1,NA,1,1,4,1,1,1,1,1,1,1,1,NA,NA,NA,NA,NA,NA,NA,NA,NA,1,1,NA,1,1,1,1,NA,1,1,4,1,1,1,1,1,1,1,1,NA,NA,NA,NA,NA,NA,NA,NA
farm_practices.local,farm_practices,1,1,1,NA,NA,NA,NA,NA,NA,1,1,NA,NA,NA,NA,NA,NA,NA,NA,NA,NA,NA,NA,NA,1,1,1,NA,1,1,1,NA,NA,NA,NA,NA,NA,1,1,NA,NA,NA,NA,NA,NA,NA,NA,NA,NA,NA,NA,NA,1,1,1,NA,1,1,1,NA,NA,NA,NA,NA,NA,1,1,NA,NA,NA,NA,NA,NA,NA,NA,NA,NA,NA,NA,NA,1,1,1,NA,1,1,1,NA,NA,NA,NA,NA,NA,1,1,NA,NA,NA,NA,NA,NA,NA,NA,NA,NA,NA,NA,NA,1,1,1,NA
farm_practices.none,farm_practices,1,1,1,1,1,1,1,1,1,1,1,4,1,1,1,1,1,1,1,1,1,1,1,1,1,1,1,1,1,1,1,1,1,1,1,1,1,1,1,4,1,1,1,1,1,1,1,1,1,1,1,1,1,1,1,1,1,1,1,1,1,1,1,1,1,1,1,4,1,1,1,1,1,1,1,1,1,1,1,1,1,1,1,1,1,1,1,1,1,1,1,1,1,1,1,4,1,1,1,1,1,1,1,1,1,1,1,1,1,1,1,1
farm_practices.nospray,farm_practices,1,NA,1,1,1,1,1,1,1,1,1,4,1,1,1,1,1,1,1,1,NA,NA,NA,NA,NA,NA,NA,NA,1,NA,1,1,1,1,1,1,1,1,1,4,1,1,1,1,1,1,1,1,NA,NA,NA,NA,NA,NA,NA,NA,1,NA,1,1,1,1,1,1,1,1,1,4,1,1,1,1,1,1,1,1,NA,NA,NA,NA,NA,NA,NA,NA,1,NA,1,1,1,1,1,1,1,1,1,4,1,1,1,1,1,1,1,1,NA,NA,NA,NA,NA,NA,NA,NA
farm_practices.organic,farm_practices,1,1,1,1,1,1,1,1,1,1,1,4,1,1,1,1,1,1,1,1,NA,NA,NA,NA,NA,NA,NA,NA,1,1,1,1,1,1,1,1,1,1,1,4,1,1,1,1,1,1,1,1,NA,NA,NA,NA,NA,NA,NA,NA,1,1,1,1,1,1,1,1,1,1,1,4,1,1,1,1,1,1,1,1,NA,NA,NA,NA,NA,NA,NA,NA,1,1,1,1,1,1,1,1,1,1,1,4,1,1,1,1,1,1,1,1,NA,NA,NA,NA,NA,NA,NA,NA
farm_practices.regenerative,farm_practices,1,1,1,1,1,1,1,1,1,1,1,4,1,1,1,1,1,1,1,1,NA,NA,NA,NA,NA,NA,NA,NA,1,1,1,1,1,1,1,1,1,1,1,4,1,1,1,1,1,1,1,1,NA,NA,NA,NA,NA,NA,NA,NA,1,1,1,1,1,1,1,1,1,1,1,4,1,1,1,1,1,1,1,1,NA,NA,NA,NA,NA,NA,NA,NA,1,1,1,1,1,1,1,1,1,1,1,4,1,1,1,1,1,1,1,1,NA,NA,NA,NA,NA,NA,NA,NA
farm_practices.transitioning,farm_practices,1,1,1,1,NA,NA,NA,NA,NA,1,1,4,NA,NA,NA,NA,1,1,1,1,NA,NA,NA,NA,NA,NA,NA,NA,1,1,1,1,NA,NA,NA,NA,NA,1,1,4,NA,NA,NA,NA,1,1,1,1,NA,NA,NA,NA,NA,NA,NA,NA,1,1,1,1,NA,NA,NA,NA,NA,1,1,4,NA,NA,NA,NA,1,1,1,1,NA,NA,NA,NA,NA,NA,NA,NA,1,1,1,1,NA,NA,NA,NA,NA,1,1,4,NA,NA,NA,NA,1,1,1,1,NA,NA,NA,NA,NA,NA,NA,NA
seed_treatment.biological,seed_treatment,1,1,NA,1,1,1,1,1,NA,1,1,4,NA,NA,NA,NA,NA,NA,NA,NA,NA,NA,NA,NA,NA,NA,NA,NA,1,1,NA,1,1,1,1,1,NA,1,1,4,NA,NA,NA,NA,NA,NA,NA,NA,NA,NA,NA,NA,NA,NA,NA,NA,1,1,NA,1,1,1,1,1,NA,1,1,4,NA,NA,NA,NA,NA,NA,NA,NA,NA,NA,NA,NA,NA,NA,NA,NA,1,1,NA,1,1,1,1,1,NA,1,1,4,NA,NA,NA,NA,NA,NA,NA,NA,NA,NA,NA,NA,NA,NA,NA,NA
seed_treatment.none,seed_treatment,1,1,1,1,1,1,1,1,1,1,1,4,1,1,1,1,1,1,1,1,NA,NA,NA,NA,NA,NA,NA,NA,1,1,1,1,1,1,1,1,1,1,1,4,1,1,1,1,1,1,1,1,NA,NA,NA,NA,NA,NA,NA,NA,1,1,1,1,1,1,1,1,1,1,1,4,1,1,1,1,1,1,1,1,NA,NA,NA,NA,NA,NA,NA,NA,1,1,1,1,1,1,1,1,1,1,1,4,1,1,1,1,1,1,1,1,NA,NA,NA,NA,NA,NA,NA,NA
tillage.heavy_tillage,tillage,1,NA,1,1,1,1,NA,NA,1,1,1,4,1,NA,1,1,1,1,1,1,NA,NA,NA,NA,NA,NA,NA,NA,1,NA,1,1,1,1,NA,NA,1,1,1,4,1,NA,1,1,1,1,1,1,NA,NA,NA,NA,NA,NA,NA,NA,1,NA,1,1,1,1,NA,NA,1,1,1,4,1,NA,1,1,1,1,1,1,NA,NA,NA,NA,NA,NA,NA,NA,1,NA,1,1,1,1,NA,NA,1,1,1,4,1,NA,1,1,1,1,1,1,NA,NA,NA,NA,NA,NA,NA,NA
tillage.light_tillage,tillage,1,1,1,1,1,1,1,1,1,1,1,4,1,NA,NA,1,NA,NA,NA,NA,NA,NA,NA,NA,NA,NA,NA,NA,1,1,1,1,1,1,1,1,1,1,1,4,1,NA,NA,1,NA,NA,NA,NA,NA,NA,NA,NA,NA,NA,NA,NA,1,1,1,1,1,1,1,1,1,1,1,4,1,NA,NA,1,NA,NA,NA,NA,NA,NA,NA,NA,NA,NA,NA,NA,1,1,1,1,1,1,1,1,1,1,1,4,1,NA,NA,1,NA,NA,NA,NA,NA,NA,NA,NA,NA,NA,NA,NA
tillage.none,tillage,1,1,1,1,1,1,1,1,1,1,1,4,1,1,1,1,1,1,1,1,NA,NA,NA,NA,NA,NA,NA,NA,1,1,1,1,1,1,1,1,1,1,1,4,1,1,1,1,1,1,1,1,NA,NA,NA,NA,NA,NA,NA,NA,1,1,1,1,1,1,1,1,1,1,1,4,1,1,1,1,1,1,1,1,NA,NA,NA,NA,NA,NA,NA,NA,1,1,1,1,1,1,1,1,1,1,1,4,1,1,1,1,1,1,1,1,NA,NA,NA,NA,NA,NA,NA,NA
