<svg id="Vrstva_1" data-name="Vrstva 1" xmlns="http://www.w3.org/2000/svg" viewBox="0 0 30.03 20">
  <title>Bez názvu-1</title>
  <path d="M12.42,0a10,10,0,1,0,10,10A10,10,0,0,0,12.42,0ZM15,4.71a.8.8,0,0,1,.6.3l.77.83h.11L17.22,5a.87.87,0,0,1,.66-.32.65.65,0,0,1,.68.64.76.76,0,0,1-.33.6l-.91.68a1.17,1.17,0,0,1-.87.32,1.2,1.2,0,0,1-.87-.31L14.68,6a.79.79,0,0,1-.33-.6A.65.65,0,0,1,15,4.71Zm-3.36,9.85a1.48,1.48,0,0,1-1.22-.74l-1.9-2.57-.68.68v1.28c0,.87-.44,1.35-1.23,1.35a1.2,1.2,0,0,1-1.3-1.35V7.05A1.18,1.18,0,0,1,6.6,5.7,1.19,1.19,0,0,1,7.87,7.05v2H8l2.64-2.91a1.26,1.26,0,0,1,.94-.48,1.1,1.1,0,0,1,1.12,1.11,1.23,1.23,0,0,1-.42.86l-1.87,2,2,2.62a1.71,1.71,0,0,1,.47,1.09A1.13,1.13,0,0,1,11.67,14.56Zm7.06-.41a3.85,3.85,0,0,1-2.08.54,3.09,3.09,0,0,1-3.4-3.36v-.68a3.09,3.09,0,0,1,3.42-3.22A3.81,3.81,0,0,1,18.85,8a1.38,1.38,0,0,1,.64,1.06.9.9,0,0,1-.93.93,1.39,1.39,0,0,1-.83-.34,1.3,1.3,0,0,0-.88-.35c-.72,0-1.06.57-1.06,1.45v.42c0,.95.23,1.57,1.08,1.57a1.48,1.48,0,0,0,1-.39,1.29,1.29,0,0,1,.79-.31.84.84,0,0,1,.89.9A1.45,1.45,0,0,1,18.73,14.15Z"/>
  <path d="M17.6,0a10.24,10.24,0,0,0-1.36.1,10,10,0,0,1,0,19.8,10.24,10.24,0,0,0,1.36.1,10,10,0,0,0,0-20Z"/>
</svg>
