<svg height="20" viewBox="0 0 16 16" xmlns="http://www.w3.org/2000/svg">
<path d="M11.52 0C9.04576 0 7.04 2.0068 7.04 4.48233C7.04 7.43042 9.9527 8.80126 10.3175 9.12975C10.69 9.46528 10.9977 10.1378 11.1225 10.5642C11.1827 10.7711 11.3523 10.8762 11.52 10.8807C11.6883 10.8762 11.8573 10.7711 11.9175 10.5642C12.0417 10.1384 12.3494 9.46528 12.7225 9.12975C13.0873 8.80126 16 7.43042 16 4.48233C16 2.0068 13.9942 0 11.52 0ZM0.69625 1.931C0.326729 1.91683 0 2.21277 0 2.60385V13.6033C0 14.1751 0.37838 14.6783 0.9275 14.8352L4.8925 15.9683C5.04162 16.0106 5.19838 16.0106 5.3475 15.9683L9.2825 14.844C9.49818 14.7825 9.72551 14.7783 9.94375 14.8327L14.525 15.9796C14.9487 16.0859 15.36 15.7641 15.36 15.3267V8.73579L14.08 9.75757V14.5476L10.24 13.5871V11.5585L8.96 9.75757V13.6046L5.76 14.5201V4.34226L5.7675 4.33976C5.77902 3.86655 5.84782 3.40892 5.9675 2.97029L5.46375 3.09661C5.24615 3.15104 5.01757 3.14683 4.80125 3.08535L0.8575 1.95727C0.80382 1.94198 0.749039 1.93303 0.69625 1.931ZM11.52 3.20166C12.2272 3.20166 12.8 3.77476 12.8 4.48233C12.8 5.1899 12.2272 5.763 11.52 5.763C10.8128 5.763 10.24 5.1899 10.24 4.48233C10.24 3.77476 10.8128 3.20166 11.52 3.20166ZM1.28 3.41052L4.48 4.32475V14.5188L1.28 13.6046V3.41052Z"/>
</svg>
