<?xml version="1.0" encoding="utf-8"?>
<svg width="48" height="48" viewBox="0 0 48 48" fill="none" xmlns="http://www.w3.org/2000/svg">
  <path d="M 47.933 0.068 L 24.467 0.068 L 24.467 47.932 L 47.933 47.932 L 47.933 0.068 Z" fill="#ED2232" style=""/>
  <path d="M 36.92 29.045 C 36.703 29.045 35.73 29.045 35.515 29.045 C 35.595 28.815 36.015 27.559 36.015 27.559 C 36.095 27.33 36.15 27.114 36.203 26.884 C 36.258 27.086 36.393 27.573 36.393 27.573 C 36.393 27.573 36.785 28.667 36.92 29.045 Z M 35.717 25.763 L 33.731 31.599 L 34.704 31.599 C 34.704 31.599 35.244 29.964 35.285 29.829 C 35.42 29.829 37.001 29.829 37.136 29.829 C 37.176 29.964 37.731 31.599 37.731 31.599 L 38.73 31.599 L 36.744 25.763 L 35.717 25.763 Z" fill="#FFDF21" style=""/>
  <path d="M 34.124 15.252 L 34.124 18.67 C 34.124 20.291 34.881 21.182 36.245 21.182 C 37.663 21.182 38.474 20.264 38.474 18.643 L 38.474 15.252 L 37.528 15.252 L 37.528 18.697 C 37.528 19.791 37.097 20.386 36.259 20.386 C 35.475 20.386 35.056 19.791 35.056 18.697 L 35.056 15.252 L 34.124 15.252 Z" fill="#FFDF21" style=""/>
  <path d="M 36.933 8.026 C 36.717 8.026 35.745 8.026 35.529 8.026 C 35.609 7.796 36.029 6.54 36.029 6.54 C 36.11 6.31 36.164 6.08 36.217 5.837 C 36.272 6.04 36.42 6.54 36.42 6.54 C 36.42 6.553 36.798 7.648 36.933 8.026 Z M 35.731 4.743 L 33.745 10.578 L 34.718 10.578 C 34.718 10.578 35.259 8.944 35.299 8.809 C 35.434 8.809 37.015 8.809 37.15 8.809 C 37.19 8.944 37.758 10.578 37.758 10.578 L 38.757 10.578 L 36.772 4.743 L 35.731 4.743 Z" fill="#FFDF21" style=""/>
  <path d="M 28.072 7.944 C 28.262 7.944 30.396 7.944 30.586 7.944 C 30.586 8.134 30.586 10.578 30.586 10.578 L 31.53 10.578 L 31.53 4.743 L 30.586 4.743 C 30.586 4.743 30.586 6.903 30.586 7.093 C 30.396 7.093 28.262 7.093 28.072 7.093 C 28.072 6.903 28.072 4.743 28.072 4.743 L 27.127 4.743 L 27.127 10.578 L 28.072 10.578 C 28.072 10.578 28.072 8.134 28.072 7.944 Z" fill="#FFDF21" style=""/>
  <path d="M 23.534 0.068 L 0.068 0.068 L 0.068 47.932 L 23.534 47.932 L 23.534 0.068 Z" fill="#ED2232" style=""/>
  <path d="M 19.387 39.556 C 19.171 39.556 18.198 39.556 17.981 39.556 C 18.063 39.326 18.482 38.07 18.482 38.07 C 18.563 37.841 18.617 37.611 18.671 37.368 C 18.724 37.556 18.874 38.07 18.874 38.07 C 18.874 38.084 19.252 39.178 19.387 39.556 Z M 18.184 36.273 L 16.199 42.109 L 17.171 42.109 C 17.171 42.109 17.711 40.474 17.753 40.339 C 17.888 40.339 19.468 40.339 19.603 40.339 C 19.644 40.474 20.197 42.109 20.197 42.109 L 21.198 42.109 L 19.211 36.273 L 18.184 36.273 Z" fill="#FFDF21" style=""/>
  <path d="M 13.239 37.949 C 13.239 38.529 12.78 38.907 12.077 38.907 C 12.077 38.907 11.592 38.907 11.442 38.907 C 11.442 38.732 11.442 37.193 11.442 37.043 C 11.55 37.03 11.74 37.003 12.05 37.003 C 12.591 37.003 13.239 37.165 13.239 37.949 Z M 13.942 40.435 C 13.807 39.867 13.564 39.502 13.212 39.313 C 13.807 39.042 14.185 38.516 14.185 37.868 C 14.185 37.408 14.009 36.99 13.712 36.72 C 13.347 36.382 12.793 36.22 12.01 36.22 C 11.524 36.22 10.984 36.273 10.591 36.341 L 10.511 36.355 L 10.511 42.096 L 11.442 42.096 C 11.442 42.096 11.442 39.853 11.442 39.65 C 11.592 39.65 12.023 39.65 12.023 39.65 C 12.618 39.65 12.901 39.921 13.063 40.664 C 13.226 41.447 13.347 41.88 13.442 42.042 L 13.469 42.096 L 14.455 42.096 L 14.374 41.947 C 14.252 41.744 14.117 41.164 13.942 40.435 Z" fill="#FFDF21" style=""/>
  <path d="M 6.175 39.11 C 5.972 39.11 5.81 39.097 5.675 39.07 C 5.675 38.907 5.675 37.206 5.675 37.057 C 5.797 37.043 5.985 37.016 6.255 37.016 C 6.715 37.016 7.485 37.151 7.485 38.029 C 7.471 38.719 6.998 39.11 6.175 39.11 Z M 7.891 36.72 C 7.526 36.395 6.971 36.22 6.242 36.22 C 5.715 36.22 5.242 36.26 4.824 36.341 L 4.742 36.355 L 4.742 42.096 L 5.675 42.096 C 5.675 42.096 5.675 40.07 5.675 39.853 C 5.837 39.88 5.999 39.894 6.16 39.894 C 6.903 39.894 7.553 39.665 7.958 39.245 C 8.269 38.907 8.431 38.489 8.431 37.976 C 8.417 37.463 8.228 37.016 7.891 36.72 Z" fill="#FFDF21" style=""/>
  <path d="M 29.56 39.731 C 29.56 39.731 30.519 39.731 30.695 39.731 C 30.695 39.906 30.695 41.109 30.695 41.231 C 30.505 41.299 30.195 41.352 29.83 41.352 C 28.56 41.352 27.763 40.529 27.763 39.191 C 27.763 37.854 28.587 37.029 29.924 37.029 C 30.41 37.029 30.79 37.097 31.127 37.259 L 31.235 37.313 L 31.478 36.516 L 31.397 36.476 C 31.14 36.354 30.6 36.205 29.938 36.205 C 28.046 36.205 26.79 37.421 26.79 39.218 C 26.79 40.096 27.087 40.894 27.601 41.393 C 28.141 41.92 28.857 42.163 29.776 42.163 C 30.654 42.163 31.356 41.92 31.546 41.852 L 31.613 41.825 L 31.613 38.948 L 29.546 38.948 L 29.546 39.731" fill="#FFDF21" style=""/>
  <path d="M 19.387 29.045 C 19.171 29.045 18.198 29.045 17.981 29.045 C 18.063 28.815 18.482 27.559 18.482 27.559 C 18.563 27.33 18.617 27.101 18.671 26.871 C 18.724 27.06 18.874 27.573 18.874 27.573 C 18.874 27.573 19.252 28.667 19.387 29.045 Z M 18.184 25.763 L 16.199 31.599 L 17.171 31.599 C 17.171 31.599 17.711 29.964 17.753 29.829 C 17.888 29.829 19.468 29.829 19.603 29.829 C 19.644 29.964 20.197 31.599 20.197 31.599 L 21.198 31.599 L 19.197 25.763 L 18.184 25.763 Z" fill="#FFDF21" style=""/>
  <path d="M 13.239 27.438 C 13.239 28.019 12.78 28.397 12.077 28.397 C 12.077 28.397 11.592 28.397 11.442 28.397 C 11.442 28.222 11.442 26.682 11.442 26.533 C 11.55 26.52 11.74 26.493 12.05 26.493 C 12.591 26.493 13.239 26.655 13.239 27.438 Z M 13.942 29.923 C 13.807 29.357 13.564 28.992 13.212 28.802 C 13.807 28.532 14.185 28.006 14.185 27.358 C 14.185 26.898 14.009 26.48 13.712 26.209 C 13.334 25.872 12.793 25.709 12.01 25.709 C 11.524 25.709 10.984 25.763 10.591 25.83 L 10.511 25.844 L 10.511 31.586 L 11.442 31.586 C 11.442 31.586 11.442 29.343 11.442 29.14 C 11.592 29.14 12.023 29.14 12.023 29.14 C 12.618 29.14 12.901 29.41 13.063 30.153 C 13.239 30.951 13.347 31.369 13.442 31.531 L 13.469 31.586 L 14.455 31.586 L 14.374 31.437 C 14.252 31.234 14.117 30.653 13.942 29.923 Z" fill="#FFDF21" style=""/>
  <path d="M 6.175 28.6 C 5.972 28.6 5.81 28.587 5.675 28.559 C 5.675 28.411 5.675 26.708 5.675 26.547 C 5.797 26.533 5.985 26.506 6.255 26.506 C 6.715 26.506 7.485 26.641 7.485 27.506 C 7.471 28.209 6.998 28.6 6.175 28.6 Z M 7.891 26.209 C 7.526 25.885 6.971 25.709 6.242 25.709 C 5.715 25.709 5.242 25.75 4.824 25.83 L 4.742 25.844 L 4.742 31.586 L 5.675 31.586 C 5.675 31.586 5.675 29.56 5.675 29.343 C 5.837 29.37 5.999 29.384 6.16 29.384 C 6.903 29.384 7.553 29.154 7.958 28.735 C 8.269 28.397 8.431 27.979 8.431 27.466 C 8.417 26.965 8.228 26.52 7.891 26.209 Z" fill="#FFDF21" style=""/>
  <path d="M 29.56 29.222 C 29.56 29.222 30.519 29.222 30.695 29.222 C 30.695 29.397 30.695 30.599 30.695 30.721 C 30.505 30.788 30.195 30.843 29.83 30.843 C 28.56 30.843 27.763 30.018 27.763 28.681 C 27.763 27.343 28.587 26.52 29.924 26.52 C 30.41 26.52 30.79 26.587 31.127 26.75 L 31.235 26.803 L 31.478 26.007 L 31.397 25.965 C 31.14 25.844 30.6 25.695 29.938 25.695 C 28.046 25.695 26.79 26.911 26.79 28.709 C 26.79 29.587 27.087 30.383 27.601 30.883 C 28.141 31.409 28.857 31.654 29.776 31.654 C 30.654 31.654 31.356 31.409 31.546 31.342 L 31.613 31.316 L 31.613 28.438 L 29.546 28.438 L 29.546 29.222" fill="#FFDF21" style=""/>
  <path d="M 19.387 18.535 C 19.171 18.535 18.198 18.535 17.981 18.535 C 18.063 18.305 18.482 17.049 18.482 17.049 C 18.563 16.819 18.617 16.59 18.671 16.36 C 18.724 16.549 18.874 17.063 18.874 17.063 C 18.874 17.063 19.252 18.157 19.387 18.535 Z M 18.184 15.252 L 16.199 21.089 L 17.171 21.089 C 17.171 21.089 17.711 19.453 17.753 19.318 C 17.888 19.318 19.468 19.318 19.603 19.318 C 19.644 19.453 20.197 21.089 20.197 21.089 L 21.198 21.089 L 19.197 15.252 L 18.184 15.252 Z" fill="#FFDF21" style=""/>
  <path d="M 42.165 20.265 C 42.165 20.09 42.165 18.617 42.165 18.441 C 42.355 18.441 44.34 18.441 44.34 18.441 L 44.34 17.631 C 44.34 17.631 42.355 17.631 42.165 17.631 C 42.165 17.455 42.165 16.239 42.165 16.064 C 42.355 16.064 44.475 16.064 44.475 16.064 L 44.475 15.239 L 41.219 15.239 L 41.219 21.076 L 44.597 21.076 L 44.597 20.252 C 44.597 20.265 42.355 20.265 42.165 20.265 Z" fill="#FFDF21" style=""/>
  <path d="M 13.239 16.928 C 13.239 17.509 12.779 17.887 12.076 17.887 C 12.076 17.887 11.59 17.887 11.442 17.887 C 11.442 17.711 11.442 16.172 11.442 16.023 C 11.55 16.009 11.739 15.982 12.05 15.982 C 12.591 15.982 13.239 16.145 13.239 16.928 Z M 13.942 19.413 C 13.807 18.847 13.562 18.482 13.212 18.292 C 13.807 18.022 14.17 17.496 14.17 16.846 C 14.17 16.388 13.995 15.969 13.698 15.699 C 13.32 15.361 12.779 15.199 11.996 15.199 C 11.51 15.199 10.969 15.252 10.577 15.32 L 10.497 15.334 L 10.497 21.076 L 11.428 21.076 C 11.428 21.076 11.428 18.832 11.428 18.63 C 11.577 18.63 12.009 18.63 12.009 18.63 C 12.604 18.63 12.887 18.9 13.049 19.643 C 13.225 20.44 13.334 20.859 13.427 21.021 L 13.455 21.076 L 14.441 21.076 L 14.36 20.926 C 14.252 20.724 14.117 20.143 13.942 19.413 Z" fill="#FFDF21" style=""/>
  <path d="M 6.175 18.089 C 5.972 18.089 5.81 18.076 5.675 18.049 C 5.675 17.901 5.675 16.198 5.675 16.037 C 5.782 16.023 5.985 15.995 6.255 15.995 C 6.715 15.995 7.485 16.13 7.485 16.995 C 7.471 17.698 6.998 18.089 6.175 18.089 Z M 7.891 15.699 C 7.526 15.374 6.971 15.199 6.242 15.199 C 5.715 15.199 5.242 15.239 4.824 15.32 L 4.742 15.334 L 4.742 21.076 L 5.675 21.076 C 5.675 21.076 5.675 19.049 5.675 18.832 C 5.823 18.86 5.999 18.873 6.16 18.873 C 6.903 18.873 7.553 18.644 7.958 18.224 C 8.269 17.887 8.431 17.468 8.431 16.955 C 8.417 16.455 8.228 16.009 7.891 15.699 Z" fill="#FFDF21" style=""/>
  <path d="M 29.56 18.711 C 29.56 18.711 30.519 18.711 30.695 18.711 C 30.695 18.887 30.695 20.089 30.695 20.211 C 30.505 20.278 30.195 20.333 29.83 20.333 C 28.56 20.333 27.763 19.495 27.763 18.171 C 27.763 16.833 28.587 16.009 29.924 16.009 C 30.41 16.009 30.79 16.077 31.127 16.239 L 31.235 16.293 L 31.478 15.496 L 31.397 15.455 C 31.14 15.334 30.6 15.185 29.938 15.185 C 28.046 15.185 26.79 16.401 26.79 18.197 C 26.79 19.075 27.087 19.873 27.601 20.373 C 28.141 20.899 28.857 21.143 29.776 21.143 C 30.654 21.143 31.356 20.899 31.546 20.832 L 31.613 20.805 L 31.613 17.927 L 29.546 17.927 L 29.546 18.711" fill="#FFDF21" style=""/>
  <path d="M 19.387 8.026 C 19.171 8.026 18.198 8.026 17.981 8.026 C 18.063 7.796 18.482 6.54 18.482 6.54 C 18.563 6.31 18.617 6.08 18.671 5.837 C 18.724 6.026 18.874 6.54 18.874 6.54 C 18.874 6.54 19.252 7.648 19.387 8.026 Z M 18.184 4.743 L 16.199 10.578 L 17.171 10.578 C 17.171 10.578 17.711 8.944 17.753 8.809 C 17.888 8.809 19.468 8.809 19.603 8.809 C 19.644 8.944 20.197 10.578 20.197 10.578 L 21.198 10.578 L 19.197 4.743 L 18.184 4.743 Z" fill="#FFDF21" style=""/>
  <path d="M 13.239 6.418 C 13.239 6.998 12.78 7.376 12.077 7.376 C 12.077 7.376 11.592 7.376 11.442 7.376 C 11.442 7.201 11.442 5.66 11.442 5.512 C 11.55 5.499 11.74 5.472 12.05 5.472 C 12.591 5.472 13.239 5.634 13.239 6.418 Z M 13.942 8.903 C 13.807 8.336 13.564 7.971 13.212 7.782 C 13.807 7.511 14.185 6.985 14.185 6.336 C 14.185 5.877 14.009 5.458 13.712 5.188 C 13.334 4.85 12.793 4.689 12.01 4.689 C 11.524 4.689 10.984 4.742 10.591 4.809 L 10.511 4.824 L 10.511 10.564 L 11.442 10.564 C 11.442 10.564 11.442 8.322 11.442 8.119 C 11.592 8.119 12.023 8.119 12.023 8.119 C 12.618 8.119 12.901 8.39 13.063 9.133 C 13.239 9.93 13.347 10.348 13.442 10.511 L 13.469 10.564 L 14.455 10.564 L 14.374 10.416 C 14.252 10.213 14.117 9.633 13.942 8.903 Z" fill="#FFDF21" style=""/>
  <path d="M 6.175 7.579 C 5.972 7.579 5.81 7.566 5.675 7.539 C 5.675 7.39 5.675 5.675 5.675 5.525 C 5.782 5.512 5.985 5.485 6.255 5.485 C 6.715 5.485 7.485 5.62 7.485 6.498 C 7.471 7.188 6.998 7.579 6.175 7.579 Z M 7.891 5.188 C 7.526 4.864 6.971 4.689 6.242 4.689 C 5.715 4.689 5.242 4.729 4.824 4.809 L 4.742 4.824 L 4.742 10.564 L 5.675 10.564 C 5.675 10.564 5.675 8.539 5.675 8.322 C 5.823 8.349 5.999 8.349 6.16 8.349 C 6.903 8.349 7.553 8.119 7.958 7.701 C 8.269 7.363 8.431 6.944 8.431 6.431 C 8.417 5.945 8.228 5.499 7.891 5.188 Z" fill="#FFDF21" style=""/>
</svg>