<?xml version="1.0" encoding="utf-8"?>
<svg width="32" height="32" viewBox="0 0 32 32" fill="none" xmlns="http://www.w3.org/2000/svg">
  <g clip-path="url(#clip0_767_10310)" transform="matrix(1, 0, 0, 1, 4.008742, -0.017577)">
    <g filter="url(#filter0_i_767_10310)">
      <path d="M11.3906 4.14062C11.7656 4 12.1875 4 12.5625 4.14062L23.0625 8.64062C23.7188 8.92188 24.0938 9.625 23.9531 10.3281C23.8125 11.0312 23.2031 11.5 22.4531 11.5V11.875C22.4531 12.5312 21.9844 13 21.3281 13H2.57812C1.96875 13 1.45312 12.5312 1.45312 11.875V11.5C0.75 11.5 0.140625 11.0312 0 10.3281C-0.140625 9.625 0.234375 8.92188 0.890625 8.64062L11.3906 4.14062ZM12 10C12.7969 10 13.5 9.34375 13.5 8.5C13.5 7.70312 12.7969 7 12 7C11.1562 7 10.5 7.70312 10.5 8.5C10.5 9.34375 11.1562 10 12 10ZM5.95312 23.5H7.82812V14.5H10.8281V23.5H13.125V14.5H16.125V23.5H18V14.5H21V23.7344C21 23.7344 21.0469 23.7344 21.0469 23.7812L23.2969 25.2812C23.8594 25.6562 24.0938 26.3125 23.9062 26.9688C23.7188 27.5781 23.1562 28 22.5 28H1.45312C0.796875 28 0.234375 27.5781 0.046875 26.9688C-0.140625 26.3125 0.09375 25.6562 0.65625 25.2812L2.90625 23.7812C2.90625 23.7344 2.95312 23.7344 2.95312 23.7344V14.5H5.95312V23.5Z" fill="url(#paint0_linear_767_10310)" fill-opacity="0.4"/>
    </g>
  </g>
  <defs>
    <filter id="filter0_i_767_10310" x="-0.140625" y="4" width="24.2344" height="28" filterUnits="userSpaceOnUse" color-interpolation-filters="sRGB">
      <feFlood flood-opacity="0" result="BackgroundImageFix"/>
      <feBlend mode="normal" in="SourceGraphic" in2="BackgroundImageFix" result="shape"/>
      <feColorMatrix in="SourceAlpha" type="matrix" values="0 0 0 0 0 0 0 0 0 0 0 0 0 0 0 0 0 0 127 0" result="hardAlpha"/>
      <feOffset dy="4"/>
      <feGaussianBlur stdDeviation="2"/>
      <feComposite in2="hardAlpha" operator="arithmetic" k2="-1" k3="1"/>
      <feColorMatrix type="matrix" values="0 0 0 0 0 0 0 0 0 0.2 0 0 0 0 0.4 0 0 0 0.1 0"/>
      <feBlend mode="normal" in2="shape" result="effect1_innerShadow_767_10310"/>
    </filter>
    <linearGradient id="paint0_linear_767_10310" x1="24.06" y1="2" x2="-3.62107" y2="25.786" gradientUnits="userSpaceOnUse">
      <stop stop-color="#96AAB7"/>
      <stop offset="1" stop-color="#728896"/>
    </linearGradient>
    <clipPath id="clip0_767_10310">
      <rect width="32" height="32" fill="white"/>
    </clipPath>
  </defs>
</svg>