<svg width="32" height="32" viewBox="0 0 32 32" fill="none" xmlns="http://www.w3.org/2000/svg">
<g filter="url(#filter0_i_363_14722)">
<path fill-rule="evenodd" clip-rule="evenodd" d="M14.4 0C22.3529 0 28.8 6.4471 28.8 14.4C28.8 17.7996 27.6219 20.9241 25.6517 23.3875L31.5314 29.2686C32.1562 29.8935 32.1562 30.9065 31.5314 31.5314C30.9546 32.1081 30.047 32.1525 29.4194 31.6645L29.2686 31.5314L23.3875 25.6517C20.9241 27.6219 17.7996 28.8 14.4 28.8C6.4471 28.8 0 22.3529 0 14.4C0 6.4471 6.4471 0 14.4 0ZM14.4 3.2C8.21441 3.2 3.2 8.21441 3.2 14.4C3.2 20.5856 8.21441 25.6 14.4 25.6C20.5856 25.6 25.6 20.5856 25.6 14.4C25.6 8.21441 20.5856 3.2 14.4 3.2Z" fill="url(#paint0_linear_363_14722)" fill-opacity="0.4"/>
</g>
<defs>
<filter id="filter0_i_363_14722" x="0" y="0" width="32" height="36" filterUnits="userSpaceOnUse" color-interpolation-filters="sRGB">
<feFlood flood-opacity="0" result="BackgroundImageFix"/>
<feBlend mode="normal" in="SourceGraphic" in2="BackgroundImageFix" result="shape"/>
<feColorMatrix in="SourceAlpha" type="matrix" values="0 0 0 0 0 0 0 0 0 0 0 0 0 0 0 0 0 0 127 0" result="hardAlpha"/>
<feOffset dy="4"/>
<feGaussianBlur stdDeviation="2"/>
<feComposite in2="hardAlpha" operator="arithmetic" k2="-1" k3="1"/>
<feColorMatrix type="matrix" values="0 0 0 0 0 0 0 0 0 0.2 0 0 0 0 0.4 0 0 0 0.1 0"/>
<feBlend mode="normal" in2="shape" result="effect1_innerShadow_363_14722"/>
</filter>
<linearGradient id="paint0_linear_363_14722" x1="32.08" y1="3.81571e-07" x2="0.0801012" y2="32.0799" gradientUnits="userSpaceOnUse">
<stop stop-color="#96AAB7"/>
<stop offset="1" stop-color="#728896"/>
</linearGradient>
</defs>
</svg>
