<?xml version="1.0" encoding="utf-8"?>
<svg width="32px" height="32px" viewBox="0 0 32 32" fill="none" xmlns="http://www.w3.org/2000/svg">
  <g filter="url(#filter0_i_767_10448)" style="" transform="matrix(1.023369, 0, 0, 1.049172, -1.397272, 1.305446)">
    <path d="M31.2031 8.42188L17.9375 3.6875C17.2812 3.45312 16.5781 3.45312 15.9219 3.6875L2.75 8.42188C2.28125 8.60938 2 9.03125 2 9.5C2 10.0156 2.28125 10.4375 2.75 10.625L5.5625 11.6094C5 12.3594 4.57812 13.2031 4.39062 14.1406C3.875 14.375 3.5 14.8906 3.5 15.5C3.5 15.9688 3.6875 16.3906 4.01562 16.6719L2.89062 23.6562C2.79688 24.125 3.17188 24.5 3.59375 24.5H6.35938C6.78125 24.5 7.15625 24.125 7.0625 23.6562L5.9375 16.6719C6.26562 16.3906 6.5 15.9688 6.5 15.5C6.5 15.0312 6.21875 14.6094 5.89062 14.375C6.07812 13.5312 6.5 12.7812 7.0625 12.1719L15.9688 15.3594C16.625 15.5938 17.3281 15.5938 17.9844 15.3594L31.2031 10.625C31.6719 10.4375 32 10.0156 32 9.5C32 9.03125 31.6719 8.60938 31.2031 8.42188ZM18.4531 16.7656C17.9844 16.9531 17.4688 17 17 17C16.4844 17 15.9688 16.9531 15.5 16.7656L8.65625 14.3281L8 21.0312C8 22.9531 11.9844 24.5 17 24.5C21.9219 24.5 26 22.9531 26 21.0312L25.2969 14.3281L18.4531 16.7656Z" fill="url(#paint0_linear_767_10448)" fill-opacity="0.4"/>
  </g>
  <defs>
    <filter id="filter0_i_767_10448" x="2" y="3.45312" width="30" height="25.0469" filterUnits="userSpaceOnUse" color-interpolation-filters="sRGB">
      <feFlood flood-opacity="0" result="BackgroundImageFix"/>
      <feBlend mode="normal" in="SourceGraphic" in2="BackgroundImageFix" result="shape"/>
      <feColorMatrix in="SourceAlpha" type="matrix" values="0 0 0 0 0 0 0 0 0 0 0 0 0 0 0 0 0 0 127 0" result="hardAlpha"/>
      <feOffset dy="4"/>
      <feGaussianBlur stdDeviation="2"/>
      <feComposite in2="hardAlpha" operator="arithmetic" k2="-1" k3="1"/>
      <feColorMatrix type="matrix" values="0 0 0 0 0 0 0 0 0 0.2 0 0 0 0 0.4 0 0 0 0.1 0"/>
      <feBlend mode="normal" in2="shape" result="effect1_innerShadow_767_10448"/>
    </filter>
    <linearGradient id="paint0_linear_767_10448" x1="32.075" y1="3.23441e-07" x2="5.09391" y2="29.9154" gradientUnits="userSpaceOnUse">
      <stop stop-color="#96AAB7"/>
      <stop offset="1" stop-color="#728896"/>
    </linearGradient>
  </defs>
</svg>