#FIG 3.2  Produced by xfig version 3.2.5b
Landscape
Center
Metric
A4      
100.00
Single
-2
1200 2
5 1 0 1 0 7 50 0 -1 4.000 0 0 1 0 4612.500 3217.500 4500 2655 4725 2655 4860 2700
	1 1 1.00 60.00 120.00
6 2115 2250 2385 2475
2 3 0 1 0 7 50 0 -1 4.000 0 0 -1 0 0 4
	 2115 2430 2250 2250 2385 2430 2115 2430
2 1 0 1 0 7 50 0 -1 4.000 0 0 -1 0 0 2
	 2115 2475 2385 2475
-6
6 8865 2205 9135 2430
2 3 1 1 0 7 50 0 -1 4.000 0 0 -1 0 0 4
	 8865 2385 9000 2205 9135 2385 8865 2385
2 1 1 1 0 7 50 0 -1 4.000 0 0 -1 0 0 2
	 8865 2430 9135 2430
-6
6 5760 3420 5985 3825
4 0 0 50 0 1 24 0.0000 4 270 180 5760 3690 J\001
4 0 0 50 0 1 18 0.0000 4 195 150 5850 3825 2\001
-6
6 4050 3600 4455 3825
4 0 0 50 0 1 24 1.5708 4 270 180 4320 3825 J\001
4 0 0 50 0 1 18 1.5708 4 195 150 4455 3735 2\001
-6
6 7470 2520 7695 2925
4 0 0 50 0 1 24 0.0000 4 270 180 7470 2790 J\001
4 0 0 50 0 1 18 0.0000 4 195 150 7560 2925 1\001
-6
6 6345 3420 6570 3825
4 0 0 50 0 1 24 0.0000 4 270 180 6345 3690 J\001
4 0 0 50 0 1 18 0.0000 4 195 150 6435 3825 1\001
-6
2 1 0 2 0 7 50 0 -1 0.000 0 0 -1 0 0 2
	 2250 2250 9000 2250
2 1 0 2 0 7 50 0 -1 0.000 0 0 -1 0 0 2
	 4500 2250 4500 4500
2 1 3 2 0 7 50 0 -1 6.000 0 0 -1 0 0 2
	 9000 1305 9000 4680
2 1 0 1 0 7 50 0 -1 4.000 0 0 -1 0 0 2
	 4275 4500 4770 4500
2 1 0 1 0 7 50 0 -1 4.000 0 0 -1 0 0 2
	 4365 4500 4320 4590
2 1 0 1 0 7 50 0 -1 4.000 0 0 -1 0 0 2
	 4455 4500 4410 4590
2 1 0 1 0 7 50 0 -1 4.000 0 0 -1 0 0 2
	 4545 4500 4500 4590
2 1 0 1 0 7 50 0 -1 4.000 0 0 -1 0 0 2
	 4635 4500 4590 4590
2 1 0 1 0 7 50 0 -1 4.000 0 0 -1 0 0 2
	 4725 4500 4680 4590
2 1 0 1 0 7 50 0 -1 4.000 0 0 -1 0 0 2
	 2250 2880 2250 5130
2 1 0 1 0 7 50 0 -1 4.000 0 0 -1 0 0 2
	 4500 4725 4500 5130
2 1 0 1 0 7 50 0 -1 4.000 0 0 -1 0 0 2
	 9000 4770 9000 5130
2 1 0 1 0 7 50 0 -1 4.000 0 0 -1 1 1 2
	1 1 1.00 60.00 120.00
	1 1 1.00 60.00 120.00
	 2250 4995 4500 4995
2 1 0 1 0 7 50 0 -1 4.000 0 0 -1 1 1 2
	1 1 1.00 60.00 120.00
	1 1 1.00 60.00 120.00
	 4500 4995 9000 4995
2 1 0 1 0 7 50 0 -1 4.000 0 0 -1 0 0 2
	 9225 2250 9675 2250
2 1 0 1 0 7 50 0 -1 4.000 0 0 -1 1 1 2
	1 1 1.00 60.00 120.00
	1 1 1.00 60.00 120.00
	 9585 4500 9585 2205
2 1 1 2 0 7 50 0 -1 6.000 0 0 -1 0 0 5
	 4500 4500 4500 3915 4680 3375 4860 2835 4950 2250
2 1 0 2 0 7 50 0 -1 6.000 0 0 -1 1 0 2
	1 1 2.00 120.00 240.00
	 6975 1980 7965 1980
2 1 0 1 0 7 50 0 -1 4.000 0 0 -1 0 0 2
	 9450 2205 9450 1710
2 1 0 1 0 7 50 0 -1 4.000 0 0 -1 0 0 2
	 4950 2160 4950 1710
2 1 0 1 0 7 50 0 -1 4.000 0 0 -1 0 0 2
	 4500 2160 4500 1710
2 1 0 1 0 7 50 0 -1 4.000 0 0 -1 0 0 2
	 2745 2205 2745 1755
2 1 0 1 0 7 50 0 -1 4.000 0 0 -1 0 0 2
	 2250 2205 2250 1755
2 1 0 1 0 7 50 0 -1 4.000 0 0 -1 1 0 2
	1 1 1.00 60.00 120.00
	 2295 1935 2745 1935
2 1 0 1 0 7 50 0 -1 4.000 0 0 -1 1 0 2
	1 1 1.00 60.00 120.00
	 4500 1890 4950 1890
2 1 0 1 0 7 50 0 -1 4.000 0 0 -1 1 0 2
	1 1 1.00 60.00 120.00
	 9000 1890 9450 1890
2 1 3 2 0 7 50 0 -1 6.000 0 0 -1 0 0 2
	 4500 4500 4950 2250
2 1 0 1 0 7 50 0 -1 4.000 0 0 -1 0 0 2
	 9225 4500 9675 4500
3 0 1 2 0 7 50 0 -1 6.000 0 0 0 6
	 2700 2250 3915 2070 4950 2250 6525 2475 7695 2520 9450 2250
	 0.000 1.000 1.000 1.000 1.000 0.000
4 0 0 50 0 1 24 0.0000 4 270 180 3105 2790 J\001
4 0 0 50 0 1 18 0.0000 4 195 150 3195 2925 1\001
4 0 0 50 0 0 24 0.0000 4 270 210 4230 4455 1\001
4 0 0 50 0 0 24 0.0000 4 270 210 2385 2700 2\001
4 0 0 50 0 0 24 0.0000 4 270 210 4185 2700 3\001
4 0 0 50 0 0 24 0.0000 4 270 210 8595 2655 4\001
4 0 0 50 0 0 24 0.0000 4 285 210 3285 4950 5\001
4 0 0 50 0 0 24 0.0000 4 270 420 6660 4905 10\001
4 0 0 50 0 0 24 1.5708 4 285 210 9540 3825 5\001
4 0 0 50 0 1 24 0.0000 4 285 915 6075 3735 =   /8\001
4 0 0 50 0 1 24 0.0000 4 270 585 7200 1845 F/2\001
4 0 0 50 0 1 24 0.0000 4 180 210 2385 1890 u\001
4 0 0 50 0 1 24 0.0000 4 180 210 4635 1845 u\001
4 0 0 50 0 1 24 0.0000 4 180 210 9180 1800 u\001
4 0 0 50 0 32 24 0.0000 4 375 1305 4995 2925 y   (<0)\001
4 0 0 50 0 0 18 0.0000 4 240 375 5220 3015 1,3\001
