#FIG 3.2  Produced by xfig version 3.2.5c
Landscape
Center
Inches
A4      
100.00
Single
-2
1200 2
6 7620 4740 10620 7260
2 1 0 3 0 7 50 -1 -1 0.000 0 0 -1 0 0 2
	 8160 7200 10560 4800
2 1 0 3 0 7 50 -1 -1 0.000 0 0 -1 0 0 2
	 9360 7200 10560 4800
2 1 0 1 0 7 50 -1 -1 0.000 0 0 -1 0 0 2
	 7620 7200 9900 7200
-6
6 10560 4560 10920 4980
2 3 0 1 0 7 50 -1 -1 4.000 0 0 -1 0 0 4
	 10560 4800 10800 4560 10800 4980 10560 4800
2 1 0 1 0 7 50 -1 -1 4.000 0 0 -1 0 0 2
	 10920 4560 10920 4980
-6
6 11820 4740 14820 7260
2 1 0 3 0 7 50 -1 -1 0.000 0 0 -1 0 0 2
	 12360 7200 14760 4800
2 1 0 3 0 7 50 -1 -1 0.000 0 0 -1 0 0 2
	 13560 7200 14760 4800
2 1 0 1 0 7 50 -1 -1 0.000 0 0 -1 0 0 2
	 11820 7200 14100 7200
-6
6 660 4740 6120 7260
2 1 1 1 0 7 50 -1 -1 4.000 0 0 -1 0 0 2
	 1140 7020 3420 4740
2 1 0 3 0 7 50 -1 -1 0.000 0 0 -1 0 0 2
	 1200 7200 3600 4800
2 1 0 3 0 7 50 -1 -1 0.000 0 0 -1 0 0 2
	 2400 7200 3600 4800
2 1 0 1 0 7 50 -1 -1 0.000 0 0 -1 0 0 2
	 660 7200 2940 7200
2 1 0 3 0 7 50 -1 -1 0.000 0 0 -1 0 0 2
	 6000 7200 3600 4800
2 1 0 3 0 7 50 -1 -1 0.000 0 0 -1 0 0 2
	 4800 7200 3600 4800
4 0 0 50 -1 0 24 0.0000 4 270 210 840 7140 1\001
4 0 0 50 -1 0 24 0.0000 4 270 210 2100 7200 2\001
4 0 0 50 -1 0 24 0.0000 4 270 210 4200 7080 3\001
4 0 0 50 -1 0 24 0.0000 4 270 210 5880 7080 4\001
4 0 0 50 -1 0 24 0.0000 4 285 210 3120 5040 5\001
4 0 0 50 -1 0 24 0.7854 4 270 1065 1740 6300 t=20K\001
-6
6 8880 9300 14580 11820
2 1 0 3 0 7 50 -1 -1 0.000 0 0 -1 0 0 2
	 9420 11760 11820 9360
2 1 0 3 0 7 50 -1 -1 0.000 0 0 -1 0 0 2
	 10620 11760 11820 9360
2 1 0 1 0 7 50 -1 -1 0.000 0 0 -1 0 0 2
	 8880 11760 11160 11760
2 1 0 3 0 7 50 -1 -1 0.000 0 0 -1 0 0 2
	 14220 11760 11820 9360
2 1 0 3 0 7 50 -1 -1 0.000 0 0 -1 0 0 2
	 13020 11760 11820 9360
2 1 0 1 0 7 50 -1 -1 0.000 0 0 -1 0 0 2
	 12300 11760 14580 11760
4 0 0 50 -1 0 24 0.0000 4 270 210 9060 11700 1\001
4 0 0 50 -1 0 24 0.0000 4 270 210 10320 11760 2\001
4 0 0 50 -1 0 24 0.0000 4 270 210 12420 11640 3\001
4 0 0 50 -1 0 24 0.0000 4 270 210 14100 11640 4\001
4 0 0 50 -1 0 24 0.0000 4 285 210 11340 9600 5\001
4 0 0 50 -1 0 24 0.7854 4 270 1080 9780 11280 -0.071\001
4 0 0 50 -1 0 24 1.0472 4 285 945 10680 11460 0.075\001
4 0 0 50 -1 0 24 5.2360 4 270 1080 12600 10680 -0.001\001
4 0 0 50 -1 0 24 5.4978 4 270 1080 12960 10380 -0.023\001
-6
6 1800 9300 4800 11820
2 1 0 3 0 7 50 -1 -1 0.000 0 0 -1 0 0 2
	 2340 11760 4740 9360
2 1 0 3 0 7 50 -1 -1 0.000 0 0 -1 0 0 2
	 3540 11760 4740 9360
2 1 0 1 0 7 50 -1 -1 0.000 0 0 -1 0 0 2
	 1800 11760 4080 11760
-6
6 5160 8640 8460 11820
2 1 0 1 0 7 50 -1 -1 4.000 0 0 -1 1 0 2
	1 1 1.00 60.00 120.00
	 8100 9360 8100 8640
2 1 0 3 0 7 50 -1 -1 0.000 0 0 -1 0 0 2
	 5700 11760 8100 9360
2 1 0 3 0 7 50 -1 -1 0.000 0 0 -1 0 0 2
	 6900 11760 8100 9360
2 1 0 1 0 7 50 -1 -1 0.000 0 0 -1 0 0 2
	 5160 11760 7440 11760
4 0 0 50 -1 0 24 0.7854 4 270 870 6120 11160 -1.41\001
4 0 0 50 -1 0 24 1.0472 4 270 735 6900 11460 2.24\001
4 0 0 50 -1 0 24 0.0000 4 270 210 8220 9240 1\001
-6
6 4500 9000 4920 9360
2 3 0 1 0 7 50 -1 -1 4.000 0 0 -1 0 0 4
	 4740 9360 4500 9120 4920 9120 4740 9360
2 1 0 1 0 7 50 -1 -1 4.000 0 0 -1 0 0 2
	 4500 9000 4920 9000
-6
2 1 0 1 0 7 50 -1 -1 0.000 0 0 -1 0 0 2
	 1200 7620 1200 8040
2 1 0 1 0 7 50 -1 -1 0.000 0 0 -1 0 0 2
	 6000 7500 6000 7920
2 1 0 1 0 7 50 -1 -1 0.000 0 0 -1 0 0 2
	 4800 7560 4800 7980
2 1 0 1 0 7 50 -1 -1 0.000 0 0 -1 0 0 2
	 2400 7620 2400 8040
2 1 0 1 0 7 50 -1 -1 0.000 0 0 -1 0 0 2
	 6540 4800 7020 4800
2 1 0 1 0 7 50 -1 -1 0.000 0 0 -1 0 0 2
	 6600 7200 7080 7200
2 1 0 1 0 7 50 -1 -1 0.000 0 0 -1 1 1 2
	1 1 1.00 60.00 120.00
	1 1 1.00 60.00 120.00
	 1200 7920 2400 7920
2 1 0 1 0 7 50 -1 -1 0.000 0 0 -1 1 1 2
	1 1 1.00 60.00 120.00
	1 1 1.00 60.00 120.00
	 2400 7920 3600 7920
2 1 0 1 0 7 50 -1 -1 0.000 0 0 -1 1 1 2
	1 1 1.00 60.00 120.00
	1 1 1.00 60.00 120.00
	 3600 7920 4800 7920
2 1 0 1 0 7 50 -1 -1 0.000 0 0 -1 0 0 1
	 4800 7920
2 1 0 1 0 7 50 -1 -1 0.000 0 0 -1 1 1 2
	1 1 1.00 60.00 120.00
	1 1 1.00 60.00 120.00
	 4800 7920 6000 7920
2 1 0 1 0 7 50 -1 -1 0.000 0 0 -1 1 1 2
	1 1 1.00 60.00 120.00
	1 1 1.00 60.00 120.00
	 6960 7200 6960 4800
2 1 0 1 0 7 50 -1 -1 0.000 0 0 -1 0 0 2
	 3600 7200 3600 8040
2 1 1 1 0 7 50 -1 -1 4.000 0 0 -1 0 0 2
	 8040 7080 10320 4800
2 1 0 1 0 7 50 -1 -1 4.000 0 0 -1 1 0 2
	1 1 1.00 60.00 120.00
	 10620 4800 11760 4800
2 1 0 1 0 7 50 -1 -1 4.000 0 0 -1 1 0 2
	1 1 1.00 60.00 120.00
	 14820 4800 15360 4800
2 1 0 1 0 7 50 -1 -1 0.000 0 0 -1 0 0 2
	 960 7200 720 7440
2 1 0 1 0 7 50 -1 -1 0.000 0 0 -1 0 0 2
	 1260 7200 1020 7440
2 1 0 1 0 7 50 -1 -1 0.000 0 0 -1 0 0 2
	 1560 7200 1320 7440
2 1 0 1 0 7 50 -1 -1 0.000 0 0 -1 0 0 2
	 1860 7200 1620 7440
2 1 0 1 0 7 50 -1 -1 0.000 0 0 -1 0 0 2
	 2160 7200 1920 7440
2 1 0 1 0 7 50 -1 -1 0.000 0 0 -1 0 0 2
	 2460 7200 2220 7440
2 1 0 1 0 7 50 -1 -1 0.000 0 0 -1 0 0 2
	 2760 7200 2520 7440
2 1 0 1 0 7 50 -1 -1 0.000 0 0 -1 0 0 2
	 6240 7200 6480 7440
2 1 0 1 0 7 50 -1 -1 0.000 0 0 -1 0 0 2
	 5940 7200 6180 7440
2 1 0 1 0 7 50 -1 -1 0.000 0 0 -1 0 0 2
	 5640 7200 5880 7440
2 1 0 1 0 7 50 -1 -1 0.000 0 0 -1 0 0 2
	 5340 7200 5580 7440
2 1 0 1 0 7 50 -1 -1 0.000 0 0 -1 0 0 2
	 5040 7200 5280 7440
2 1 0 1 0 7 50 -1 -1 0.000 0 0 -1 0 0 2
	 4740 7200 4980 7440
2 1 0 1 0 7 50 -1 -1 0.000 0 0 -1 0 0 2
	 4440 7200 4680 7440
2 1 0 1 0 7 50 -1 -1 0.000 0 0 -1 0 0 2
	 6540 7200 4260 7200
2 1 1 1 0 7 50 -1 -1 4.000 0 0 -1 0 0 2
	 2250 11670 4530 9390
2 1 0 1 0 7 50 -1 -1 4.000 0 0 -1 1 0 2
	1 1 1.00 60.00 120.00
	 4740 9360 4740 8400
4 0 0 50 -1 0 24 0.0000 4 285 210 3000 7860 5\001
4 0 0 50 -1 0 24 0.0000 4 285 210 4200 7860 5\001
4 0 0 50 -1 0 24 0.0000 4 285 210 5280 7860 5\001
4 0 0 50 -1 0 24 0.0000 4 285 210 1740 7860 5\001
4 0 0 50 -1 0 24 1.5708 4 270 420 6900 6120 10\001
4 0 0 50 -1 0 24 0.7854 4 270 1065 8640 6300 t=20K\001
4 0 0 50 -1 0 24 0.0000 4 360 2490 7680 4440 symmetric part\001
4 0 0 50 -1 0 24 0.0000 4 270 2190 7680 4860 redundant X:\001
4 0 0 50 -1 0 24 0.0000 4 270 300 12960 4620 N\001
4 0 0 50 -1 0 20 0.0000 4 225 165 13260 4740 1\001
4 0 0 50 -1 0 24 0.0000 4 270 210 14940 4800 1\001
4 0 0 50 -1 0 24 0.7854 4 270 735 12840 6600 2.83\001
4 0 0 50 -1 0 24 1.0472 4 270 870 13500 7080 -2.24\001
4 0 0 50 -1 0 24 0.7854 4 270 1065 2820 10980 t=20K\001
4 0 0 50 -1 0 24 0.0000 4 270 300 4860 8940 X\001
4 0 0 50 -1 0 24 0.0000 4 360 3120 1140 9180 antisymmetric part\001
4 0 0 50 -1 0 24 0.0000 4 270 2070 1140 9780 redundant X\001
4 0 0 50 -1 0 20 0.0000 4 150 150 5220 9000 a\001
4 0 0 50 -1 0 20 0.0000 4 150 135 11520 4740 s\001
4 0 0 50 -1 0 24 0.0000 4 270 300 11220 4680 X\001
4 0 0 50 -1 0 20 0.0000 4 150 135 9720 4980 s\001
4 0 0 50 -1 0 20 0.0000 4 150 150 5220 9000 a\001
4 0 0 50 -1 0 20 0.0000 4 150 150 3180 9780 a\001
4 0 0 50 -1 0 24 0.0000 4 270 300 6540 8940 N\001
4 0 0 50 -1 0 24 0.0000 4 270 300 10800 8940 N\001
4 0 0 50 -1 0 20 0.0000 4 225 165 6780 9060 1\001
