#FIG 3.2
Landscape
Center
Inches
Letter  
100.00
Single
-2
1200 2
5 1 0 2 0 7 100 0 -1 6.000 0 1 1 0 7425.000 2415.000 7650 2025 7200 2025 6975 2400
	1 1 2.00 120.00 240.00
6 5850 2400 6150 2775
2 1 0 1 0 7 50 0 -1 4.000 0 0 -1 0 0 2
	 5850 2775 6150 2775
2 3 0 1 0 7 50 0 -1 4.000 0 0 -1 0 0 4
	 5850 2700 6000 2400 6150 2700 5850 2700
-6
6 7200 2325 12300 2775
6 12000 2400 12300 2775
2 1 0 1 0 7 50 0 -1 4.000 0 0 -1 0 0 2
	 12000 2775 12300 2775
2 3 0 1 0 7 50 0 -1 4.000 0 0 -1 0 0 4
	 12000 2700 12150 2400 12300 2700 12000 2700
-6
2 1 0 3 0 7 50 0 -1 8.000 0 0 -1 0 0 2
	 7350 2400 12150 2400
2 3 0 1 0 7 50 0 -1 4.000 0 0 -1 0 0 4
	 7200 2700 7350 2400 7500 2700 7200 2700
-6
6 1125 5100 6225 5550
6 5925 5175 6225 5550
2 1 0 1 0 7 50 0 -1 4.000 0 0 -1 0 0 2
	 5925 5550 6225 5550
2 3 0 1 0 7 50 0 -1 4.000 0 0 -1 0 0 4
	 5925 5475 6075 5175 6225 5475 5925 5475
-6
2 1 0 3 0 7 50 0 -1 8.000 0 0 -1 0 0 2
	 1275 5175 6075 5175
2 3 0 1 0 7 50 0 -1 4.000 0 0 -1 0 0 4
	 1125 5475 1275 5175 1425 5475 1125 5475
-6
6 7200 5100 12300 5550
6 12000 5175 12300 5550
2 1 0 1 0 7 50 0 -1 4.000 0 0 -1 0 0 2
	 12000 5550 12300 5550
2 3 0 1 0 7 50 0 -1 4.000 0 0 -1 0 0 4
	 12000 5475 12150 5175 12300 5475 12000 5475
-6
2 1 0 3 0 7 50 0 -1 8.000 0 0 -1 0 0 2
	 7350 5175 12150 5175
2 3 0 1 0 7 50 0 -1 4.000 0 0 -1 0 0 4
	 7200 5475 7350 5175 7500 5475 7200 5475
-6
6 6750 4425 7200 4800
4 0 0 50 0 0 32 0.0000 4 330 225 6975 4800 1\001
4 0 0 50 0 32 32 0.0000 4 345 225 6750 4800 d\001
-6
6 1125 8475 6225 8925
6 5925 8550 6225 8925
2 1 0 1 0 7 50 0 -1 4.000 0 0 -1 0 0 2
	 5925 8925 6225 8925
2 3 0 1 0 7 50 0 -1 4.000 0 0 -1 0 0 4
	 5925 8850 6075 8550 6225 8850 5925 8850
-6
2 1 0 3 0 7 50 0 -1 8.000 0 0 -1 0 0 2
	 1275 8550 6075 8550
2 3 0 1 0 7 50 0 -1 4.000 0 0 -1 0 0 4
	 1125 8850 1275 8550 1425 8850 1125 8850
-6
2 1 0 1 0 7 50 0 -1 4.000 0 0 -1 0 0 2
	 1200 3000 1200 3450
2 1 0 1 0 7 50 0 -1 4.000 0 0 -1 0 0 2
	 3600 2775 3600 3450
2 1 0 1 0 7 50 0 -1 4.000 0 0 -1 0 0 2
	 6000 2850 6000 3375
2 1 0 1 0 7 50 0 -1 4.000 0 0 -1 1 1 2
	1 1 1.00 60.00 120.00
	1 1 1.00 60.00 120.00
	 1200 3300 3600 3300
2 1 0 1 0 7 50 0 -1 4.000 0 0 -1 1 1 2
	1 1 1.00 60.00 120.00
	1 1 1.00 60.00 120.00
	 3600 3300 6000 3300
2 1 0 3 0 7 50 0 -1 8.000 0 0 -1 0 0 2
	 1200 11775 6000 11775
2 1 0 3 0 7 50 0 -1 8.000 0 0 -1 0 0 2
	 7200 11775 12000 11775
2 1 0 2 0 7 50 0 -1 6.000 0 0 -1 0 0 4
	 6000 11775 3600 12600 1200 10800 1200 11775
2 1 0 2 0 7 50 0 -1 6.000 0 0 -1 1 0 2
	1 1 2.00 120.00 240.00
	 9750 1575 9750 2325
2 1 0 3 0 7 50 0 -1 8.000 0 0 -1 0 0 2
	 1200 2400 6000 2400
2 1 0 2 0 7 50 0 -1 6.000 0 0 -1 0 0 2
	 1200 1950 1200 2925
2 1 0 1 0 7 50 0 -1 4.000 0 0 -1 0 0 2
	 975 2175 1200 1950
2 1 0 1 0 7 50 0 -1 4.000 0 0 -1 0 0 2
	 975 2400 1200 2175
2 1 0 1 0 7 50 0 -1 4.000 0 0 -1 0 0 2
	 975 2625 1200 2400
2 1 0 1 0 7 50 0 -1 4.000 0 0 -1 0 0 2
	 975 2850 1200 2625
2 1 0 2 0 7 50 0 -1 6.000 0 0 -1 1 0 2
	1 1 2.00 120.00 240.00
	 3600 1575 3600 2325
2 1 0 2 0 7 50 0 -1 6.000 0 0 -1 1 0 2
	1 1 2.00 120.00 240.00
	 3600 4425 3600 5175
2 1 0 1 0 7 100 0 -1 4.000 0 0 -1 0 0 3
	 1275 5175 3600 6300 6075 5175
2 1 0 1 0 7 100 0 -1 4.000 0 0 -1 0 0 3
	 7350 5175 7350 4275 12150 5175
2 1 0 1 0 7 100 0 -1 4.000 0 0 -1 0 0 3
	 1270 8577 1270 7677 6070 8577
2 1 0 2 0 7 100 0 -1 6.000 0 0 -1 0 0 6
	 12000 11775 12000 12300 9600 12300 9600 10800 7200 10800 7200 11775
4 0 0 50 0 32 32 0.0000 4 330 345 1350 3000 A\001
4 0 0 50 0 0 32 0.0000 4 330 315 5550 2925 B\001
4 0 0 50 0 0 32 0.0000 4 330 270 3825 2025 F\001
4 0 0 50 0 0 24 0.0000 4 255 3990 7650 1650 PRIMARY STRUCTURE:\001
4 0 0 50 0 0 32 0.0000 4 390 480 2100 3225 l/2\001
4 0 0 50 0 0 32 0.0000 4 390 480 4500 3225 l/2\001
4 0 0 50 0 0 24 0.0000 4 255 2130 8625 4275 L.C.2 - virtual\001
4 0 0 50 0 0 32 0.0000 4 330 1605 5250 4050 STEP 1:\001
4 0 0 50 0 0 32 0.0000 4 330 1605 5400 7125 STEP 2:\001
4 0 0 50 0 0 24 0.0000 4 255 1830 2175 7425 L.C. 2 - real\001
4 0 0 50 0 0 24 0.0000 4 255 1740 2175 4350 L.C.1 - real\001
4 0 0 50 0 0 24 0.0000 4 255 4095 7950 7800 The virtual L.C. is the same\001
4 0 0 50 0 0 24 0.0000 4 255 2025 7950 8220 as in STEP 1.\001
4 0 0 50 0 0 32 0.0000 4 435 5640 3675 9975 Final internal forces diagrams\001
4 0 0 50 0 0 24 0.0000 4 300 1035 3975 12750 5/32 Fl\001
4 0 0 50 0 0 24 0.0000 4 300 1035 1800 11175 3/16 Fl\001
4 0 0 50 0 0 24 0.0000 4 255 420 1275 10575 M:\001
4 0 0 50 0 0 24 0.0000 4 255 345 8400 10575 V:\001
4 0 0 50 0 0 32 0.0000 4 330 345 6825 1950 X\001
4 0 0 50 0 0 32 0.0000 4 330 270 3675 4875 F\001
4 0 0 100 0 0 24 0.0000 4 300 585 4125 6450 Fl/4\001
4 0 0 50 0 0 32 0.0000 4 330 225 975 8325 1\001
4 0 0 50 0 0 24 0.0000 4 300 1155 10350 12675 -5/16 F\001
4 0 0 100 0 0 24 0.0000 4 300 1125 9675 11025 11/16 F\001
