#FIG 3.2
Landscape
Center
Inches
Letter  
100.00
Single
-2
1200 2
6 975 3600 1500 3750
2 1 0 1 0 7 100 0 -1 0.000 0 0 -1 0 0 2
	 975 3600 1500 3600
2 1 0 1 0 7 100 0 -1 0.000 0 0 -1 0 0 2
	 1125 3600 975 3750
2 1 0 1 0 7 100 0 -1 0.000 0 0 -1 0 0 2
	 1275 3600 1125 3750
2 1 0 1 0 7 100 0 -1 0.000 0 0 -1 0 0 2
	 1425 3600 1275 3750
-6
6 3300 3525 3825 3675
2 1 0 1 0 7 100 0 -1 0.000 0 0 -1 0 0 2
	 3300 3525 3825 3525
2 1 0 1 0 7 100 0 -1 0.000 0 0 -1 0 0 2
	 3450 3525 3300 3675
2 1 0 1 0 7 100 0 -1 0.000 0 0 -1 0 0 2
	 3600 3525 3450 3675
2 1 0 1 0 7 100 0 -1 0.000 0 0 -1 0 0 2
	 3750 3525 3600 3675
-6
1 4 0 1 0 7 100 0 -1 0.000 1 0.0000 1200 1200 75 75 1125 1200 1275 1200
2 1 0 3 0 7 100 0 -1 0.000 0 0 -1 0 0 2
	 1200 3600 1200 1275
2 1 0 3 0 7 100 0 -1 0.000 0 0 -1 0 0 2
	 1275 1200 4575 1200
2 1 0 3 0 7 100 0 -1 0.000 0 0 -1 0 0 2
	 3600 1200 3600 3525
2 1 0 2 0 7 100 0 -1 0.000 0 0 -1 1 0 2
	1 1 1.00 60.00 120.00
	 4575 1275 4575 1950
2 1 0 1 0 7 100 0 -1 0.000 0 0 -1 0 0 2
	 1200 3825 1200 4275
2 1 0 1 0 7 100 0 -1 0.000 0 0 -1 0 0 2
	 3600 3750 3600 4200
2 1 0 1 0 7 100 0 -1 0.000 0 0 -1 0 0 2
	 4725 1200 5175 1200
2 1 0 1 0 7 100 0 -1 0.000 0 0 -1 0 0 2
	 4650 3600 5100 3600
2 1 0 1 0 7 100 0 -1 0.000 0 0 -1 0 0 2
	 4575 3750 4575 4200
2 1 0 1 0 7 100 0 -1 0.000 0 0 -1 1 1 2
	1 1 1.00 60.00 120.00
	1 1 1.00 60.00 120.00
	 1200 4200 3600 4200
2 1 0 1 0 7 100 0 -1 0.000 0 0 -1 1 1 2
	1 1 1.00 60.00 120.00
	1 1 1.00 60.00 120.00
	 3600 4200 4575 4200
2 1 0 1 0 7 100 0 -1 0.000 0 0 -1 1 1 2
	1 1 1.00 60.00 120.00
	1 1 1.00 60.00 120.00
	 4950 3600 4950 1200
4 0 0 100 0 0 24 0.0000 4 255 180 1350 3525 1\001
4 0 0 100 0 0 24 0.0000 4 255 180 3300 3450 2\001
4 0 0 100 0 0 24 0.0000 4 255 180 1350 1650 3\001
4 0 0 100 0 0 24 0.0000 4 255 180 3300 1650 4\001
4 0 0 100 0 0 24 0.0000 4 255 180 4125 4125 2\001
4 0 0 100 0 0 24 0.0000 4 255 180 2325 4125 5\001
4 0 0 100 0 0 24 1.5708 4 255 180 4800 2475 5\001
4 0 0 100 0 1 32 0.0000 4 330 225 4200 1950 1\001
