#FIG 3.2
Landscape
Center
Inches
Letter  
100.00
Single
-2
1200 2
6 1125 1125 3675 6075
2 2 0 3 0 7 50 0 -1 0.000 0 0 -1 0 0 5
	 1200 6000 3600 6000 3600 1200 1200 1200 1200 6000
2 1 0 3 0 7 50 0 -1 0.000 0 0 -1 0 0 2
	 1200 3600 3600 3600
2 1 0 3 0 7 50 0 -1 0.000 0 0 -1 0 0 3
	 1200 3600 2400 6000 3600 3600
2 1 0 3 0 7 50 0 -1 0.000 0 0 -1 0 0 3
	 1200 1200 2400 3600 3600 1200
-6
6 5550 1125 8250 6300
6 5625 1125 8175 6075
2 2 0 3 0 7 50 0 -1 0.000 0 0 -1 0 0 5
	 5700 6000 8100 6000 8100 1200 5700 1200 5700 6000
2 1 0 3 0 7 50 0 -1 0.000 0 0 -1 0 0 2
	 5700 3600 8100 3600
2 1 0 3 0 7 50 0 -1 0.000 0 0 -1 0 0 3
	 5700 3600 6900 6000 8100 3600
2 1 0 3 0 7 50 0 -1 0.000 0 0 -1 0 0 3
	 5700 1200 6900 3600 8100 1200
-6
2 3 0 1 0 7 50 0 -1 0.000 0 0 -1 0 0 4
	 5550 6225 5700 6000 5850 6225 5550 6225
2 3 0 1 0 7 50 0 -1 0.000 0 0 -1 0 0 4
	 7950 6225 8100 6000 8250 6225 7950 6225
2 1 0 1 0 7 50 0 -1 0.000 0 0 -1 0 0 2
	 7950 6300 8250 6300
-6
6 9600 1125 12300 6300
6 9675 1125 12225 6075
2 2 0 3 0 7 50 0 -1 0.000 0 0 -1 0 0 5
	 9750 6000 12150 6000 12150 1200 9750 1200 9750 6000
2 1 0 3 0 7 50 0 -1 0.000 0 0 -1 0 0 2
	 9750 3600 12150 3600
2 1 0 3 0 7 50 0 -1 0.000 0 0 -1 0 0 3
	 9750 3600 10950 6000 12150 3600
2 1 0 3 0 7 50 0 -1 0.000 0 0 -1 0 0 3
	 9750 1200 10950 3600 12150 1200
-6
2 3 0 1 0 7 50 0 -1 0.000 0 0 -1 0 0 4
	 9600 6225 9750 6000 9900 6225 9600 6225
2 3 0 1 0 7 50 0 -1 0.000 0 0 -1 0 0 4
	 12000 6225 12150 6000 12300 6225 12000 6225
2 1 0 1 0 7 50 0 -1 0.000 0 0 -1 0 0 2
	 12000 6300 12300 6300
-6
6 12450 1350 12900 1725
4 0 0 50 0 0 32 0.0000 4 330 225 12675 1725 1\001
4 0 0 50 0 32 32 0.0000 4 345 225 12450 1725 d\001
-6
6 1050 6975 3750 12675
6 1050 7500 3750 12675
6 1125 7500 3675 12450
2 2 0 3 0 7 50 0 -1 0.000 0 0 -1 0 0 5
	 1200 12375 3600 12375 3600 7575 1200 7575 1200 12375
2 1 0 3 0 7 50 0 -1 0.000 0 0 -1 0 0 2
	 1200 9975 3600 9975
2 1 0 3 0 7 50 0 -1 0.000 0 0 -1 0 0 3
	 1200 9975 2400 12375 3600 9975
2 1 0 3 0 7 50 0 -1 0.000 0 0 -1 0 0 3
	 1200 7575 2400 9975 3600 7575
-6
2 3 0 1 0 7 50 0 -1 0.000 0 0 -1 0 0 4
	 1050 12600 1200 12375 1350 12600 1050 12600
2 3 0 1 0 7 50 0 -1 0.000 0 0 -1 0 0 4
	 3450 12600 3600 12375 3750 12600 3450 12600
2 1 0 1 0 7 50 0 -1 0.000 0 0 -1 0 0 2
	 3450 12675 3750 12675
-6
6 1425 7125 1875 7500
4 0 0 50 0 0 32 0.0000 4 330 225 1650 7500 1\001
4 0 0 50 0 32 32 0.0000 4 345 225 1425 7500 d\001
-6
2 1 0 2 0 7 50 0 -1 0.000 0 0 -1 1 0 2
	1 1 2.00 120.00 240.00
	 1200 7500 1200 7050
2 1 0 1 0 7 50 0 -1 0.000 0 0 -1 0 0 4
	 1275 8925 1500 8925 1500 9375 1200 9375
2 1 0 1 0 7 50 0 -1 0.000 0 0 -1 0 0 4
	 1200 11175 1500 11175 1500 11625 1200 11625
4 0 0 50 0 0 24 0.0000 4 255 180 1275 9225 1\001
4 0 0 50 0 0 24 0.0000 4 255 180 1275 11550 1\001
4 0 0 50 0 0 24 0.0000 4 255 2025 1650 8250 ALL OTHER\001
4 0 0 50 0 0 24 0.0000 4 255 1380 1650 8670 FORCES\001
4 0 0 50 0 0 24 0.0000 4 255 990 1650 9090 ARE 0\001
-6
6 5025 7500 8475 12675
6 5025 7500 7725 12675
6 5100 7500 7650 12450
2 2 0 3 0 7 50 0 -1 0.000 0 0 -1 0 0 5
	 5175 12375 7575 12375 7575 7575 5175 7575 5175 12375
2 1 0 3 0 7 50 0 -1 0.000 0 0 -1 0 0 2
	 5175 9975 7575 9975
2 1 0 3 0 7 50 0 -1 0.000 0 0 -1 0 0 3
	 5175 9975 6375 12375 7575 9975
2 1 0 3 0 7 50 0 -1 0.000 0 0 -1 0 0 3
	 5175 7575 6375 9975 7575 7575
-6
2 3 0 1 0 7 50 0 -1 0.000 0 0 -1 0 0 4
	 5025 12600 5175 12375 5325 12600 5025 12600
2 3 0 1 0 7 50 0 -1 0.000 0 0 -1 0 0 4
	 7425 12600 7575 12375 7725 12600 7425 12600
2 1 0 1 0 7 50 0 -1 0.000 0 0 -1 0 0 2
	 7425 12675 7725 12675
-6
6 7875 10125 8325 10500
4 0 0 50 0 0 32 0.0000 4 330 225 8100 10500 1\001
4 0 0 50 0 32 32 0.0000 4 345 225 7875 10500 d\001
-6
2 1 0 2 0 7 50 0 -1 0.000 0 0 -1 0 0 1
	 6975 8625
2 1 0 2 0 7 50 0 -1 0.000 0 0 -1 1 0 2
	1 1 2.00 120.00 240.00
	 7725 9975 8400 9975
2 1 0 1 0 7 50 0 -1 0.000 0 0 -1 0 0 4
	 6825 11400 6525 11250 6900 10500 7200 10650
2 1 0 1 0 7 50 0 -1 0.000 0 0 -1 0 0 4
	 5468 10564 5768 10339 6293 11239 5918 11464
2 1 0 1 0 7 50 0 -1 0.000 0 0 -1 0 0 4
	 5400 9975 5400 9600 6000 9600 6000 9975
2 1 0 1 0 7 50 0 -1 0.000 0 0 -1 0 0 4
	 6825 9975 6825 9600 7425 9600 7425 9975
2 1 0 1 0 7 50 0 -1 0.000 0 0 -1 0 0 4
	 5475 12375 5475 12000 5850 12000 5850 12375
2 1 0 1 0 7 50 0 -1 0.000 0 0 -1 0 0 4
	 6825 12300 6825 11925 7125 11925 7125 12300
2 1 0 1 0 7 50 0 -1 0.000 0 0 -1 0 0 4
	 7575 11775 7200 11775 7200 11325 7575 11325
2 1 0 1 0 7 50 0 -1 0.000 0 0 -1 0 0 4
	 5175 11625 5550 11625 5550 11250 5175 11250
4 0 0 50 0 0 24 0.0000 4 255 450 5475 9900 0.5\001
4 0 0 50 0 0 24 0.0000 4 255 450 6900 9900 0.5\001
4 0 0 50 0 0 24 5.2360 4 255 840 5550 10575 -1.12\001
4 0 0 50 0 0 24 1.0472 4 255 630 6825 11325 1.12\001
4 0 0 50 0 0 24 1.5708 4 255 390 7500 11775 -1\001
4 0 0 50 0 0 24 0.0000 4 255 180 5625 12300 1\001
4 0 0 50 0 0 24 0.0000 4 255 180 6900 12300 0\001
4 0 0 50 0 0 24 1.5708 4 255 180 5475 11550 1\001
4 0 0 50 0 0 24 0.0000 4 255 2025 5325 8100 ALL OTHER\001
4 0 0 50 0 0 24 0.0000 4 255 1380 5625 8475 FORCES\001
4 0 0 50 0 0 24 0.0000 4 255 990 5775 8850 ARE 0\001
-6
6 9000 7500 11700 12675
6 9075 7500 11625 12450
2 2 0 3 0 7 50 0 -1 0.000 0 0 -1 0 0 5
	 9150 12375 11550 12375 11550 7575 9150 7575 9150 12375
2 1 0 3 0 7 50 0 -1 0.000 0 0 -1 0 0 2
	 9150 9975 11550 9975
2 1 0 3 0 7 50 0 -1 0.000 0 0 -1 0 0 3
	 9150 9975 10350 12375 11550 9975
2 1 0 3 0 7 50 0 -1 0.000 0 0 -1 0 0 3
	 9150 7575 10350 9975 11550 7575
-6
2 3 0 1 0 7 50 0 -1 0.000 0 0 -1 0 0 4
	 9000 12600 9150 12375 9300 12600 9000 12600
2 3 0 1 0 7 50 0 -1 0.000 0 0 -1 0 0 4
	 11400 12600 11550 12375 11700 12600 11400 12600
2 1 0 1 0 7 50 0 -1 0.000 0 0 -1 0 0 2
	 11400 12675 11700 12675
-6
2 3 0 1 0 7 50 0 -1 0.000 0 0 -1 0 0 4
	 1050 6225 1200 6000 1350 6225 1050 6225
2 3 0 1 0 7 50 0 -1 0.000 0 0 -1 0 0 4
	 3450 6225 3600 6000 3750 6225 3450 6225
2 1 0 1 0 7 50 0 -1 0.000 0 0 -1 0 0 2
	 3450 6300 3750 6300
2 1 0 1 0 7 50 0 -1 0.000 0 0 -1 0 0 2
	 3750 1200 4500 1200
2 1 0 1 0 7 50 0 -1 0.000 0 0 -1 0 0 2
	 3750 3600 4500 3600
2 1 0 1 0 7 50 0 -1 0.000 0 0 -1 0 0 2
	 3750 6000 4500 6000
2 1 0 1 0 7 50 0 -1 0.000 0 0 -1 0 0 2
	 1200 6300 1200 6825
2 1 0 1 0 7 50 0 -1 0.000 0 0 -1 0 0 2
	 3600 6300 3600 6825
2 1 0 1 0 7 50 0 -1 0.000 0 0 -1 1 1 2
	1 1 1.00 60.00 120.00
	1 1 1.00 60.00 120.00
	 4275 6000 4275 3600
2 1 0 1 0 7 50 0 -1 0.000 0 0 -1 1 1 2
	1 1 1.00 60.00 120.00
	1 1 1.00 60.00 120.00
	 4275 3600 4275 1200
2 1 0 1 0 7 50 0 -1 0.000 0 0 -1 1 1 2
	1 1 1.00 60.00 120.00
	1 1 1.00 60.00 120.00
	 1200 6750 2400 6750
2 1 0 1 0 7 50 0 -1 0.000 0 0 -1 1 1 2
	1 1 1.00 60.00 120.00
	1 1 1.00 60.00 120.00
	 2400 6750 3600 6750
2 1 0 1 0 7 50 0 -1 0.000 0 0 -1 0 0 2
	 2400 6225 2400 6750
2 1 0 2 0 7 50 0 -1 0.000 0 0 -1 1 0 2
	1 1 2.00 120.00 240.00
	 450 1200 1125 1200
2 1 0 2 0 7 50 0 -1 0.000 0 0 -1 1 0 2
	1 1 2.00 120.00 240.00
	 3675 1200 3975 1200
2 1 0 2 0 7 50 0 -1 0.000 0 0 -1 1 0 2
	1 1 2.00 120.00 240.00
	 1200 1125 1200 675
2 1 0 2 0 7 50 0 -1 0.000 0 0 -1 1 0 2
	1 1 2.00 120.00 240.00
	 3675 3600 4050 3600
2 1 0 2 0 7 50 0 -1 0.000 0 0 -1 1 0 2
	1 1 2.00 120.00 240.00
	 12300 1200 12975 1200
2 1 0 2 0 7 50 0 -1 0.000 0 0 -1 1 0 2
	1 1 2.00 120.00 240.00
	 4875 1200 5550 1200
2 1 0 2 0 7 50 0 -1 0.000 0 0 -1 1 0 2
	1 1 2.00 120.00 240.00
	 12600 5475 8400 5475
2 1 0 1 0 7 50 0 -1 0.000 0 0 -1 0 0 4
	 6000 1800 6300 1575 6825 2475 6450 2700
2 1 0 1 0 7 50 0 -1 0.000 0 0 -1 0 0 4
	 7200 2925 6900 2775 7350 1875 7650 2025
2 1 0 1 0 7 50 0 -1 0.000 0 0 -1 0 0 4
	 6525 1200 6525 1575 7425 1575 7425 1200
2 1 0 1 0 7 50 0 -1 0.000 0 0 -1 0 0 4
	 8100 3000 7650 3000 7650 2475 8100 2475
2 1 0 1 0 7 50 0 -1 0.000 0 0 -1 0 0 4
	 5925 3600 5925 3225 6525 3225 6525 3600
2 1 0 1 0 7 50 0 -1 0.000 0 0 -1 0 0 4
	 7275 3600 7275 3225 8025 3225 8025 3600
2 1 0 1 0 7 50 0 -1 0.000 0 0 -1 0 0 4
	 6000 4125 6300 3900 6825 4800 6450 5025
2 1 0 1 0 7 50 0 -1 0.000 0 0 -1 0 0 4
	 7275 5175 6975 5025 7350 4275 7650 4425
2 1 0 1 0 7 50 0 -1 0.000 0 0 -1 0 0 4
	 8100 5550 7650 5550 7650 5025 8100 5025
2 1 0 1 0 7 50 0 -1 0.000 0 0 -1 0 0 4
	 5700 2475 6150 2475 6150 2850 5700 2850
2 1 0 1 0 7 50 0 -1 0.000 0 0 -1 0 0 4
	 5700 5025 6150 5025 6150 5475 5700 5475
2 1 0 1 0 7 50 0 -1 0.000 0 0 -1 0 0 4
	 6075 6000 6075 5625 6450 5625 6450 6000
2 1 0 1 0 7 50 0 -1 0.000 0 0 -1 0 0 4
	 7425 6000 7425 5625 7725 5625 7725 6000
2 1 0 1 0 7 50 0 -1 0.000 0 0 -1 0 0 4
	 10725 1200 10725 1575 11325 1575 11325 1200
2 1 0 2 0 7 50 0 -1 6.000 0 0 -1 1 0 2
	1 1 2.00 120.00 240.00
	 11625 7575 12225 7575
2 1 0 2 0 7 50 0 -1 6.000 0 0 -1 1 0 2
	1 1 2.00 120.00 240.00
	 9150 7425 9150 6975
2 1 0 2 0 7 50 0 -1 6.000 0 0 -1 1 0 2
	1 1 2.00 120.00 240.00
	 11700 9975 12225 9975
4 0 0 50 0 0 24 0.0000 4 255 180 1725 6675 2\001
4 0 0 50 0 0 24 0.0000 4 255 180 2925 6675 2\001
4 0 0 50 0 0 24 1.5708 4 255 180 4125 4950 4\001
4 0 0 50 0 0 24 1.5708 4 255 180 4200 2550 4\001
4 0 0 50 0 0 32 0.0000 4 330 225 600 1650 1\001
4 0 0 50 0 0 32 0.0000 4 330 690 1425 1125 v=?\001
4 0 0 50 0 0 32 0.0000 4 330 735 3450 1050 u=?\001
4 0 0 50 0 0 32 0.0000 4 330 675 3750 3450 s=?\001
4 0 0 50 0 0 32 0.0000 4 330 225 5100 1725 1\001
4 0 0 50 0 0 24 0.0000 4 255 660 6675 1500 -0.5\001
4 0 0 50 0 0 24 0.0000 4 255 450 6000 3525 0.5\001
4 0 0 50 0 0 24 0.0000 4 255 180 6150 5925 1\001
4 0 0 50 0 0 24 0.0000 4 255 180 7500 5925 0\001
4 0 0 50 0 0 24 1.5708 4 255 180 6075 5325 2\001
4 0 0 50 0 0 24 1.5708 4 255 390 8025 5550 -2\001
4 0 0 50 0 0 24 1.0472 4 255 630 7200 2850 1.12\001
4 0 0 50 0 0 24 5.2360 4 255 840 6075 1875 -1.12\001
4 0 0 50 0 0 24 5.2360 4 255 840 6075 4200 -1.12\001
4 0 0 50 0 0 24 1.0472 4 255 630 7275 5100 1.12\001
4 0 0 50 0 0 24 0.0000 4 255 660 7275 3525 -0.5\001
4 0 0 50 0 0 24 1.5708 4 255 390 8025 2925 -1\001
4 0 0 50 0 0 24 0.0000 4 255 450 10800 1500 0.5\001
4 0 0 50 0 0 24 0.0000 4 255 2355 9900 2400 ALL MEMBER\001
4 0 0 50 0 0 24 0.0000 4 300 3000 9900 2820 FORCES, EXCEPT\001
4 0 0 50 0 0 24 0.0000 4 255 1605 9900 3240 THE ONE\001
4 0 0 50 0 0 24 0.0000 4 300 2085 9900 3660 INDICATED,\001
4 0 0 50 0 0 24 0.0000 4 255 1560 9900 4080 ARE THE\001
4 0 0 50 0 0 24 0.0000 4 255 1005 9900 4500 SAME\001
4 0 0 50 0 0 24 0.0000 4 255 1860 9900 4920 AS  IN THE\001
4 0 0 50 0 0 24 0.0000 4 255 2715 9900 5400 ACTUAL STATE\001
4 0 0 50 0 0 24 1.5708 4 255 180 6075 2775 1\001
4 0 0 50 0 0 24 0.0000 4 255 630 11700 7425 64.4\001
4 0 0 50 0 0 24 1.5708 4 255 360 8925 7575 12\001
4 0 0 50 0 0 24 0.0000 4 255 630 11775 9825 29.2\001
