#FIG 3.2
Landscape
Center
Metric
A4      
100.00
Single
-2
1200 2
5 1 0 1 0 7 50 0 -1 4.000 0 1 1 0 2137.500 2272.500 2115 1980 1845 2295 2115 2565
	1 1 1.00 60.00 120.00
5 1 0 1 0 7 50 0 -1 4.000 0 1 1 0 6880.500 2205.000 6930 2475 7155 2205 6930 1935
	1 1 1.00 60.00 120.00
2 1 0 2 0 7 50 0 -1 6.000 0 0 -1 0 0 2
	 2250 2250 6750 2250
2 1 0 2 0 7 50 0 -1 6.000 0 0 -1 0 0 2
	 2250 1980 2250 2520
2 1 0 2 0 7 50 0 -1 6.000 0 0 -1 0 0 2
	 6750 1980 6750 2475
2 1 0 1 0 7 50 0 -1 4.000 0 0 -1 0 0 2
	 2250 2610 2250 2880
2 1 0 1 0 7 50 0 -1 4.000 0 0 -1 0 0 2
	 2250 2610 2250 2880
2 1 0 1 0 7 50 0 -1 4.000 0 0 -1 0 0 2
	 6750 2565 6750 2835
2 1 0 1 0 7 50 0 -1 4.000 0 0 -1 1 1 2
	1 1 1.00 60.00 120.00
	1 1 1.00 60.00 120.00
	 2250 2700 6750 2700
2 1 0 1 0 7 50 0 -1 0.000 0 0 -1 0 0 3
	 2250 2025 2250 1575 6750 2250
2 1 0 1 0 7 50 0 -1 0.000 0 0 -1 0 0 2
	 2520 1620 2520 2250
2 1 0 1 0 7 50 0 -1 0.000 0 0 -1 0 0 2
	 2790 1665 2790 2250
2 1 0 1 0 7 50 0 -1 0.000 0 0 -1 0 0 2
	 3060 1710 3060 2250
2 1 0 1 0 7 50 0 -1 0.000 0 0 -1 0 0 2
	 3330 1755 3330 2250
2 1 0 1 0 7 50 0 -1 0.000 0 0 -1 0 0 2
	 3600 1800 3600 2250
2 1 0 1 0 7 50 0 -1 0.000 0 0 -1 0 0 2
	 3870 1845 3870 2250
2 1 0 1 0 7 50 0 -1 0.000 0 0 -1 0 0 2
	 4140 1845 4140 2250
2 1 0 1 0 7 50 0 -1 0.000 0 0 -1 0 0 2
	 4410 1890 4410 2250
2 1 0 1 0 7 50 0 -1 0.000 0 0 -1 0 0 2
	 4680 1935 4680 2250
2 1 0 1 0 7 50 0 -1 0.000 0 0 -1 0 0 2
	 4950 1980 4950 2250
2 1 0 1 0 7 50 0 -1 0.000 0 0 -1 0 0 2
	 5265 2025 5265 2250
2 1 0 1 0 7 50 0 -1 0.000 0 0 -1 0 0 2
	 5580 2070 5580 2250
2 1 0 1 0 7 50 0 -1 0.000 0 0 -1 0 0 2
	 5850 2115 5850 2250
2 1 0 1 0 7 50 0 -1 0.000 0 0 -1 0 0 2
	 6165 2160 6165 2250
2 1 0 1 0 7 50 0 -1 0.000 0 0 -1 0 0 2
	 2295 1575 3285 1575
4 0 0 50 0 1 24 0.0000 4 255 90 4545 2655 l\001
4 0 0 50 0 1 24 0.0000 4 255 300 1710 1845 M\001
4 0 0 50 0 1 24 0.0000 4 255 300 6885 1845 M\001
4 0 0 50 0 1 18 0.0000 4 195 75 1980 1935 i\001
4 0 0 50 0 1 18 0.0000 4 240 75 7155 1935 j\001
4 0 0 50 0 1 24 0.0000 4 330 105 3015 1575 f\001
