<?xml version="1.0" encoding="UTF-8" standalone="no"?>
<!-- Created with Inkscape (http://www.inkscape.org/) -->

<svg
   width="63.592609mm"
   height="33.17741mm"
   viewBox="0 0 63.592609 33.17741"
   version="1.1"
   id="svg8878"
   inkscape:version="1.1.1 (3bf5ae0d25, 2021-09-20)"
   sodipodi:docname="10-01.svg"
   xmlns:inkscape="http://www.inkscape.org/namespaces/inkscape"
   xmlns:sodipodi="http://sodipodi.sourceforge.net/DTD/sodipodi-0.dtd"
   xmlns="http://www.w3.org/2000/svg"
   xmlns:svg="http://www.w3.org/2000/svg">
  <sodipodi:namedview
     id="namedview8880"
     pagecolor="#ffffff"
     bordercolor="#666666"
     borderopacity="1.0"
     inkscape:pageshadow="2"
     inkscape:pageopacity="0.0"
     inkscape:pagecheckerboard="0"
     inkscape:document-units="mm"
     showgrid="false"
     fit-margin-top="0"
     fit-margin-left="0"
     fit-margin-right="0"
     fit-margin-bottom="0"
     inkscape:zoom="1.8116734"
     inkscape:cx="276.81589"
     inkscape:cy="68.169018"
     inkscape:window-width="1852"
     inkscape:window-height="1016"
     inkscape:window-x="0"
     inkscape:window-y="0"
     inkscape:window-maximized="1"
     inkscape:current-layer="layer1" />
  <defs
     id="defs8875">
    <clipPath
       id="clip20">
      <path
         d="m 212,515.05469 h 21 V 522 h -21 z m 0,0"
         id="path3807" />
    </clipPath>
  </defs>
  <g
     inkscape:label="Layer 1"
     inkscape:groupmode="layer"
     id="layer1"
     transform="translate(0.87206234,0.84027214)">
    <path
       style="fill:#d7d7d7;fill-opacity:1;fill-rule:nonzero;stroke:#211e1e;stroke-width:0.141111;stroke-linecap:butt;stroke-linejoin:miter;stroke-miterlimit:4;stroke-opacity:1"
       d="m 41.541188,3.5650789 c 0.26871,0 0.48645,-0.217731 0.48645,-0.486445 v -0.54846 c 0,-0.267339 -0.21774,-0.486449 -0.48645,-0.486449 h -18.68345 c -0.26871,0 -0.48644,0.21911 -0.48644,0.486449 v 0.54846 c 0,0.268714 0.21773,0.486445 0.48644,0.486445 z m 0,0"
       id="path5233" />
    <path
       style="fill:none;stroke:#e3e3e3;stroke-width:0.127706;stroke-linecap:round;stroke-linejoin:miter;stroke-miterlimit:4;stroke-opacity:1"
       d="m 41.495708,2.2380279 c -0.0565,-0.01792 -0.11851,-0.02893 -0.18466,-0.02893 h -18.22317 c -0.26321,0 -0.47681,0.170875 -0.47681,0.380337 v 0.428572 c 0,0.112998 0.0606,0.213596 0.15572,0.282497"
       id="path5235" />
    <path
       style="fill:none;stroke:#7a7878;stroke-width:0.127706;stroke-linecap:round;stroke-linejoin:miter;stroke-miterlimit:4;stroke-opacity:1"
       d="m 22.766788,3.3004959 c 0.0854,0.06201 0.19706,0.09922 0.32109,0.09922 h 18.22318 c 0.26182,0 0.47542,-0.170878 0.47542,-0.381716 v -0.428572 c 0,-0.157095 -0.11989,-0.293521 -0.29077,-0.351398"
       id="path5237" />
    <path
       style="fill:#d7d7d7;fill-opacity:1;fill-rule:nonzero;stroke:#211e1e;stroke-width:0.141111;stroke-linecap:butt;stroke-linejoin:miter;stroke-miterlimit:4;stroke-opacity:1"
       d="m 23.787918,2.4971009 c 0,-0.268718 -0.21773,-0.486445 -0.48644,-0.486445 h -0.54709 c -0.26871,0 -0.48644,0.217727 -0.48644,0.486445 V 21.676637 c 0,0.26872 0.21773,0.48645 0.48644,0.48645 h 0.54709 c 0.26871,0 0.48644,-0.21773 0.48644,-0.48645 z m 0,0"
       id="path5239" />
    <path
       style="fill:none;stroke:#e3e3e3;stroke-width:0.127706;stroke-linecap:round;stroke-linejoin:miter;stroke-miterlimit:4;stroke-opacity:1"
       d="m 22.462248,2.5411979 c -0.0193,0.05788 -0.0303,0.119892 -0.0303,0.186037 V 21.446507 c 0,0.2632 0.17087,0.4768 0.38171,0.4768 h 0.42857 c 0.11162,0 0.21222,-0.0606 0.2825,-0.15572"
       id="path5241" />
    <path
       style="fill:none;stroke:#7a7878;stroke-width:0.127706;stroke-linecap:round;stroke-linejoin:miter;stroke-miterlimit:4;stroke-opacity:1"
       d="m 23.524718,21.767587 c 0.062,-0.0841 0.0992,-0.19706 0.0992,-0.32108 V 2.7258559 c 0,-0.261828 -0.17088,-0.474045 -0.38172,-0.474045 h -0.42857 c -0.15847,0 -0.29352,0.118512 -0.3514,0.289387"
       id="path5243" />
    <path
       style="fill:#d7d7d7;fill-opacity:1;fill-rule:nonzero;stroke:#211e1e;stroke-width:0.141111;stroke-linecap:butt;stroke-linejoin:miter;stroke-miterlimit:4;stroke-opacity:1"
       d="m 23.763118,2.9959499 c 0.16261,-0.213597 0.11851,-0.519522 -0.0951,-0.680752 l -0.43821,-0.32935 c -0.21498,-0.161233 -0.51952,-0.118512 -0.68075,0.09646 L 3.8945625,21.106127 c -0.161231,0.21359 -0.118511,0.51952 0.09646,0.68075 l 0.436839,0.32935 c 0.214973,0.16123 0.51952,0.11851 0.682128,-0.0965 z m 0,0"
       id="path5245" />
    <path
       style="fill:none;stroke:#e3e3e3;stroke-width:0.127706;stroke-linecap:round;stroke-linejoin:miter;stroke-miterlimit:4;stroke-opacity:1"
       d="m 22.677218,2.2352729 c -0.0496,0.03305 -0.0951,0.07717 -0.13505,0.129536 L 4.1646555,21.020687 c -0.158474,0.20946 -0.150206,0.48232 0.01791,0.60909 l 0.343132,0.2577 c 0.08957,0.0675 0.205328,0.0799 0.319705,0.0469"
       id="path5247" />
    <path
       style="fill:none;stroke:#7a7878;stroke-width:0.127706;stroke-linecap:round;stroke-linejoin:miter;stroke-miterlimit:4;stroke-opacity:1"
       d="m 4.8440295,21.932947 c 0.100597,-0.0303 0.198438,-0.0965 0.272852,-0.19568 L 23.493018,3.0813889 c 0.15847,-0.209462 0.15021,-0.482314 -0.0179,-0.609092 l -0.34175,-0.257694 c -0.12678,-0.09508 -0.30731,-0.0813 -0.45613,0.02067"
       id="path5249" />
    <path
       style="fill:#d7d7d7;fill-opacity:1;fill-rule:nonzero;stroke:#211e1e;stroke-width:0.141111;stroke-linecap:butt;stroke-linejoin:miter;stroke-miterlimit:4;stroke-opacity:1"
       d="m 42.187488,2.9959499 c 0.16123,-0.213597 0.11851,-0.519522 -0.0965,-0.680752 l -0.43684,-0.32935 c -0.21498,-0.161233 -0.5209,-0.118512 -0.68213,0.09646 l -18.6545,19.0238191 c -0.16123,0.21359 -0.11852,0.51952 0.0965,0.68075 l 0.43821,0.32935 c 0.2136,0.16123 0.51953,0.11851 0.68076,-0.0965 z m 0,0"
       id="path5251" />
    <path
       style="fill:none;stroke:#e3e3e3;stroke-width:0.127706;stroke-linecap:round;stroke-linejoin:miter;stroke-miterlimit:4;stroke-opacity:1"
       d="m 41.100208,2.2352729 c -0.0482,0.03305 -0.0951,0.07717 -0.13504,0.129536 L 22.587648,21.020687 c -0.1571,0.20946 -0.14883,0.48232 0.0193,0.60909 l 0.34175,0.2577 c 0.0896,0.0675 0.20671,0.0799 0.31971,0.0469"
       id="path5253" />
    <path
       style="fill:none;stroke:#7a7878;stroke-width:0.127706;stroke-linecap:round;stroke-linejoin:miter;stroke-miterlimit:4;stroke-opacity:1"
       d="m 23.268398,21.932947 c 0.1006,-0.0303 0.19706,-0.0965 0.27148,-0.19568 L 41.917388,3.0813889 c 0.1571,-0.209462 0.15021,-0.482314 -0.0193,-0.609092 l -0.34176,-0.257694 c -0.12678,-0.09508 -0.3073,-0.0813 -0.45613,0.02067"
       id="path5255" />
    <path
       style="fill:#d7d7d7;fill-opacity:1;fill-rule:nonzero;stroke:#211e1e;stroke-width:0.141111;stroke-linecap:butt;stroke-linejoin:miter;stroke-miterlimit:4;stroke-opacity:1"
       d="m 22.207308,2.9959499 c -0.16123,-0.213597 -0.11851,-0.519522 0.0965,-0.680752 l 0.43684,-0.32935 c 0.21497,-0.161233 0.51952,-0.118512 0.68075,0.09646 l 18.6545,19.0238191 c 0.16123,0.21359 0.11852,0.51952 -0.0965,0.68075 l -0.43684,0.32935 c -0.21497,0.16123 -0.51952,0.11851 -0.68075,-0.0965 z m 0,0"
       id="path5257" />
    <path
       style="fill:none;stroke:#e3e3e3;stroke-width:0.127706;stroke-linecap:round;stroke-linejoin:miter;stroke-miterlimit:4;stroke-opacity:1"
       d="m 23.293208,2.2352729 c 0.0496,0.03305 0.0965,0.07717 0.13504,0.129536 l 18.37752,18.6558781 c 0.15847,0.20946 0.15021,0.48232 -0.0179,0.60909 l -0.34313,0.2577 c -0.0882,0.0675 -0.20533,0.0799 -0.31833,0.0469"
       id="path5259" />
    <path
       style="fill:none;stroke:#7a7878;stroke-width:0.127706;stroke-linecap:round;stroke-linejoin:miter;stroke-miterlimit:4;stroke-opacity:1"
       d="m 41.126398,21.932947 c -0.1006,-0.0303 -0.19844,-0.0965 -0.27148,-0.19568 L 22.477408,3.0813889 c -0.15848,-0.209462 -0.15021,-0.482314 0.0179,-0.609092 l 0.34313,-0.257694 c 0.1254,-0.09508 0.30592,-0.0813 0.45475,0.02067"
       id="path5261" />
    <path
       style="fill:#d7d7d7;fill-opacity:1;fill-rule:nonzero;stroke:#211e1e;stroke-width:0.141111;stroke-linecap:butt;stroke-linejoin:miter;stroke-miterlimit:4;stroke-opacity:1"
       d="m 41.965618,2.4971009 c 0,-0.268718 -0.21773,-0.486445 -0.48644,-0.486445 h -0.54709 c -0.26871,0 -0.48644,0.217727 -0.48644,0.486445 V 21.676637 c 0,0.26872 0.21773,0.48645 0.48644,0.48645 h 0.54709 c 0.26871,0 0.48644,-0.21773 0.48644,-0.48645 z m 0,0"
       id="path5263" />
    <path
       style="fill:none;stroke:#e3e3e3;stroke-width:0.127706;stroke-linecap:round;stroke-linejoin:miter;stroke-miterlimit:4;stroke-opacity:1"
       d="m 40.639948,2.5411979 c -0.0193,0.05788 -0.0289,0.119892 -0.0289,0.186037 V 21.446507 c 0,0.2632 0.1695,0.4768 0.38034,0.4768 h 0.42857 c 0.11162,0 0.21222,-0.0606 0.2825,-0.15572"
       id="path5265" />
    <path
       style="fill:none;stroke:#7a7878;stroke-width:0.127706;stroke-linecap:round;stroke-linejoin:miter;stroke-miterlimit:4;stroke-opacity:1"
       d="m 41.702418,21.767587 c 0.062,-0.0841 0.0992,-0.19706 0.0992,-0.32108 V 2.7258559 c 0,-0.261828 -0.17088,-0.474045 -0.38172,-0.474045 h -0.42857 c -0.1571,0 -0.29352,0.118512 -0.3514,0.289387"
       id="path5267" />
    <path
       style="fill:none;stroke:#211e1e;stroke-width:0.440972;stroke-linecap:butt;stroke-linejoin:miter;stroke-miterlimit:4;stroke-opacity:1"
       d="m 51.132328,2.8292059 h -9.05509"
       id="path5269" />
    <path
       style="fill:#7a7878;fill-opacity:1;fill-rule:nonzero;stroke:none;stroke-width:0.352778"
       d="m 23.087878,3.2550229 c 0.20808,0 0.3762,-0.168124 0.3762,-0.376206 0,-0.208083 -0.16812,-0.377582 -0.3762,-0.377582 -0.20809,0 -0.37758,0.169499 -0.37758,0.377582 0,0.208082 0.16949,0.376206 0.37758,0.376206"
       id="path5271" />
    <path
       style="fill:none;stroke:#211e1e;stroke-width:0.105833;stroke-linecap:butt;stroke-linejoin:miter;stroke-miterlimit:4;stroke-opacity:1"
       d="m 23.087878,3.2550189 c 0.20808,0 0.3762,-0.16812 0.3762,-0.376202 0,-0.208086 -0.16812,-0.377585 -0.3762,-0.377585 -0.20808,0 -0.37758,0.169499 -0.37758,0.377585 0,0.208082 0.1695,0.376202 0.37758,0.376202 z m 0,0"
       id="path5273" />
    <path
       style="fill:#eeeeee;fill-opacity:1;fill-rule:nonzero;stroke:none;stroke-width:0.352778"
       d="m 23.052048,2.8347199 c 0.0923,-0.06064 0.14194,-0.147451 0.11162,-0.194303 -0.0303,-0.04548 -0.13091,-0.03306 -0.22186,0.02755 -0.0923,0.06201 -0.14332,0.14883 -0.113,0.194303 0.0317,0.04686 0.13091,0.03447 0.22324,-0.02755"
       id="path5275" />
    <path
       style="fill:#7a7878;fill-opacity:1;fill-rule:nonzero;stroke:none;stroke-width:0.352778"
       d="m 41.342748,3.2054119 c 0.20809,0 0.3762,-0.16812 0.3762,-0.376206 0,-0.208083 -0.16811,-0.376202 -0.3762,-0.376202 -0.20808,0 -0.3762,0.168119 -0.3762,0.376202 0,0.208086 0.16812,0.376206 0.3762,0.376206"
       id="path5277" />
    <path
       style="fill:none;stroke:#211e1e;stroke-width:0.105833;stroke-linecap:butt;stroke-linejoin:miter;stroke-miterlimit:4;stroke-opacity:1"
       d="m 41.342748,3.2054119 c 0.20809,0 0.3762,-0.16812 0.3762,-0.376206 0,-0.208083 -0.16811,-0.376202 -0.3762,-0.376202 -0.20808,0 -0.3762,0.168119 -0.3762,0.376202 0,0.208086 0.16812,0.376206 0.3762,0.376206 z m 0,0"
       id="path5279" />
    <path
       style="fill:#eeeeee;fill-opacity:1;fill-rule:nonzero;stroke:none;stroke-width:0.352778"
       d="m 41.306918,2.7851089 c 0.0923,-0.06063 0.14194,-0.147447 0.11162,-0.194303 -0.0303,-0.04547 -0.13091,-0.03306 -0.22186,0.02755 -0.0937,0.06201 -0.14332,0.148826 -0.11162,0.194303 0.0303,0.04685 0.12953,0.03447 0.22186,-0.02755"
       id="path5281" />
    <path
       style="fill:#211e1e;fill-opacity:1;fill-rule:nonzero;stroke:none;stroke-width:0.352778"
       d="m 21.384618,31.139617 0.1695,-0.40514 -0.1695,-0.40514 1.51998,0.40514 z m 0,0"
       id="path5283" />
    <path
       style="fill:none;stroke:#211e1e;stroke-width:0.105833;stroke-linecap:round;stroke-linejoin:miter;stroke-miterlimit:4;stroke-opacity:1"
       d="m 21.554118,30.734477 h -4.89893"
       id="path5285" />
    <path
       style="fill:#211e1e;fill-opacity:1;fill-rule:nonzero;stroke:none;stroke-width:0.352778"
       d="m 6.0153625,30.329337 -0.169499,0.40514 0.169499,0.40514 -1.519976,-0.40514 z m 0,0"
       id="path5287" />
    <path
       style="fill:none;stroke:#211e1e;stroke-width:0.105833;stroke-linecap:round;stroke-linejoin:miter;stroke-miterlimit:4;stroke-opacity:1"
       d="M 5.8458635,30.734477 H 10.80818"
       id="path5289" />
    <path
       style="fill:#211e1e;fill-opacity:1;fill-rule:nonzero;stroke:none;stroke-width:0.352778"
       d="m 39.735958,31.139617 0.16949,-0.40514 -0.16949,-0.40514 1.52135,0.40514 z m 0,0"
       id="path5299" />
    <path
       style="fill:none;stroke:#211e1e;stroke-width:0.105833;stroke-linecap:round;stroke-linejoin:miter;stroke-miterlimit:4;stroke-opacity:1"
       d="m 39.905448,30.734477 h -4.89892"
       id="path5301" />
    <path
       style="fill:#211e1e;fill-opacity:1;fill-rule:nonzero;stroke:none;stroke-width:0.352778"
       d="m 24.366698,30.329337 -0.16812,0.40514 0.16812,0.40514 -1.51998,-0.40514 z m 0,0"
       id="path5303" />
    <path
       style="fill:none;stroke:#211e1e;stroke-width:0.105833;stroke-linecap:round;stroke-linejoin:miter;stroke-miterlimit:4;stroke-opacity:1"
       d="m 24.198578,30.734477 h 4.96093"
       id="path5305" />
    <path
       style="fill:#f0f0f0;fill-opacity:1;fill-rule:nonzero;stroke:none;stroke-width:0.352778"
       d="m 46.066668,24.479567 h -9.14604 c -0.0179,0.70831 0.8158,1.62471 1.99402,1.62471 1.35874,0 2.21588,-0.24943 4.48,-0.19431 2.26412,0.0551 2.43637,-1.192 2.67202,-1.4304"
       id="path5339" />
    <path
       style="fill:#ebebeb;fill-opacity:1;fill-rule:nonzero;stroke:none;stroke-width:0.352778"
       d="m 45.978468,24.479567 h -8.97103 c -0.0165,0.68351 0.84336,1.58198 1.99816,1.56407 1.37114,-0.0289 2.13182,-0.23702 4.35184,-0.18328 2.2214,0.0537 2.38952,-1.15066 2.62103,-1.38079"
       id="path5341" />
    <path
       style="fill:#e8e6e6;fill-opacity:1;fill-rule:nonzero;stroke:none;stroke-width:0.352778"
       d="m 45.890278,24.479567 h -8.79464 c -0.0179,0.6587 0.86954,1.53927 2.00091,1.50344 1.38355,-0.0579 2.04776,-0.22325 4.22506,-0.17226 2.17593,0.0524 2.34267,-1.10932 2.56867,-1.33118"
       id="path5343" />
    <path
       style="fill:#e3e1e1;fill-opacity:1;fill-rule:nonzero;stroke:none;stroke-width:0.352778"
       d="m 45.802078,24.479567 h -8.61963 c -0.0165,0.63389 0.8971,1.49655 2.00367,1.4428 1.39733,-0.0882 1.96508,-0.21083 4.09829,-0.16123 2.1332,0.0496 2.29581,-1.06935 2.51767,-1.28157"
       id="path5345" />
    <path
       style="fill:#dedede;fill-opacity:1;fill-rule:nonzero;stroke:none;stroke-width:0.352778"
       d="m 45.713888,24.479567 h -8.44324 c -0.0166,0.60909 0.92328,1.45383 2.00642,1.38217 1.40973,-0.11713 1.88102,-0.19844 3.97013,-0.1502 2.09048,0.0482 2.24896,-1.02802 2.46669,-1.23197"
       id="path5347" />
    <path
       style="fill:#d9d9d9;fill-opacity:1;fill-rule:nonzero;stroke:none;stroke-width:0.352778"
       d="m 45.625688,24.478187 h -8.26823 c -0.0152,0.58567 0.95223,1.41249 2.01056,1.32292 1.42214,-0.14608 1.79696,-0.18466 3.84335,-0.13919 2.04639,0.0455 2.2021,-0.98667 2.41432,-1.18373"
       id="path5349" />
    <path
       style="fill:#d4d4d4;fill-opacity:1;fill-rule:nonzero;stroke:none;stroke-width:0.352778"
       d="m 45.537498,24.478187 h -8.09184 c -0.0152,0.56086 0.9784,1.36977 2.01193,1.26228 1.43592,-0.17638 1.71428,-0.17225 3.71657,-0.12815 2.00367,0.0441 2.15525,-0.94534 2.36334,-1.13413"
       id="path5351" />
    <path
       style="fill:#cfcfcf;fill-opacity:1;fill-rule:nonzero;stroke:none;stroke-width:0.352778"
       d="m 45.449298,24.478187 h -7.91545 c -0.0152,0.53606 1.00459,1.32705 2.01469,1.20165 1.44832,-0.20533 1.63022,-0.15848 3.58842,-0.11713 1.95957,0.0427 2.10839,-0.904 2.31234,-1.08452"
       id="path5353" />
    <path
       style="fill:#cacaca;fill-opacity:1;fill-rule:nonzero;stroke:none;stroke-width:0.352778"
       d="m 45.361108,24.478187 h -7.74044 c -0.0138,0.51125 1.03215,1.28433 2.01883,1.14102 1.46071,-0.23427 1.54615,-0.14608 3.46163,-0.10611 1.91547,0.04 2.06154,-0.86266 2.25998,-1.03491"
       id="path5355" />
    <path
       style="fill:#c5c5c5;fill-opacity:1;fill-rule:nonzero;stroke:none;stroke-width:0.352778"
       d="m 45.272918,24.476807 h -7.56406 c -0.0138,0.4892 1.05834,1.24299 2.02159,1.08176 1.47312,-0.26458 1.46071,-0.13367 3.33347,-0.0951 1.87275,0.0386 2.01469,-0.82131 2.209,-0.98668"
       id="path5357" />
    <path
       style="fill:#c2bfbf;fill-opacity:1;fill-rule:nonzero;stroke:none;stroke-width:0.352778"
       d="m 45.184718,24.476807 h -7.38766 c -0.0152,0.46302 1.08451,1.20027 2.02296,1.02113 1.4869,-0.29352 1.37804,-0.11989 3.20669,-0.0841 1.83004,0.0372 1.96922,-0.78135 2.15801,-0.93707"
       id="path5359" />
    <path
       style="fill:#bdbaba;fill-opacity:1;fill-rule:nonzero;stroke:none;stroke-width:0.352778"
       d="m 45.096528,24.476807 h -7.21266 c -0.0138,0.4396 1.11208,1.15756 2.0271,0.96049 1.4993,-0.32246 1.29398,-0.10748 3.07991,-0.073 1.78456,0.0345 1.92099,-0.74001 2.10565,-0.88746"
       id="path5361" />
    <path
       style="fill:#e3e3e3;fill-opacity:1;fill-rule:nonzero;stroke:none;stroke-width:0.352778"
       d="m 41.342748,23.913187 c 0.48507,0 0.87781,-0.39274 0.87781,-0.87781 0,-0.48506 -0.39274,-0.87781 -0.87781,-0.87781 -0.48507,0 -0.87919,0.39275 -0.87919,0.87781 0,0.48507 0.39412,0.87781 0.87919,0.87781"
       id="path5363" />
    <path
       style="fill:none;stroke:#211e1e;stroke-width:0.141111;stroke-linecap:butt;stroke-linejoin:miter;stroke-miterlimit:4;stroke-opacity:1"
       d="m 41.342748,23.913187 c 0.48507,0 0.87781,-0.39274 0.87781,-0.87781 0,-0.48506 -0.39274,-0.87781 -0.87781,-0.87781 -0.48507,0 -0.87919,0.39275 -0.87919,0.87781 0,0.48507 0.39412,0.87781 0.87919,0.87781 z m 3.94808,0.51539 h -8.11664"
       id="path5365" />
    <path
       style="fill:#dedcdc;fill-opacity:1;fill-rule:nonzero;stroke:#211e1e;stroke-width:0.141111;stroke-linecap:butt;stroke-linejoin:miter;stroke-miterlimit:4;stroke-opacity:1"
       d="m 44.013388,23.915947 h -5.65409 v 0.48782 h 5.65409 z m 0,0"
       id="path5367" />
    <path
       style="fill:none;stroke:#211e1e;stroke-width:0.105833;stroke-linecap:butt;stroke-linejoin:miter;stroke-miterlimit:4;stroke-opacity:1"
       d="m 4.5257035,25.593017 v 6.74412 m 18.3788945,-8.94484 v 8.94484 m 18.37889,-5.73539 v 5.73539"
       id="path5369" />
    <path
       style="fill:#211e1e;fill-opacity:1;fill-rule:nonzero;stroke:none;stroke-width:0.352778"
       d="m 59.548008,4.4649379 -0.40514,-0.1695 -0.40652,0.1695 0.40652,-1.519975 z m 0,0"
       id="path5371" />
    <path
       style="fill:none;stroke:#211e1e;stroke-width:0.105833;stroke-linecap:round;stroke-linejoin:miter;stroke-miterlimit:4;stroke-opacity:1"
       d="M 59.142868,4.2954379 V 10.816317"
       id="path5373" />
    <path
       style="fill:#211e1e;fill-opacity:1;fill-rule:nonzero;stroke:none;stroke-width:0.352778"
       d="m 58.736348,19.875541 0.40652,0.169496 0.40514,-0.169496 -0.40514,1.519976 z m 0,0"
       id="path5375" />
    <path
       style="fill:none;stroke:#211e1e;stroke-width:0.105833;stroke-linecap:round;stroke-linejoin:miter;stroke-miterlimit:4;stroke-opacity:1"
       d="m 59.142868,20.045037 v -6.31279"
       id="path5377" />
    <path
       style="fill:none;stroke:#211e1e;stroke-width:0.105833;stroke-linecap:butt;stroke-linejoin:miter;stroke-miterlimit:4;stroke-opacity:1"
       d="m 46.723988,21.286647 h 14.24754 M 54.463048,2.8664129 h 6.50848"
       id="path5379" />
    <path
       style="fill:#d7d7d7;fill-opacity:1;fill-rule:nonzero;stroke:#211e1e;stroke-width:0.141111;stroke-linecap:butt;stroke-linejoin:miter;stroke-miterlimit:4;stroke-opacity:1"
       d="m 23.260128,22.101067 c 0.2701,0 0.48645,-0.21773 0.48645,-0.48644 v -0.54709 c 0,-0.26871 -0.21635,-0.48644 -0.48645,-0.48644 H 4.5766915 c -0.268718,0 -0.486447,0.21773 -0.486447,0.48644 v 0.54709 c 0,0.26871 0.217729,0.48644 0.486447,0.48644 z m 0,0"
       id="path5381" />
    <path
       style="fill:none;stroke:#e3e3e3;stroke-width:0.127706;stroke-linecap:round;stroke-linejoin:miter;stroke-miterlimit:4;stroke-opacity:1"
       d="m 23.216038,20.775397 c -0.0565,-0.0193 -0.11989,-0.0303 -0.18466,-0.0303 H 4.8068235 c -0.261827,0 -0.475423,0.17087 -0.475423,0.38171 v 0.42857 c 0,0.11163 0.06063,0.21222 0.155718,0.2825"
       id="path5383" />
    <path
       style="fill:none;stroke:#7a7878;stroke-width:0.127706;stroke-linecap:round;stroke-linejoin:miter;stroke-miterlimit:4;stroke-opacity:1"
       d="m 4.4871175,21.837867 c 0.08406,0.062 0.19706,0.0992 0.319705,0.0992 H 23.029998 c 0.26321,0 0.4768,-0.17088 0.4768,-0.38172 v -0.42857 c 0,-0.15847 -0.11989,-0.29352 -0.29076,-0.3514"
       id="path5385" />
    <path
       style="fill:#f0f0f0;fill-opacity:1;fill-rule:nonzero;stroke:none;stroke-width:0.352778"
       d="M 9.3350545,23.888387 H 0.28272349 c -0.01654,0.66972 0.80890801,1.53651 1.97472901,1.53651 1.343587,0 2.192458,-0.23564 4.433148,-0.18328 2.240689,0.0524 2.411568,-1.12723 2.644454,-1.35323"
       id="path5387" />
    <path
       style="fill:#ebebeb;fill-opacity:1;fill-rule:nonzero;stroke:none;stroke-width:0.352778"
       d="M 9.2468605,23.888387 H 0.36953949 c -0.01654,0.6463 0.83509101,1.49655 1.97748501,1.48001 1.357368,-0.0289 2.109777,-0.22462 4.307747,-0.17363 2.196593,0.051 2.364713,-1.09003 2.592089,-1.30638"
       id="path5389" />
    <path
       style="fill:#e8e6e6;fill-opacity:1;fill-rule:nonzero;stroke:none;stroke-width:0.352778"
       d="M 9.1600455,23.888387 H 0.45635649 c -0.01653,0.62287 0.86127301,1.45658 1.98024001,1.42214 1.369771,-0.0551 2.027095,-0.21222 4.180968,-0.16261 2.155251,0.0482 2.319239,-1.05007 2.542481,-1.25953"
       id="path5391" />
    <path
       style="fill:#e3e1e1;fill-opacity:1;fill-rule:nonzero;stroke:none;stroke-width:0.352778"
       d="M 9.0732305,23.888387 H 0.54317249 c -0.01653,0.59945 0.88745701,1.41525 1.98299701,1.36426 1.382172,-0.0827 1.944412,-0.19844 4.055566,-0.15297 2.111154,0.0482 2.272384,-1.0101 2.491495,-1.21129"
       id="path5393" />
    <path
       style="fill:#dedede;fill-opacity:1;fill-rule:nonzero;stroke:none;stroke-width:0.352778"
       d="M 8.9864115,23.888387 H 0.62998849 c -0.01653,0.57602 0.91364001,1.37528 1.98575401,1.30776 1.394574,-0.11162 1.861729,-0.18741 3.930164,-0.14194 2.067058,0.0455 2.225533,-0.9729 2.440505,-1.16582"
       id="path5395" />
    <path
       style="fill:#d9d9d9;fill-opacity:1;fill-rule:nonzero;stroke:none;stroke-width:0.352778"
       d="M 8.8982175,23.887007 H 0.71680549 c -0.01516,0.55397 0.94120001,1.33532 1.98850901,1.25126 1.408355,-0.13918 1.777669,-0.17501 3.803385,-0.13091 2.025715,0.0441 2.180056,-0.93431 2.389518,-1.12035"
       id="path5397" />
    <path
       style="fill:#d4d4d4;fill-opacity:1;fill-rule:nonzero;stroke:none;stroke-width:0.352778"
       d="M 8.8114015,23.887007 H 0.80362149 c -0.01516,0.53055 0.96738301,1.29536 1.99126501,1.19476 1.420758,-0.16674 1.694987,-0.16398 3.677984,-0.12127 1.981619,0.0413 2.133204,-0.89434 2.338531,-1.07349"
       id="path5399" />
    <path
       style="fill:#cfcfcf;fill-opacity:1;fill-rule:nonzero;stroke:none;stroke-width:0.352778"
       d="M 8.7245865,23.887007 H 0.89043849 c -0.01516,0.50712 0.99356501,1.25539 1.99402101,1.13688 1.43316,-0.1943 1.612305,-0.1502 3.551204,-0.11162 1.938901,0.0413 2.087727,-0.85438 2.288923,-1.02526"
       id="path5401" />
    <path
       style="fill:#cacaca;fill-opacity:1;fill-rule:nonzero;stroke:none;stroke-width:0.352778"
       d="M 8.6363925,23.887007 H 0.97725449 c -0.01516,0.48369 1.01974801,1.21405 1.99677701,1.079 1.445562,-0.22048 1.529623,-0.1378 3.425803,-0.0992 1.89618,0.0372 2.040876,-0.81718 2.236558,-0.97979"
       id="path5403" />
    <path
       style="fill:#c5c5c5;fill-opacity:1;fill-rule:nonzero;stroke:none;stroke-width:0.352778"
       d="m 8.5495735,23.887007 h -7.485503 c -0.01516,0.46164 1.047309,1.17409 1.999534,1.02113 1.457964,-0.24943 1.44694,-0.1254 3.300401,-0.0882 1.852084,0.0358 1.994021,-0.77859 2.185568,-0.93293"
       id="path5405" />
    <path
       style="fill:#c2bfbf;fill-opacity:1;fill-rule:nonzero;stroke:none;stroke-width:0.352778"
       d="m 8.4627585,23.885627 h -7.311871 c -0.01378,0.43822 1.073492,1.13551 2.002289,0.96601 1.471745,-0.27699 1.364258,-0.11438 3.173622,-0.0785 1.810741,0.0345 1.948547,-0.74001 2.13596,-0.88746"
       id="path5407" />
    <path
       style="fill:#bdbaba;fill-opacity:1;fill-rule:nonzero;stroke:none;stroke-width:0.352778"
       d="m 8.3759405,23.885627 h -7.138237 c -0.01378,0.41617 1.099675,1.09417 2.005046,0.90813 1.484147,-0.30455 1.281575,-0.1006 3.04822,-0.0675 1.766645,0.0317 1.901692,-0.70142 2.084971,-0.84061"
       id="path5409" />
    <path
       style="fill:#dedcdc;fill-opacity:1;fill-rule:nonzero;stroke:#211e1e;stroke-width:0.105833;stroke-linecap:butt;stroke-linejoin:miter;stroke-miterlimit:4;stroke-opacity:1"
       d="m 6.1876165,23.494267 h -3.257682 l 0.694531,-2.24344 c 0,0 0.184658,-0.89435 0.934311,-0.89435 0.749652,0 0.934309,0.89435 0.934309,0.89435 z m 0,0"
       id="path5411" />
    <path
       style="fill:#7a7878;fill-opacity:1;fill-rule:nonzero;stroke:none;stroke-width:0.352778"
       d="m 4.5477515,21.686277 c 0.208084,0 0.376205,-0.16949 0.376205,-0.37758 0,-0.20808 -0.168121,-0.3762 -0.376205,-0.3762 -0.208084,0 -0.377582,0.16812 -0.377582,0.3762 0,0.20809 0.169498,0.37758 0.377582,0.37758"
       id="path5413" />
    <path
       style="fill:none;stroke:#211e1e;stroke-width:0.105833;stroke-linecap:butt;stroke-linejoin:miter;stroke-miterlimit:4;stroke-opacity:1"
       d="m 4.5477515,21.686277 c 0.208084,0 0.376204,-0.16949 0.376204,-0.37758 0,-0.20808 -0.16812,-0.3762 -0.376204,-0.3762 -0.208084,0 -0.377583,0.16812 -0.377583,0.3762 0,0.20809 0.169499,0.37758 0.377583,0.37758 z m 0,0"
       id="path5415" />
    <path
       style="fill:#eeeeee;fill-opacity:1;fill-rule:nonzero;stroke:none;stroke-width:0.352778"
       d="m 4.5119225,21.265977 c 0.09233,-0.062 0.141938,-0.14882 0.111621,-0.19568 -0.03032,-0.0455 -0.129535,-0.0331 -0.221864,0.0289 -0.09233,0.0606 -0.143316,0.14745 -0.111621,0.1943 0.03032,0.0455 0.129535,0.0331 0.221864,-0.0275"
       id="path5417" />
    <path
       style="fill:#dedcdc;fill-opacity:1;fill-rule:nonzero;stroke:none;stroke-width:0.352778"
       d="m 8.1485645,23.498407 h -7.121701 v 0.38585 h 7.121701 z m 0,0"
       id="path5419" />
    <path
       style="fill:none;stroke:#211e1e;stroke-width:0.105833;stroke-linecap:butt;stroke-linejoin:miter;stroke-miterlimit:4;stroke-opacity:1"
       d="m 8.1485645,23.498407 h -7.121701 v 0.38585 h 7.121701 z m 0.569129,0.39549 H 0.56935649"
       id="path5421" />
    <path
       style="fill:#d7d7d7;fill-opacity:1;fill-rule:nonzero;stroke:#211e1e;stroke-width:0.141111;stroke-linecap:butt;stroke-linejoin:miter;stroke-miterlimit:4;stroke-opacity:1"
       d="m 41.767178,22.101067 c 0.27699,0 0.50161,-0.21773 0.50161,-0.48644 v -0.54709 c 0,-0.26871 -0.22462,-0.48644 -0.50161,-0.48644 h -19.2443 c -0.27698,0 -0.5016,0.21773 -0.5016,0.48644 v 0.54709 c 0,0.26871 0.22462,0.48644 0.5016,0.48644 z m 0,0"
       id="path5423" />
    <path
       style="fill:none;stroke:#e3e3e3;stroke-width:0.127706;stroke-linecap:round;stroke-linejoin:miter;stroke-miterlimit:4;stroke-opacity:1"
       d="m 41.720328,20.775397 c -0.0579,-0.0193 -0.12264,-0.0303 -0.19016,-0.0303 h -18.77027 c -0.27147,0 -0.49057,0.17087 -0.49057,0.38171 v 0.42857 c 0,0.11163 0.062,0.21222 0.16123,0.2825"
       id="path5425" />
    <path
       style="fill:none;stroke:#7a7878;stroke-width:0.127706;stroke-linecap:round;stroke-linejoin:miter;stroke-miterlimit:4;stroke-opacity:1"
       d="m 22.430558,21.837867 c 0.0868,0.062 0.20257,0.0992 0.32934,0.0992 h 18.77026 c 0.27148,0 0.49059,-0.17088 0.49059,-0.38172 v -0.42857 c 0,-0.15847 -0.12403,-0.29352 -0.30042,-0.3514"
       id="path5427" />
    <path
       style="fill:#7a7878;fill-opacity:1;fill-rule:nonzero;stroke:none;stroke-width:0.352778"
       d="m 22.921128,21.683527 c 0.20809,0 0.37759,-0.1695 0.37759,-0.37621 0,-0.20946 -0.1695,-0.37758 -0.37759,-0.37758 -0.20808,0 -0.3762,0.16812 -0.3762,0.37758 0,0.20671 0.16812,0.37621 0.3762,0.37621"
       id="path5429" />
    <path
       style="fill:none;stroke:#211e1e;stroke-width:0.105833;stroke-linecap:butt;stroke-linejoin:miter;stroke-miterlimit:4;stroke-opacity:1"
       d="m 22.921128,21.683527 c 0.20809,0 0.37759,-0.1695 0.37759,-0.3762 0,-0.20946 -0.1695,-0.37759 -0.37759,-0.37759 -0.20808,0 -0.3762,0.16813 -0.3762,0.37759 0,0.2067 0.16812,0.3762 0.3762,0.3762 z m 0,0"
       id="path5431" />
    <path
       style="fill:#eeeeee;fill-opacity:1;fill-rule:nonzero;stroke:none;stroke-width:0.352778"
       d="m 22.886688,21.263227 c 0.0909,-0.062 0.14193,-0.14883 0.11024,-0.19431 -0.0303,-0.0468 -0.12954,-0.0345 -0.22187,0.0262 -0.0923,0.062 -0.14193,0.14883 -0.11162,0.1943 0.0303,0.0469 0.13092,0.0345 0.22325,-0.0262"
       id="path5433" />
    <path
       style="fill:#7a7878;fill-opacity:1;fill-rule:nonzero;stroke:none;stroke-width:0.352778"
       d="m 41.342748,21.706947 c 0.20809,0 0.3762,-0.1695 0.3762,-0.37758 0,-0.20808 -0.16811,-0.3762 -0.3762,-0.3762 -0.20808,0 -0.3762,0.16812 -0.3762,0.3762 0,0.20808 0.16812,0.37758 0.3762,0.37758"
       id="path5435" />
    <path
       style="fill:none;stroke:#211e1e;stroke-width:0.105833;stroke-linecap:butt;stroke-linejoin:miter;stroke-miterlimit:4;stroke-opacity:1"
       d="m 41.342748,21.706957 c 0.20809,0 0.3762,-0.1695 0.3762,-0.37758 0,-0.20809 -0.16811,-0.37621 -0.3762,-0.37621 -0.20808,0 -0.3762,0.16812 -0.3762,0.37621 0,0.20808 0.16812,0.37758 0.3762,0.37758 z m 0,0"
       id="path5437" />
    <path
       style="fill:#eeeeee;fill-opacity:1;fill-rule:nonzero;stroke:none;stroke-width:0.352778"
       d="m 41.306918,21.286647 c 0.0923,-0.062 0.14194,-0.14883 0.11162,-0.19568 -0.0303,-0.0455 -0.13091,-0.0331 -0.22186,0.0275 -0.0937,0.062 -0.14332,0.14883 -0.11162,0.19569 0.0303,0.0455 0.12953,0.033 0.22186,-0.0276"
       id="path5439" />
    <path
       style="fill:#211e1e;fill-opacity:1;fill-rule:nonzero;stroke:none;stroke-width:0.352778"
       d="m 52.332608,2.8581479 -2.68718,0.935686 0.38172,-0.964628 -0.38447,-0.899859 z m 0,0"
       id="path5441" />
    <text
       xml:space="preserve"
       style="font-size:2.11667px;line-height:1.25;font-family:sans-serif;text-align:end;text-anchor:end;stroke-width:0.264583"
       x="3.0935931"
       y="21.50139"
       id="text10600"><tspan
         sodipodi:role="line"
         id="tspan10598"
         style="text-align:end;text-anchor:end;stroke-width:0.264583"
         x="3.0935931"
         y="21.50139">$A$</tspan></text>
    <text
       xml:space="preserve"
       style="font-size:2.11667px;line-height:1.25;font-family:sans-serif;text-align:end;text-anchor:end;stroke-width:0.264583"
       x="21.453716"
       y="19.963547"
       id="text10684"><tspan
         sodipodi:role="line"
         id="tspan10682"
         style="text-align:end;text-anchor:end;stroke-width:0.264583"
         x="21.453716"
         y="19.963547">$B$</tspan></text>
    <text
       xml:space="preserve"
       style="font-size:2.11667px;line-height:1.25;font-family:sans-serif;stroke-width:0.264583"
       x="42.979034"
       y="22.039799"
       id="text10688"><tspan
         sodipodi:role="line"
         id="tspan10686"
         style="stroke-width:0.264583"
         x="42.979034"
         y="22.039799">$C$</tspan></text>
    <text
       xml:space="preserve"
       style="font-size:2.11667px;line-height:1.25;font-family:sans-serif;text-align:center;text-anchor:middle;stroke-width:0.264583"
       x="40.982426"
       y="0.76790088"
       id="text10692"><tspan
         sodipodi:role="line"
         id="tspan10690"
         style="text-align:center;text-anchor:middle;stroke-width:0.264583"
         x="40.982426"
         y="0.76790088">$D$</tspan></text>
    <text
       xml:space="preserve"
       style="font-size:2.11667px;line-height:1.25;font-family:sans-serif;text-align:center;text-anchor:middle;stroke-width:0.264583"
       x="23.179609"
       y="0.76790088"
       id="text10696"><tspan
         sodipodi:role="line"
         id="tspan10694"
         style="text-align:center;text-anchor:middle;stroke-width:0.264583"
         x="23.179609"
         y="0.76790088">$E$</tspan></text>
    <text
       xml:space="preserve"
       style="font-size:2.11667px;line-height:1.25;font-family:sans-serif;text-align:end;text-anchor:end;stroke-width:0.264583"
       x="52.176594"
       y="6.1825256"
       id="text20938"><tspan
         sodipodi:role="line"
         id="tspan20936"
         style="text-align:end;text-anchor:end;stroke-width:0.264583"
         x="52.176594"
         y="6.1825256">$12$\;kN</tspan></text>
    <text
       xml:space="preserve"
       style="font-size:2.11667px;line-height:1.25;font-family:sans-serif;text-align:center;text-anchor:middle;stroke-width:0.264583"
       x="59.136265"
       y="12.858629"
       id="text26236"><tspan
         sodipodi:role="line"
         id="tspan26234"
         style="text-align:center;text-anchor:middle;stroke-width:0.264583"
         x="59.136265"
         y="12.858629">$3$\;m</tspan></text>
    <text
       xml:space="preserve"
       style="font-size:2.11667px;line-height:1.25;font-family:sans-serif;text-align:center;text-anchor:middle;stroke-width:0.264583"
       x="13.659369"
       y="31.415901"
       id="text26320"><tspan
         sodipodi:role="line"
         id="tspan26318"
         style="text-align:center;text-anchor:middle;stroke-width:0.264583"
         x="13.659369"
         y="31.415901">$3$\;m</tspan></text>
    <text
       xml:space="preserve"
       style="font-size:2.11667px;line-height:1.25;font-family:sans-serif;text-align:center;text-anchor:middle;stroke-width:0.264583"
       x="31.942774"
       y="31.366249"
       id="text26324"><tspan
         sodipodi:role="line"
         id="tspan26322"
         style="text-align:center;text-anchor:middle;stroke-width:0.264583"
         x="31.942774"
         y="31.366249">$3$\;m</tspan></text>
  </g>
</svg>
