#FIG 3.2
Landscape
Center
Inches
Letter  
100.00
Single
-2
1200 2
5 1 0 3 0 7 50 0 -1 0.000 0 0 0 0 3600.000 4800.000 1200 4800 3600 2400 6000 4800
6 1875 2400 5250 4800
2 1 0 1 0 7 50 0 -1 0.000 0 0 -1 0 0 2
	 3600 4800 3600 2400
2 1 0 1 0 7 50 0 -1 0.000 0 0 -1 0 0 2
	 1875 3150 3600 4800
2 1 0 1 0 7 50 0 -1 0.000 0 0 -1 0 0 2
	 3600 4800 5250 3000
-6
6 7200 2325 12150 4875
5 1 0 3 0 7 50 0 -1 0.000 0 0 0 0 9675.000 4800.000 7275 4800 9675 2400 12075 4800
6 7950 2400 11325 4800
2 1 0 1 0 7 50 0 -1 0.000 0 0 -1 0 0 2
	 9675 4800 9675 2400
2 1 0 1 0 7 50 0 -1 0.000 0 0 -1 0 0 2
	 7950 3150 9675 4800
2 1 0 1 0 7 50 0 -1 0.000 0 0 -1 0 0 2
	 9675 4800 11325 3000
-6
2 1 0 1 0 7 50 0 -1 0.000 0 0 -1 0 0 2
	 7275 4800 12075 4800
-6
6 9600 2550 12900 4875
2 1 0 2 0 7 50 0 -1 0.000 0 0 -1 0 0 2
	 12825 4800 12075 4800
3 0 0 2 0 7 50 0 -1 0.000 0 0 0 5
	 12825 4800 12375 3675 11625 3000 10650 2625 9675 2925
	 0.000 1.000 1.000 1.000 0.000
-6
6 6450 2550 9750 4875
2 1 0 2 0 7 50 0 -1 0.000 0 0 -1 0 0 2
	 6525 4800 7275 4800
3 0 0 2 0 7 50 0 -1 0.000 0 0 0 5
	 6525 4800 6975 3675 7725 3000 8700 2625 9675 2925
	 0.000 1.000 1.000 1.000 0.000
-6
6 13875 2325 18825 4875
5 1 0 3 0 7 50 0 -1 0.000 0 0 0 0 16350.000 4800.000 13950 4800 16350 2400 18750 4800
6 14625 2400 18000 4800
2 1 0 1 0 7 50 0 -1 0.000 0 0 -1 0 0 2
	 16350 4800 16350 2400
2 1 0 1 0 7 50 0 -1 0.000 0 0 -1 0 0 2
	 14625 3150 16350 4800
2 1 0 1 0 7 50 0 -1 0.000 0 0 -1 0 0 2
	 16350 4800 18000 3000
-6
2 1 0 1 0 7 50 0 -1 0.000 0 0 -1 0 0 2
	 13950 4800 18750 4800
-6
2 1 0 2 0 7 50 0 -1 0.000 0 0 -1 0 0 2
	 750 4800 1200 4800
2 1 0 2 0 7 50 0 -1 0.000 0 0 -1 0 0 2
	 5550 4800 6000 4800
2 1 0 1 0 7 50 0 -1 0.000 0 0 -1 0 0 2
	 1200 4800 6000 4800
3 0 0 2 0 7 50 0 -1 0.000 0 0 0 5
	 750 4800 1350 3900 2100 3075 2925 2550 3600 2400
	 0.000 1.000 1.000 1.000 0.000
3 0 0 2 0 7 50 0 -1 0.000 0 0 0 6
	 3600 2400 4500 2400 5475 2925 5850 3600 5850 4200 5550 4800
	 0.000 1.000 1.000 1.000 1.000 0.000
3 0 0 2 0 7 50 0 -1 0.000 0 0 0 9
	 15075 4800 15000 4275 15075 3600 15600 3000 16350 2700 17025 2925
	 17475 3600 18075 4125 18375 4800
	 0.000 1.000 1.000 1.000 1.000 1.000 1.000 1.000
	 0.000
4 0 0 50 0 0 32 0.0000 4 330 795 1350 4725 0.45\001
4 0 0 50 0 0 32 0.0000 4 330 795 4725 4650 0.45\001
4 0 0 50 0 0 32 0.7854 4 330 1065 4350 3900 -0.09\001
4 0 0 50 0 0 32 5.4978 4 330 1065 2025 3225 -0.09\001
4 0 0 50 0 0 32 0.0000 4 330 225 7500 4725 1\001
4 0 0 50 0 0 32 0.0000 4 330 225 11775 4725 1\001
4 0 0 50 0 0 32 0.7854 4 330 795 10862 4037 0.32\001
4 0 0 50 0 0 32 5.4978 4 330 795 8175 3300 0.32\001
4 0 0 50 0 0 32 1.5708 4 330 1065 10050 3975 -0.55\001
4 0 0 50 0 0 40 0.0000 4 405 675 975 2850 M:\001
4 0 0 50 0 0 40 0.0000 4 405 555 6975 2925 V:\001
4 0 0 50 0 0 40 0.0000 4 405 585 13800 3000 N:\001
4 0 0 50 0 0 32 0.0000 4 330 1065 14100 4725 -1.45\001
4 0 0 50 0 0 32 5.4978 4 330 1065 15150 3600 -0.91\001
4 0 0 50 0 0 32 0.7854 4 330 1065 16650 4350 -1.09\001
4 0 0 50 0 0 32 0.0000 4 330 1065 17025 4725 -0.55\001
4 0 0 50 0 0 32 1.5708 4 330 1065 16350 3975 -0.45\001
