#FIG 3.2  Produced by xfig version 3.2.6a
Landscape
Center
Metric
A4
100.00
Single
-2
1200 2
5 1 0 2 0 7 50 -1 -1 0.000 0 1 1 0 292.500 3881.250 630 3690 405 3510 180 3510
	1 1 2.00 120.00 240.00
5 1 0 2 0 7 50 -1 -1 6.000 0 1 1 0 -36.196 9585.979 225 9450 -225 9360 -270 9765
	1 1 2.00 120.00 240.00
2 1 0 3 0 7 50 -1 -1 0.000 0 0 -1 0 0 3
	 0 4500 2700 900 5400 4500
2 1 0 3 0 7 50 -1 -1 0.000 0 0 -1 0 0 3
	 6833 4495 9533 895 12233 4495
2 3 0 1 0 7 50 -1 -1 0.000 0 0 -1 0 0 4
	 -225 4815 0 4500 225 4815 -225 4815
2 3 0 1 0 7 50 -1 -1 0.000 0 0 -1 0 0 4
	 5130 4815 5355 4500 5580 4815 5130 4815
2 1 0 1 0 7 50 -1 -1 0.000 0 0 -1 0 0 2
	 5130 4950 5625 4950
2 1 0 1 0 7 50 -1 -1 0.000 0 0 -1 0 0 2
	 0 4950 0 5445
2 1 0 1 0 7 50 -1 -1 0.000 0 0 -1 0 0 2
	 2700 4995 2700 5490
2 1 0 1 0 7 50 -1 -1 0.000 0 0 -1 0 0 2
	 5400 5040 5400 5535
2 1 0 1 0 7 50 -1 -1 0.000 0 0 -1 0 0 2
	 3960 900 6075 900
2 1 0 1 0 7 50 -1 -1 0.000 0 0 -1 0 0 2
	 5580 4455 6030 4455
2 1 0 1 0 7 50 -1 -1 0.000 0 0 -1 1 1 2
	1 1 1.00 60.00 120.00
	1 1 1.00 60.00 120.00
	 0 5355 2700 5355
2 1 0 1 0 7 50 -1 -1 0.000 0 0 -1 1 1 2
	1 1 1.00 60.00 120.00
	1 1 1.00 60.00 120.00
	 2700 5355 5355 5400
2 1 0 1 0 7 50 -1 -1 0.000 0 0 -1 1 1 2
	1 1 1.00 60.00 120.00
	1 1 1.00 60.00 120.00
	 5850 4455 5850 900
2 2 0 1 0 7 50 -1 49 0.000 0 0 -1 0 0 5
	 -90 4500 -450 4500 -450 900 -90 900 -90 4500
2 1 0 1 0 7 50 -1 -1 0.000 0 0 -1 0 0 4
	 -540 2520 -450 2610 -675 2835 -1035 2835
2 1 0 2 0 7 50 -1 -1 0.000 0 0 -1 1 0 2
	1 1 2.00 120.00 240.00
	 5535 4455 6120 4455
2 1 1 2 0 7 50 -1 -1 6.000 0 0 -1 0 0 2
	 0 4500 360 3060
2 1 0 2 0 7 50 -1 -1 6.000 0 0 -1 1 0 2
	1 1 2.00 120.00 240.00
	 12195 5175 12195 4590
2 1 0 2 0 7 50 -1 -1 6.000 0 0 -1 1 0 2
	1 1 2.00 120.00 240.00
	 6885 4590 6885 5310
2 1 0 2 0 7 50 -1 -1 6.000 0 0 -1 1 0 2
	1 1 2.00 120.00 240.00
	 7605 4455 6840 4455
2 1 0 3 0 7 50 -1 -1 0.000 0 0 -1 0 0 3
	 39 9817 2739 6217 5439 9817
2 1 0 3 0 7 50 -1 -1 0.000 0 0 -1 0 0 3
	 7297 9816 9997 6216 12697 9816
2 1 0 2 0 7 50 -1 -1 6.000 0 0 -1 1 0 2
	1 1 2.00 120.00 240.00
	 12825 9810 13275 9810
2 1 0 2 0 7 50 -1 -1 6.000 0 0 -1 1 0 2
	1 1 2.00 120.00 240.00
	 5445 9900 5445 10440
2 1 0 2 0 7 50 -1 -1 6.000 0 0 -1 1 0 2
	1 1 2.00 120.00 240.00
	 45 10485 45 9900
2 1 0 1 0 7 50 -1 -1 4.000 0 0 -1 0 0 1
	 2430 6255
2 1 0 1 0 7 50 -1 -1 4.000 0 0 -1 0 0 1
	 2430 6255
2 1 0 1 0 7 50 -1 -1 4.000 0 0 -1 0 0 4
	 45 9810 -225 9585 2610 6120 2745 6210
2 1 0 1 0 7 50 -1 -1 4.000 0 0 -1 0 0 3
	 2745 6210 2925 6075 5445 9810
2 1 0 2 0 7 50 -1 -1 6.000 0 0 -1 1 0 2
	1 1 2.00 120.00 240.00
	 7155 9810 6390 9810
2 1 0 1 0 7 50 -1 -1 4.000 0 0 -1 0 0 3
	 12690 9810 9360 6705 9990 6210
2 1 0 1 0 7 50 -1 -1 4.000 0 0 -1 0 0 3
	 7335 9765 10575 6570 9990 6165
2 1 1 1 0 7 50 -1 -1 4.000 0 0 -1 0 0 2
	 12870 4005 17325 7335
2 1 1 1 0 7 50 -1 -1 4.000 0 0 -1 0 0 2
	 15705 495 19908 3636
2 1 0 1 0 7 50 -1 -1 4.000 0 0 -1 0 0 2
	 16121 6364 18821 2809
2 1 1 1 0 7 50 -1 -1 4.000 0 0 -1 0 0 2
	 13133 9985 16733 12685
2 1 1 1 0 7 50 -1 -1 4.000 0 0 -1 0 0 2
	 15482 6133 19082 8833
2 1 1 1 0 7 50 -1 -1 4.000 0 0 -1 0 0 2
	 14682 8233 18282 10933
2 1 0 1 0 7 50 -1 -1 4.000 0 0 -1 0 0 2
	 15382 11638 18082 8083
2 1 0 1 0 7 50 -1 -1 4.000 0 0 -1 0 0 3
	 15345 11655 15480 11745 18180 8190
2 1 0 1 0 7 50 -1 -1 4.000 0 0 -1 0 0 2
	 15908 12043 18608 8488
2 1 0 1 0 7 50 -1 -1 4.000 0 0 -1 0 0 3
	 15885 12105 15750 11970 18630 8460
2 1 0 1 0 7 50 -1 -1 4.000 0 0 -1 0 0 3
	 9540 900 9045 1350 12240 4545
2 1 0 1 0 7 50 -1 -1 4.000 0 0 -1 0 0 2
	 13120 4125 15820 570
2 1 0 1 0 7 50 -1 -1 4.000 0 0 -1 0 0 2
	 14856 5438 17556 1883
2 1 0 1 0 7 50 -1 -1 4.000 0 0 -1 0 0 2
	 9540 900 10125 1350
2 1 0 1 0 7 50 -1 -1 4.000 0 0 -1 0 0 2
	 8235 2655 8865 3105
2 1 0 1 0 7 50 -1 -1 4.000 0 0 -1 0 0 2
	 14850 5445 18135 2295
2 1 1 1 0 7 50 -1 -1 4.000 0 0 -1 0 0 2
	 14517 2124 18117 4824
2 1 0 1 0 7 50 -1 -1 4.000 0 0 -1 0 0 2
	 13245 10057 15945 6502
2 1 0 1 0 7 50 -1 -1 4.000 0 0 -1 0 0 2
	 13975 10605 16675 7050
2 1 0 1 0 7 50 -1 -1 4.000 0 0 -1 0 0 2
	 13254 10060 16539 6910
3 0 0 1 0 7 50 -1 -1 4.000 0 0 0 3
	 6885 4455 9000 3240 10080 1350
	 0.000 1.000 0.000
3 0 0 1 0 7 50 -1 -1 4.000 0 0 0 3
	 13184 4139 15299 2924 16379 1034
	 0.000 1.000 0.000
3 0 0 1 0 7 50 -1 -1 4.000 0 0 0 3
	 16110 6435 18045 4770 18810 2790
	 0.000 1.000 0.000
3 0 0 1 0 7 50 -1 -1 4.000 0 0 0 3
	 14008 10620 15943 8955 16708 6975
	 0.000 1.000 0.000
4 0 0 50 -1 0 24 0.0000 4 270 210 1395 5265 3\001
4 0 0 50 -1 0 24 0.0000 4 270 210 3870 5310 3\001
4 0 0 50 -1 0 24 1.5708 4 270 210 5715 2745 4\001
4 0 0 50 -1 0 24 0.0000 4 270 210 -900 2790 1\001
4 0 0 50 -1 0 24 0.0000 4 270 300 315 4770 A\001
4 0 0 50 -1 0 24 0.0000 4 270 270 4950 4635 B\001
4 0 0 50 -1 0 24 0.0000 4 270 270 2880 900 C\001
4 0 0 50 -1 32 24 0.0000 4 210 255 225 4005 a\001
4 0 0 50 -1 1 24 0.0000 4 270 660 5670 4770 v=?\001
4 0 0 50 -1 1 24 0.0000 4 270 480 540 4050 =?\001
4 0 0 50 -1 0 24 0.0000 4 270 480 7470 855 M:\001
4 0 0 50 -1 0 24 0.0000 4 270 735 11430 4905 1.33\001
4 0 0 50 -1 0 24 0.0000 4 270 735 6930 5220 1.33\001
4 0 0 50 -1 0 24 0.0000 4 270 210 7290 4410 4\001
4 0 0 50 -1 0 24 0.0000 4 270 210 8685 1305 4\001
4 0 0 50 -1 0 24 0.0000 4 270 585 945 6300 M :\001
4 0 0 50 -1 0 24 0.0000 4 270 585 7425 6345 M :\001
4 0 0 50 -1 32 24 0.0000 4 300 195 7200 6345 d\001
4 0 0 50 -1 32 20 0.0000 4 165 210 1215 6390 a\001
4 0 0 50 -1 1 20 0.0000 4 150 150 7740 6435 v\001
4 0 0 50 -1 32 24 0.0000 4 300 195 12690 9720 d\001
4 0 0 50 -1 0 24 0.0000 4 270 210 12915 9675 1\001
4 0 0 50 -1 32 24 0.0000 4 300 195 -495 9270 d\001
4 0 0 50 -1 0 24 0.0000 4 270 210 -315 9270 1\001
4 0 0 50 -1 0 24 0.0000 4 270 945 5625 10395 0.166\001
4 0 0 50 -1 0 24 0.0000 4 270 945 180 10395 0.166\001
4 0 0 50 -1 0 24 0.0000 4 270 210 -405 10035 1\001
4 0 0 50 -1 0 24 0.0000 4 285 525 2520 6030 0.5\001
4 0 0 50 -1 0 24 0.0000 4 270 210 6795 9765 1\001
4 0 0 50 -1 0 24 0.0000 4 270 210 9495 6390 4\001
4 0 0 50 -1 0 24 0.0000 4 270 210 10305 6390 4\001
4 0 0 50 -1 0 24 0.0000 4 285 525 15075 11970 0.5\001
4 0 0 50 -1 0 24 0.0000 4 285 525 15255 12240 0.5\001
4 0 0 50 -1 0 24 0.0000 4 285 525 18180 8055 0.5\001
4 0 0 50 -1 0 24 5.4978 4 120 225 13431 6223 =\001
4 0 0 50 -1 0 24 5.4978 4 210 225 13450 6898 +\001
4 0 0 50 -1 0 24 0.0000 4 270 210 18045 2295 4\001
4 0 0 50 -1 1 24 0.0000 4 285 585 15660 8820 sh3\001
4 0 0 50 -1 1 24 0.0000 4 285 585 17010 8955 sh4\001
4 0 0 50 -1 1 24 0.0000 4 285 585 17370 9630 sh5\001
4 0 0 50 -1 0 24 0.0000 4 270 210 16425 1080 4\001
4 0 0 50 -1 0 24 0.0000 4 270 210 9900 1215 4\001
4 0 0 50 -1 0 24 0.0000 4 270 210 9090 3195 4\001
4 0 0 50 -1 0 24 0.0000 4 270 210 15345 2790 4\001
4 0 0 50 -1 0 24 0.0000 4 270 210 16605 4230 2\001
4 0 0 50 -1 0 24 5.4978 4 120 225 15165 3465 =\001
4 0 0 50 -1 1 24 0.0000 4 285 585 15435 4005 sh2\001
4 0 0 50 -1 1 24 0.0000 4 285 585 14535 3465 sh1\001
4 0 0 50 -1 0 24 5.4978 4 210 225 16335 4545 +\001
4 0 0 50 -1 1 24 0.0000 4 285 585 16605 4950 sh3\001
4 0 0 50 -1 0 24 0.0000 4 270 210 18135 4725 2\001
4 0 0 50 -1 1 24 0.0000 4 285 585 15165 7740 sh2\001
4 0 0 50 -1 0 24 0.0000 4 270 210 14895 8775 2\001
4 0 0 50 -1 0 24 0.0000 4 270 210 15615 9360 2\001
4 0 0 50 -1 0 24 0.0000 4 285 735 16785 10350 0.25\001
4 0 0 50 -1 0 24 0.0000 4 270 210 16470 6930 4\001
