#FIG 3.2
Landscape
Center
Inches
Letter  
100.00
Single
-2
1200 2
5 1 0 1 0 7 100 0 -1 4.000 0 1 1 0 7337.500 2408.928 8550 2850 8625 2325 8475 1800
	1 1 1.00 60.00 120.00
5 1 0 2 0 7 100 0 -1 6.000 0 1 1 0 12762.500 2237.500 13350 2250 13275 1950 13050 1725
	1 1 2.00 120.00 240.00
5 1 0 2 0 7 100 0 -1 6.000 0 0 1 0 14087.500 2237.500 13500 2250 13575 1950 13800 1725
	1 1 2.00 120.00 240.00
6 4725 2325 9675 5550
2 1 0 3 0 7 100 0 -1 8.000 0 0 -1 0 0 3
	 4800 4800 4800 2400 7125 2400
2 1 0 3 0 7 100 0 -1 8.000 0 0 -1 0 0 3
	 9600 4800 9600 2400 7275 2400
2 1 0 3 0 7 100 0 -1 8.000 0 0 -1 0 0 2
	 4950 3600 9450 3600
2 3 0 1 0 7 100 0 -1 4.000 0 0 -1 0 0 4
	 4725 4875 4800 4725 4875 4875 4725 4875
2 3 0 1 0 7 100 0 -1 4.000 0 0 -1 0 0 4
	 9525 4875 9600 4725 9675 4875 9525 4875
2 1 0 1 0 7 100 0 -1 4.000 0 0 -1 0 0 2
	 9600 4950 9600 5550
-6
6 13800 1950 14175 2250
4 0 0 100 0 0 24 0.0000 4 255 180 13950 2250 1\001
4 0 0 100 0 32 24 0.0000 4 270 180 13800 2250 d\001
-6
6 12750 1950 13125 2250
4 0 0 100 0 0 24 0.0000 4 255 180 12900 2250 1\001
4 0 0 100 0 32 24 0.0000 4 270 180 12750 2250 d\001
-6
1 3 0 1 0 7 100 0 -1 4.000 1 0.0000 7200 2400 75 75 7200 2400 7275 2400
1 3 0 1 0 7 100 0 -1 4.000 1 0.0000 9525 3600 75 75 9525 3600 9600 3600
1 3 0 1 0 7 100 0 -1 4.000 1 0.0000 4875 3600 75 75 4875 3600 4950 3600
1 3 0 1 0 7 100 0 -1 4.000 1 0.0000 11100 3600 75 75 11100 3600 11175 3600
1 3 0 1 0 7 100 0 -1 4.000 1 0.0000 15750 3600 75 75 15750 3600 15825 3600
1 3 0 1 0 7 100 0 -1 4.000 1 0.0000 13425 2400 75 75 13425 2400 13500 2400
2 1 0 1 0 7 100 0 -1 4.000 0 0 -1 0 0 1
	 5025 5400
2 1 0 1 0 7 100 0 -1 4.000 0 0 -1 0 0 2
	 9525 4950 9675 4950
2 1 0 1 0 7 100 0 -1 4.000 0 0 -1 0 0 2
	 4800 5025 4800 5625
2 1 0 1 0 7 100 0 -1 4.000 0 0 -1 0 0 2
	 7200 5025 7200 5625
2 1 0 1 0 7 100 0 -1 4.000 0 0 -1 0 0 2
	 9750 2400 10350 2400
2 1 0 1 0 7 100 0 -1 4.000 0 0 -1 0 0 2
	 9750 3600 10350 3600
2 1 0 1 0 7 100 0 -1 4.000 0 0 -1 0 0 2
	 9750 4800 10350 4800
2 1 0 1 0 7 100 0 -1 4.000 0 0 -1 1 1 2
	1 1 1.00 60.00 120.00
	1 1 1.00 60.00 120.00
	 4800 5475 7200 5475
2 1 0 1 0 7 100 0 -1 4.000 0 0 -1 1 1 2
	1 1 1.00 60.00 120.00
	1 1 1.00 60.00 120.00
	 7200 5475 9600 5475
2 1 0 1 0 7 100 0 -1 4.000 0 0 -1 1 1 2
	1 1 1.00 60.00 120.00
	1 1 1.00 60.00 120.00
	 10275 4800 10275 3600
2 1 0 1 0 7 100 0 -1 4.000 0 0 -1 1 1 2
	1 1 1.00 60.00 120.00
	1 1 1.00 60.00 120.00
	 10275 3600 10275 2400
2 1 0 1 0 7 100 0 -1 4.000 0 0 -1 0 0 2
	 6450 2175 8850 3000
2 1 0 1 0 7 100 0 -1 4.000 0 0 -1 0 0 2
	 6750 2625 8625 1725
2 1 0 1 0 7 100 0 -1 4.000 0 0 -1 0 0 2
	 15750 4950 15900 4950
2 1 0 2 0 7 100 0 -1 6.000 0 0 -1 0 0 2
	 11025 3975 15825 3975
2 1 0 2 0 7 100 0 -1 6.000 0 0 -1 0 0 3
	 11025 2400 11025 2025 12600 2025
2 1 0 2 0 7 100 0 -1 6.000 0 0 -1 0 0 3
	 14250 2025 15825 2025 15825 2400
2 1 0 3 0 7 100 0 -1 8.000 0 0 -1 0 0 3
	 11025 4800 11025 2400 13350 2400
2 1 0 3 0 7 100 0 -1 8.000 0 0 -1 0 0 3
	 15825 4800 15825 2400 13500 2400
2 1 0 3 0 7 100 0 -1 8.000 0 0 -1 0 0 2
	 11175 3600 15675 3600
2 3 0 1 0 7 100 0 -1 4.000 0 0 -1 0 0 4
	 10950 4875 11025 4725 11100 4875 10950 4875
2 3 0 1 0 7 100 0 -1 4.000 0 0 -1 0 0 4
	 15750 4875 15825 4725 15900 4875 15750 4875
3 0 1 3 0 7 100 0 -1 8.000 0 0 0 3
	 7125 2475 6450 2700 5775 2700
	 0.000 1.000 0.000
3 0 1 3 0 7 100 0 -1 8.000 0 0 0 3
	 7275 2475 7875 2625 8625 2625
	 0.000 1.000 0.000
4 0 0 100 0 32 24 0.0000 4 330 435 8700 2175 Df\001
4 0 0 100 0 32 24 0.0000 4 255 180 5925 5400 4\001
4 0 0 100 0 32 24 0.0000 4 255 180 8325 5400 4\001
4 0 0 100 0 32 24 1.5708 4 255 180 10200 4350 2\001
4 0 0 100 0 32 24 1.5708 4 255 180 10200 3150 2\001
4 0 0 100 0 0 24 0.0000 4 255 1005 6750 3525 t=20 C\001
4 0 0 100 0 0 16 0.0000 4 120 120 7425 3375 o\001
4 0 0 100 0 0 24 0.0000 4 255 660 11925 4275 -0.5\001
4 0 0 100 0 32 24 0.0000 4 255 450 14775 1950 0.5\001
4 0 0 100 0 0 24 0.0000 4 330 3270 11400 5475 virtual load case, N(x)\001
