<?xml version="1.0" encoding="UTF-8" standalone="no"?>
<!-- Created with Inkscape (http://www.inkscape.org/) -->

<svg
   width="77.432228mm"
   height="27.441893mm"
   viewBox="0 0 77.432228 27.441893"
   version="1.1"
   id="svg15690"
   inkscape:version="1.1.1 (3bf5ae0d25, 2021-09-20)"
   sodipodi:docname="01-01.svg"
   xmlns:inkscape="http://www.inkscape.org/namespaces/inkscape"
   xmlns:sodipodi="http://sodipodi.sourceforge.net/DTD/sodipodi-0.dtd"
   xmlns="http://www.w3.org/2000/svg"
   xmlns:svg="http://www.w3.org/2000/svg">
  <sodipodi:namedview
     id="namedview15692"
     pagecolor="#ffffff"
     bordercolor="#666666"
     borderopacity="1.0"
     inkscape:pageshadow="2"
     inkscape:pageopacity="0.0"
     inkscape:pagecheckerboard="0"
     inkscape:document-units="mm"
     showgrid="false"
     fit-margin-top="0"
     fit-margin-left="0"
     fit-margin-right="0"
     fit-margin-bottom="0"
     inkscape:zoom="2.2394562"
     inkscape:cx="145.57105"
     inkscape:cy="108.28522"
     inkscape:window-width="1852"
     inkscape:window-height="1016"
     inkscape:window-x="0"
     inkscape:window-y="0"
     inkscape:window-maximized="1"
     inkscape:current-layer="layer1" />
  <defs
     id="defs15687">
    <clipPath
       clipPathUnits="userSpaceOnUse"
       id="clipPath136">
      <path
         d="m 90.474,530.789 h 200.051 v 75.953 H 90.474 Z"
         id="path134" />
    </clipPath>
    <linearGradient
       x1="0"
       y1="0"
       x2="1"
       y2="0"
       gradientUnits="userSpaceOnUse"
       gradientTransform="matrix(0,-10.026306,-10.026306,0,193.48334,567.86258)"
       spreadMethod="pad"
       id="linearGradient250">
      <stop
         style="stop-opacity:1;stop-color:#4b96b6"
         offset="0"
         id="stop246" />
      <stop
         style="stop-opacity:1;stop-color:#dfeef4"
         offset="1"
         id="stop248" />
    </linearGradient>
    <clipPath
       clipPathUnits="userSpaceOnUse"
       id="clipPath260">
      <path
         d="m 90.474,530.789 h 200.051 v 75.953 H 90.474 Z"
         id="path258" />
    </clipPath>
    <clipPath
       clipPathUnits="userSpaceOnUse"
       id="clipPath280">
      <path
         d="m 90.474,530.909 h 200.051 v 75.833 H 90.474 Z"
         id="path278" />
    </clipPath>
    <clipPath
       clipPathUnits="userSpaceOnUse"
       id="clipPath296">
      <path
         d="m 90.474,530.789 h 200.051 v 75.953 H 90.474 Z"
         id="path294" />
    </clipPath>
    <clipPath
       clipPathUnits="userSpaceOnUse"
       id="clipPath344">
      <path
         d="m 90.474,530.789 h 200.051 v 75.953 H 90.474 Z"
         id="path342" />
    </clipPath>
  </defs>
  <g
     inkscape:label="Layer 1"
     inkscape:groupmode="layer"
     id="layer1"
     transform="translate(-103.2106,-184.99902)">
    <g
       id="g130"
       transform="matrix(0.35277777,0,0,-0.35277777,74.619725,399.73381)">
      <g
         id="g132"
         clip-path="url(#clipPath136)">
        <g
           id="g138"
           transform="translate(104.41679,542.18629)">
          <path
             d="m 0,0 v 38.087 c -3.524,0.072 -8.095,-3.401 -8.095,-8.306 0,-5.657 1.246,-9.229 0.969,-18.657 C -7.403,1.697 -1.185,0.979 0,0"
             style="fill:#ffffff;fill-opacity:1;fill-rule:nonzero;stroke:none"
             id="path140" />
        </g>
        <g
           id="g142"
           transform="translate(104.41769,542.37869)">
          <path
             d="m 0,0 v 37.703 c -3.461,0.072 -7.984,-3.459 -7.938,-8.312 0.077,-5.685 1.212,-9.046 0.94,-18.379 C -7.27,1.68 -1.164,0.969 0,0"
             style="fill:#fdfdfd;fill-opacity:1;fill-rule:nonzero;stroke:none"
             id="path144" />
        </g>
        <g
           id="g146"
           transform="translate(104.41811,542.571)">
          <path
             d="m 0,0 v 37.32 c -3.397,0.071 -7.891,-3.519 -7.78,-8.319 0.133,-5.714 1.178,-8.863 0.911,-18.102 C -7.136,1.663 -1.142,0.958 0,0"
             style="fill:#fbfbfb;fill-opacity:1;fill-rule:nonzero;stroke:none"
             id="path148" />
        </g>
        <g
           id="g150"
           transform="translate(104.4191,542.7625)">
          <path
             d="m 0,0 v 36.937 c -3.333,0.07 -7.787,-3.578 -7.622,-8.325 0.2,-5.742 1.144,-8.681 0.881,-17.824 C -7.002,1.646 -1.121,0.949 0,0"
             style="fill:#f9f9f9;fill-opacity:1;fill-rule:nonzero;stroke:none"
             id="path152" />
        </g>
        <g
           id="g154"
           transform="translate(104.41969,542.9548)">
          <path
             d="m 0,0 v 36.554 c -3.27,0.069 -7.682,-3.637 -7.464,-8.332 0.267,-5.771 1.11,-8.498 0.852,-17.546 C -6.869,1.629 -1.099,0.939 0,0"
             style="fill:#f7f6f7;fill-opacity:1;fill-rule:nonzero;stroke:none"
             id="path156" />
        </g>
        <g
           id="g158"
           transform="translate(104.42059,543.1472)">
          <path
             d="m 0,0 v 36.17 c -3.207,0.069 -7.577,-3.696 -7.307,-8.338 0.337,-5.8 1.076,-8.315 0.824,-17.269 C -6.735,1.611 -1.078,0.929 0,0"
             style="fill:#f4f4f4;fill-opacity:1;fill-rule:nonzero;stroke:none"
             id="path160" />
        </g>
        <g
           id="g162"
           transform="translate(104.4212,543.3396)">
          <path
             d="m 0,0 v 35.786 c -3.143,0.068 -7.47,-3.754 -7.149,-8.344 0.407,-5.829 1.042,-8.132 0.794,-16.99 C -6.601,1.595 -1.057,0.919 0,0"
             style="fill:#f2f2f2;fill-opacity:1;fill-rule:nonzero;stroke:none"
             id="path164" />
        </g>
        <g
           id="g166"
           transform="translate(104.4221,543.53101)">
          <path
             d="m 0,0 v 35.404 c -3.079,0.067 -7.362,-3.815 -6.992,-8.351 0.479,-5.858 1.009,-7.949 0.766,-16.712 C -6.468,1.578 -1.035,0.91 0,0"
             style="fill:#f0f0f0;fill-opacity:1;fill-rule:nonzero;stroke:none"
             id="path168" />
        </g>
        <g
           id="g170"
           transform="translate(104.423,543.7234)">
          <path
             d="M 0,0 V 35.02 C -3.016,35.086 -7.254,31.147 -6.834,26.663 -6.283,20.777 -5.86,18.896 -6.098,10.229 -6.334,1.561 -1.014,0.899 0,0"
             style="fill:#eeeeee;fill-opacity:1;fill-rule:nonzero;stroke:none"
             id="path172" />
        </g>
        <g
           id="g174"
           transform="translate(104.42349,543.9158)">
          <path
             d="m 0,0 v 34.636 c -2.952,0.066 -7.145,-3.932 -6.677,-8.363 0.625,-5.916 0.941,-7.584 0.708,-16.157 C -6.2,1.544 -0.993,0.89 0,0"
             style="fill:#ececec;fill-opacity:1;fill-rule:nonzero;stroke:none"
             id="path176" />
        </g>
        <g
           id="g178"
           transform="translate(104.4245,544.1082)">
          <path
             d="m 0,0 v 34.253 c -2.888,0.065 -7.035,-3.992 -6.52,-8.37 0.7,-5.945 0.907,-7.401 0.68,-15.879 C -6.067,1.526 -0.971,0.88 0,0"
             style="fill:#eaeaea;fill-opacity:1;fill-rule:nonzero;stroke:none"
             id="path180" />
        </g>
        <g
           id="g182"
           transform="translate(104.425,544.29961)">
          <path
             d="m 0,0 v 33.87 c -2.825,0.065 -6.923,-4.05 -6.361,-8.375 0.776,-5.974 0.872,-7.219 0.65,-15.602 C -5.933,1.51 -0.95,0.87 0,0"
             style="fill:#e8e7e8;fill-opacity:1;fill-rule:nonzero;stroke:none"
             id="path184" />
        </g>
        <g
           id="g186"
           transform="translate(104.42599,544.4919)">
          <path
             d="M 0,0 V 33.487 C -2.761,33.55 -6.811,29.377 -6.204,25.104 -5.352,19.102 -5.365,18.069 -5.583,9.78 -5.8,1.492 -0.928,0.86 0,0"
             style="fill:#e6e5e6;fill-opacity:1;fill-rule:nonzero;stroke:none"
             id="path188" />
        </g>
        <g
           id="g190"
           transform="translate(104.42641,544.6843)">
          <path
             d="M 0,0 V 33.103 C -2.697,33.166 -6.698,28.935 -6.046,24.715 -5.115,18.684 -5.241,17.862 -5.454,9.668 -5.665,1.476 -0.907,0.851 0,0"
             style="fill:#e4e3e3;fill-opacity:1;fill-rule:nonzero;stroke:none"
             id="path192" />
        </g>
        <g
           id="g194"
           transform="translate(104.4274,544.8768)">
          <path
             d="m 0,0 v 32.719 c -2.634,0.063 -6.584,-4.226 -5.889,-8.394 1.011,-6.059 0.771,-6.67 0.564,-14.769 C -5.532,1.458 -0.886,0.84 0,0"
             style="fill:#e2e1e1;fill-opacity:1;fill-rule:nonzero;stroke:none"
             id="path196" />
        </g>
        <g
           id="g198"
           transform="translate(104.4285,545.0681)">
          <path
             d="M 0,0 V 32.337 C -2.57,32.398 -6.47,28.051 -5.731,23.936 -4.64,17.849 -4.995,17.449 -5.197,9.444 -5.399,1.441 -0.864,0.831 0,0"
             style="fill:#e0dfdf;fill-opacity:1;fill-rule:nonzero;stroke:none"
             id="path200" />
        </g>
        <g
           id="g202"
           transform="translate(104.42889,545.2606)">
          <path
             d="M 0,0 V 31.953 C -2.506,32.014 -6.354,27.61 -5.574,23.546 -4.4,17.432 -4.871,17.242 -5.068,9.333 -5.265,1.425 -0.843,0.821 0,0"
             style="fill:#dedddd;fill-opacity:1;fill-rule:nonzero;stroke:none"
             id="path204" />
        </g>
        <g
           id="g206"
           transform="translate(104.4299,545.4529)">
          <path
             d="m 0,0 v 31.569 c -2.443,0.06 -6.238,-4.401 -5.417,-8.413 1.258,-6.142 0.67,-6.121 0.478,-13.935 C -5.131,1.407 -0.822,0.811 0,0"
             style="fill:#dbdbdb;fill-opacity:1;fill-rule:nonzero;stroke:none"
             id="path208" />
        </g>
        <g
           id="g210"
           transform="translate(104.4304,545.64529)">
          <path
             d="m 0,0 v 31.186 c -2.379,0.059 -6.121,-4.459 -5.259,-8.42 1.343,-6.168 0.636,-5.938 0.448,-13.658 C -4.998,1.39 -0.8,0.801 0,0"
             style="fill:#d9d9d9;fill-opacity:1;fill-rule:nonzero;stroke:none"
             id="path212" />
        </g>
        <g
           id="g214"
           transform="translate(104.4314,545.8367)">
          <path
             d="M 0,0 V 30.803 C -2.316,30.862 -6.003,26.288 -5.101,22.377 -3.672,16.183 -4.5,16.621 -4.682,8.997 -4.864,1.373 -0.779,0.792 0,0"
             style="fill:#d7d6d7;fill-opacity:1;fill-rule:nonzero;stroke:none"
             id="path216" />
        </g>
        <g
           id="g218"
           transform="translate(104.43179,546.0291)">
          <path
             d="m 0,0 v 30.42 c -2.252,0.058 -5.885,-4.573 -4.943,-8.433 1.517,-6.219 0.567,-5.573 0.39,-13.102 C -4.73,1.356 -0.757,0.781 0,0"
             style="fill:#d5d4d5;fill-opacity:1;fill-rule:nonzero;stroke:none"
             id="path220" />
        </g>
        <g
           id="g222"
           transform="translate(104.4328,546.2214)">
          <path
             d="m 0,0 v 30.036 c -2.189,0.057 -5.766,-4.629 -4.786,-8.439 1.607,-6.244 0.534,-5.39 0.361,-12.825 C -4.597,1.339 -0.736,0.771 0,0"
             style="fill:#d3d2d2;fill-opacity:1;fill-rule:nonzero;stroke:none"
             id="path224" />
        </g>
        <g
           id="g226"
           transform="translate(104.3615,544.0144)">
          <path
             d="M 0,0 V 34.431"
             style="fill:none;stroke:#231f20;stroke-width:0.5;stroke-linecap:butt;stroke-linejoin:miter;stroke-miterlimit:4;stroke-dasharray:none;stroke-opacity:1"
             id="path228" />
        </g>
        <g
           id="g230"
           transform="translate(282.6254,558.3582)">
          <path
             d="m 0,0 v -3.023 h -178.283 v 13.44 H 0 Z"
             style="fill:#c7e1eb;fill-opacity:1;fill-rule:nonzero;stroke:none"
             id="path232" />
        </g>
      </g>
    </g>
    <g
       id="g234"
       transform="matrix(0.35277777,0,0,-0.35277777,74.619725,399.73381)">
      <g
         id="g236">
        <g
           id="g242">
          <g
             id="g244">
            <path
               d="m 104.342,558.064 h 178.283 v 8.098 H 104.342 Z"
               style="fill:url(#linearGradient250);stroke:none"
               id="path252" />
          </g>
        </g>
      </g>
    </g>
    <g
       id="g254"
       transform="matrix(0.35277777,0,0,-0.35277777,74.619725,399.73381)">
      <g
         id="g256"
         clip-path="url(#clipPath260)">
        <g
           id="g262"
           transform="translate(104.3425,567.9534)">
          <path
             d="M 0,0 H 178.283"
             style="fill:none;stroke:#e9f3f7;stroke-width:0.5;stroke-linecap:butt;stroke-linejoin:miter;stroke-miterlimit:4;stroke-dasharray:none;stroke-opacity:1"
             id="path264" />
        </g>
        <g
           id="g266"
           transform="translate(104.3425,558.04469)">
          <path
             d="M 0,0 H 178.283"
             style="fill:none;stroke:#4c96b6;stroke-width:0.5;stroke-linecap:butt;stroke-linejoin:miter;stroke-miterlimit:4;stroke-dasharray:none;stroke-opacity:1"
             id="path268" />
        </g>
        <g
           id="g270"
           transform="translate(104.3425,566.1619)">
          <path
             d="M 0,0 H 178.283"
             style="fill:none;stroke:#231f20;stroke-width:0.25;stroke-linecap:butt;stroke-linejoin:miter;stroke-miterlimit:4;stroke-dasharray:none;stroke-opacity:1"
             id="path272" />
        </g>
      </g>
    </g>
    <g
       id="g274"
       transform="matrix(0.35277777,0,0,-0.35277777,74.619725,399.73381)">
      <g
         id="g276"
         clip-path="url(#clipPath280)">
        <g
           id="g282"
           transform="translate(282.6254,558.0388)">
          <path
             d="m 0,0 v -2.704 h -178.283 v 13.44 L 0,10.736 Z"
             style="fill:none;stroke:#231f20;stroke-width:0.5;stroke-linecap:butt;stroke-linejoin:miter;stroke-miterlimit:4;stroke-dasharray:none;stroke-opacity:1"
             id="path284" />
        </g>
        <g
           id="g286"
           transform="translate(193.3663,530.9089)">
          <path
             d="M 0,0 V 22.383 M 87.36,0 V 22.703 M -88.962,0 v 11.053 m 1.252,-6.198 h 34.709"
             style="fill:none;stroke:#231f20;stroke-width:0.25;stroke-linecap:butt;stroke-linejoin:miter;stroke-miterlimit:4;stroke-dasharray:none;stroke-opacity:1"
             id="path288" />
        </g>
      </g>
    </g>
    <g
       id="g298"
       transform="matrix(0.35277777,0,0,-0.35277777,112.51518,210.44829)">
      <path
         d="M 0,0 -0.331,-0.793 0,-1.585 -2.971,-0.793 Z"
         style="fill:#231f20;fill-opacity:1;fill-rule:nonzero;stroke:none"
         id="path300" />
    </g>
    <g
       id="g302"
       transform="matrix(0.35277777,0,0,-0.35277777,142.36304,210.72804)">
      <path
         d="M 0,0 H -35.385"
         style="fill:none;stroke:#231f20;stroke-width:0.25;stroke-linecap:butt;stroke-linejoin:miter;stroke-miterlimit:4;stroke-dasharray:none;stroke-opacity:1"
         id="path304" />
    </g>
    <g
       id="g306"
       transform="matrix(0.35277777,0,0,-0.35277777,141.74074,210.44829)">
      <path
         d="M 0,0 0.331,-0.793 0,-1.585 2.971,-0.793 Z"
         style="fill:#231f20;fill-opacity:1;fill-rule:nonzero;stroke:none"
         id="path308" />
    </g>
    <g
       id="g314"
       transform="matrix(0.35277777,0,0,-0.35277777,143.29367,210.72804)">
      <path
         d="M 0,0 H 34.493"
         style="fill:none;stroke:#231f20;stroke-width:0.25;stroke-linecap:butt;stroke-linejoin:miter;stroke-miterlimit:4;stroke-dasharray:none;stroke-opacity:1"
         id="path316" />
    </g>
    <g
       id="g318"
       transform="matrix(0.35277777,0,0,-0.35277777,143.91562,210.44829)">
      <path
         d="M 0,0 -0.33,-0.793 0,-1.585 -2.97,-0.793 Z"
         style="fill:#231f20;fill-opacity:1;fill-rule:nonzero;stroke:none"
         id="path320" />
    </g>
    <g
       id="g322"
       transform="matrix(0.35277777,0,0,-0.35277777,173.1863,210.72804)">
      <path
         d="M 0,0 H -34.747"
         style="fill:none;stroke:#231f20;stroke-width:0.25;stroke-linecap:butt;stroke-linejoin:miter;stroke-miterlimit:4;stroke-dasharray:none;stroke-opacity:1"
         id="path324" />
    </g>
    <g
       id="g326"
       transform="matrix(0.35277777,0,0,-0.35277777,172.57563,210.44829)">
      <path
         d="M 0,0 0.323,-0.793 0,-1.585 2.916,-0.793 Z"
         style="fill:#231f20;fill-opacity:1;fill-rule:nonzero;stroke:none"
         id="path328" />
    </g>
    <g
       id="g350"
       transform="matrix(0.35277777,0,0,-0.35277777,173.32321,196.98124)">
      <path
         d="M 0,0 V 16.661"
         style="fill:none;stroke:#231f20;stroke-width:1.25;stroke-linecap:butt;stroke-linejoin:miter;stroke-miterlimit:4;stroke-dasharray:none;stroke-opacity:1"
         id="path352" />
    </g>
    <g
       id="g354"
       transform="matrix(0.35277777,0,0,-0.35277777,173.30024,198.64953)">
      <path
         d="M 0,0 -2.544,7.312 0.079,6.274 2.528,7.318 Z"
         style="fill:#231f20;fill-opacity:1;fill-rule:nonzero;stroke:none"
         id="path356" />
    </g>
    <path
       d="m 174.31084,199.06958 h -2.20168 v -0.56444 h 2.20168 z"
       style="fill:#a9c4d0;fill-opacity:1;fill-rule:nonzero;stroke:none;stroke-width:0.352778"
       id="path358" />
    <path
       d="m 174.31084,199.06958 h -2.20168 v -0.56444 h 2.20168 z"
       style="fill:none;stroke:#231f20;stroke-width:0.176389;stroke-linecap:butt;stroke-linejoin:miter;stroke-miterlimit:4;stroke-dasharray:none;stroke-opacity:1"
       id="path360" />
    <g
       id="g366"
       transform="matrix(0.35277777,0,0,-0.35277777,142.73029,196.98124)">
      <path
         d="M 0,0 V 23.381"
         style="fill:none;stroke:#231f20;stroke-width:1.25;stroke-linecap:butt;stroke-linejoin:miter;stroke-miterlimit:4;stroke-dasharray:none;stroke-opacity:1"
         id="path368" />
    </g>
    <g
       id="g370"
       transform="matrix(0.35277777,0,0,-0.35277777,142.707,198.64953)">
      <path
         d="M 0,0 -2.544,7.312 0.079,6.274 2.528,7.318 Z"
         style="fill:#231f20;fill-opacity:1;fill-rule:nonzero;stroke:none"
         id="path372" />
    </g>
    <path
       d="m 143.7176,199.06958 h -2.20168 v -0.56444 h 2.20168 z"
       style="fill:#a9c4d0;fill-opacity:1;fill-rule:nonzero;stroke:none;stroke-width:0.352778"
       id="path374" />
    <path
       d="m 143.7176,199.06958 h -2.20168 v -0.56444 h 2.20168 z"
       style="fill:none;stroke:#231f20;stroke-width:0.176389;stroke-linecap:butt;stroke-linejoin:miter;stroke-miterlimit:4;stroke-dasharray:none;stroke-opacity:1"
       id="path376" />
    <text
       xml:space="preserve"
       style="font-size:2.82222px;line-height:1.25;font-family:sans-serif;stroke-width:0.264583"
       x="124.63282"
       y="211.48459"
       id="text20925"><tspan
         sodipodi:role="line"
         id="tspan20923"
         style="font-size:2.82222px;stroke-width:0.264583"
         x="124.63282"
         y="211.48459">$2$\,m</tspan></text>
    <text
       xml:space="preserve"
       style="font-size:2.82222px;line-height:1.25;font-family:sans-serif;stroke-width:0.264583"
       x="155.85327"
       y="211.48459"
       id="text30855"><tspan
         sodipodi:role="line"
         id="tspan30853"
         style="font-size:2.82222px;stroke-width:0.264583"
         x="155.85327"
         y="211.48459">$2$\,m</tspan></text>
    <text
       xml:space="preserve"
       style="font-size:2.82222px;line-height:1.25;font-family:sans-serif;stroke-width:0.264583"
       x="137.86185"
       y="187.14325"
       id="text30859"><tspan
         sodipodi:role="line"
         id="tspan30857"
         style="font-size:2.82222px;stroke-width:0.264583"
         x="137.86185"
         y="187.14325">$8$ kN</tspan></text>
    <text
       xml:space="preserve"
       style="font-size:2.82222px;line-height:1.25;font-family:sans-serif;stroke-width:0.264583"
       x="168.20686"
       y="189.57643"
       id="text30863"><tspan
         sodipodi:role="line"
         id="tspan30861"
         style="font-size:2.82222px;stroke-width:0.264583"
         x="168.20686"
         y="189.57643">$3$ kN</tspan></text>
    <text
       xml:space="preserve"
       style="font-size:2.82222px;line-height:1.25;font-family:sans-serif;text-align:end;text-anchor:end;stroke-width:0.264583"
       x="108.49813"
       y="202.70572"
       id="text31747"><tspan
         sodipodi:role="line"
         id="tspan31745"
         style="font-size:2.82222px;text-align:end;text-anchor:end;stroke-width:0.264583"
         x="108.49813"
         y="202.70572">$A$</tspan></text>
    <text
       xml:space="preserve"
       style="font-size:2.82222px;line-height:1.25;font-family:sans-serif;text-align:start;text-anchor:start;stroke-width:0.264583"
       x="175.34979"
       y="203.45105"
       id="text38831"
       inkscape:transform-center-x="34.921907"
       inkscape:transform-center-y="-15.044724"><tspan
         sodipodi:role="line"
         id="tspan38829"
         style="font-size:2.82222px;text-align:start;text-anchor:start;stroke-width:0.264583"
         x="175.34979"
         y="203.45105">$B$</tspan></text>
  </g>
</svg>
