#FIG 3.2  Produced by xfig version 3.2.5c
Landscape
Center
Metric
A4      
100.00
Single
-2
1200 2
2 1 0 3 0 7 50 -1 -1 8.000 0 0 -1 0 0 4
	 0 4500 1350 2700 3150 2700 4500 4500
2 3 0 1 0 7 50 -1 -1 4.000 0 0 -1 0 0 4
	 -225 4770 0 4500 225 4770 -225 4770
2 3 0 1 0 7 50 -1 -1 4.000 0 0 -1 0 0 4
	 4275 4725 4500 4455 4725 4725 4275 4725
2 1 0 2 0 7 50 -1 -1 6.000 0 0 -1 0 0 2
	 0 4950 0 5580
2 1 0 2 0 7 50 -1 -1 6.000 0 0 -1 0 0 2
	 1350 4905 1350 5535
2 1 0 2 0 7 50 -1 -1 6.000 0 0 -1 0 0 2
	 3150 4905 3150 5535
2 1 0 2 0 7 50 -1 -1 6.000 0 0 -1 0 0 2
	 4500 4860 4500 5490
2 1 0 2 0 7 50 -1 -1 6.000 0 0 -1 0 0 2
	 4725 4500 5310 4500
2 1 0 2 0 7 50 -1 -1 6.000 0 0 -1 0 0 2
	 4410 2700 5265 2700
2 1 0 1 0 7 50 -1 -1 4.000 0 0 -1 1 1 2
	1 1 1.00 60.00 120.00
	1 1 1.00 60.00 120.00
	 0 5355 1350 5355
2 1 0 1 0 7 50 -1 -1 4.000 0 0 -1 1 1 2
	1 1 1.00 60.00 120.00
	1 1 1.00 60.00 120.00
	 1350 5355 3150 5355
2 1 0 1 0 7 50 -1 -1 4.000 0 0 -1 1 1 2
	1 1 1.00 60.00 120.00
	1 1 1.00 60.00 120.00
	 3150 5355 4500 5355
2 1 0 1 0 7 50 -1 -1 4.000 0 0 -1 1 1 2
	1 1 1.00 60.00 120.00
	1 1 1.00 60.00 120.00
	 5220 4500 5220 2700
2 1 0 1 0 7 50 -1 -1 0.000 0 0 -1 0 0 2
	 4995 4905 4995 5445
2 1 0 1 0 7 50 -1 -1 0.000 0 0 -1 1 0 2
	1 1 1.00 60.00 120.00
	 4500 5130 5040 5130
4 0 0 50 -1 0 24 0.0000 4 270 210 270 4635 1\001
4 0 0 50 -1 0 24 0.0000 4 270 210 3960 4545 2\001
4 0 0 50 -1 0 24 0.0000 4 270 210 1260 3105 3\001
4 0 0 50 -1 0 24 0.0000 4 270 210 2925 3060 4\001
4 0 0 50 -1 0 24 0.0000 4 270 210 540 5310 3\001
4 0 0 50 -1 0 24 0.0000 4 270 210 2205 5310 4\001
4 0 0 50 -1 0 24 1.5708 4 270 210 5130 3735 4\001
4 0 0 50 -1 0 24 0.0000 4 270 210 3780 5310 3\001
4 0 0 50 -1 0 24 0.0000 4 180 165 4635 5040 s\001
4 0 0 50 -1 0 24 0.0000 4 285 1170 1800 3960 EJ=2.5\001
