#FIG 3.2
Landscape
Center
Inches
Letter  
100.00
Single
-2
1200 2
6 1125 600 12225 2925
6 7125 1050 12225 2175
2 1 0 3 0 7 50 0 -1 8.000 0 0 -1 0 0 2
	 7350 1575 12150 1575
2 1 0 2 0 7 50 0 -1 6.000 0 0 -1 0 0 2
	 7350 1125 7350 2100
2 1 0 1 0 7 50 0 -1 4.000 0 0 -1 0 0 2
	 7125 1350 7350 1125
2 1 0 1 0 7 50 0 -1 4.000 0 0 -1 0 0 2
	 7125 1575 7350 1350
2 1 0 1 0 7 50 0 -1 4.000 0 0 -1 0 0 2
	 7125 1800 7350 1575
2 1 0 1 0 7 50 0 -1 4.000 0 0 -1 0 0 2
	 7125 2025 7350 1800
-6
6 1125 1050 6225 2175
2 1 0 3 0 7 50 0 -1 8.000 0 0 -1 0 0 2
	 1350 1575 6150 1575
2 1 0 2 0 7 50 0 -1 6.000 0 0 -1 0 0 2
	 1350 1125 1350 2100
2 1 0 1 0 7 50 0 -1 4.000 0 0 -1 0 0 2
	 1125 1350 1350 1125
2 1 0 1 0 7 50 0 -1 4.000 0 0 -1 0 0 2
	 1125 1575 1350 1350
2 1 0 1 0 7 50 0 -1 4.000 0 0 -1 0 0 2
	 1125 1800 1350 1575
2 1 0 1 0 7 50 0 -1 4.000 0 0 -1 0 0 2
	 1125 2025 1350 1800
-6
2 1 0 2 0 7 50 0 -1 6.000 0 0 -1 0 0 3
	 6150 1575 1350 2775 1350 2100
2 1 0 2 0 7 50 0 -1 6.000 0 0 -1 0 0 4
	 7350 2100 7350 2250 12150 2250 12150 1575
4 0 0 50 0 0 24 0.0000 4 255 345 7575 1050 V:\001
4 0 0 50 0 0 24 0.0000 4 255 420 3450 900 M:\001
4 0 0 50 0 0 24 0.0000 4 255 630 1950 2925 37.4\001
4 0 0 50 0 0 24 0.0000 4 255 840 10875 2700 -3.74\001
-6
