#FIG 3.2
Landscape
Center
Inches
Letter  
100.00
Single
-2
1200 2
6 1080 1170 6030 3645
2 1 0 3 0 7 50 0 -1 0.000 0 0 -1 0 0 4
	 1125 3600 6000 3600 6000 1200 1200 1200
2 1 0 3 0 7 50 0 -1 0.000 0 0 -1 0 0 2
	 1200 1200 3600 3600
2 1 0 3 0 7 50 0 -1 0.000 0 0 -1 0 0 3
	 1125 3600 3600 1200 6000 3600
-6
6 7335 1170 12240 3645
2 1 0 3 0 7 50 0 -1 0.000 0 0 -1 0 0 4
	 7350 3600 12225 3600 12225 1200 7425 1200
2 1 0 3 0 7 50 0 -1 0.000 0 0 -1 0 0 2
	 7425 1200 9825 3600
2 1 0 3 0 7 50 0 -1 0.000 0 0 -1 0 0 3
	 7350 3600 9825 1200 12225 3600
-6
6 1080 5355 6030 7830
2 1 0 3 0 7 50 0 -1 0.000 0 0 -1 0 0 4
	 1125 7800 6000 7800 6000 5400 1200 5400
2 1 0 3 0 7 50 0 -1 0.000 0 0 -1 0 0 2
	 1200 5400 3600 7800
2 1 0 3 0 7 50 0 -1 0.000 0 0 -1 0 0 3
	 1125 7800 3600 5400 6000 7800
-6
6 1125 6525 2115 7515
2 1 0 1 0 7 50 0 -1 0.000 0 0 -1 0 0 4
	 1425 7500 1160 7235 1849 6545 2114 6811
4 0 0 50 0 0 24 0.7854 4 255 765 1425 7394 -1.41\001
-6
6 4320 7425 4905 7830
2 1 0 1 0 7 50 0 -1 0.000 0 0 -1 0 0 4
	 4350 7800 4350 7425 4875 7425 4875 7800
4 0 0 50 0 0 24 0.0000 4 255 315 4425 7725 -1\001
-6
6 5625 6210 6030 6750
2 1 0 1 0 7 50 0 -1 0.000 0 0 -1 0 0 4
	 6000 6750 5625 6750 5625 6225 6000 6225
4 0 0 50 0 0 24 1.5708 4 255 315 5925 6675 -1\001
-6
6 7245 5355 12195 7830
2 1 0 3 0 7 50 0 -1 0.000 0 0 -1 0 0 4
	 7275 7800 12150 7800 12150 5400 7350 5400
2 1 0 3 0 7 50 0 -1 0.000 0 0 -1 0 0 2
	 7350 5400 9750 7800
2 1 0 3 0 7 50 0 -1 0.000 0 0 -1 0 0 3
	 7275 7800 9750 5400 12150 7800
-6
6 8100 4995 9180 5400
2 1 0 1 0 7 50 0 -1 0.000 0 0 -1 0 0 4
	 8100 5400 8100 5025 9150 5025 9150 5400
4 0 0 50 0 0 24 0.0000 4 255 810 8250 5325 0.707\001
-6
6 8010 7425 9090 7830
2 1 0 1 0 7 50 0 -1 0.000 0 0 -1 0 0 4
	 8025 7800 8025 7425 9075 7425 9075 7800
4 0 0 50 0 0 24 0.0000 4 255 810 8175 7725 0.707\001
-6
6 10620 4995 11790 5400
2 1 0 1 0 7 50 0 -1 0.000 0 0 -1 0 0 4
	 10650 5400 10650 5025 11775 5025 11775 5400
4 0 0 50 0 0 24 0.0000 4 255 945 10725 5325 -0.707\001
-6
6 10485 7425 11655 7830
2 1 0 1 0 7 50 0 -1 0.000 0 0 -1 0 0 4
	 10500 7800 10500 7425 11625 7425 11625 7800
4 0 0 50 0 0 24 0.0000 4 255 945 10575 7725 -0.707\001
-6
6 11745 5985 12150 7155
2 1 0 1 0 7 50 0 -1 0.000 0 0 -1 0 0 4
	 12150 7125 11775 7125 11775 6000 12150 6000
4 0 0 50 0 0 24 1.5708 4 255 945 12075 7050 -0.707\001
-6
6 8550 5715 9180 6300
2 1 0 1 0 7 50 0 -1 0.000 0 0 -1 0 0 4
	 8850 6300 8585 6035 8903 5717 9168 5982
4 0 0 50 0 0 24 0.7854 4 255 315 8797 6247 -1\001
-6
6 10485 5895 10935 6390
2 1 0 1 0 7 50 0 -1 0.000 0 0 -1 0 0 4
	 10500 6150 10712 5938 10924 6150 10712 6362
4 0 0 50 0 0 24 5.4978 4 255 180 10553 6203 1\001
-6
6 8820 6615 9450 7245
2 1 0 1 0 7 50 0 -1 0.000 0 0 -1 0 0 4
	 8850 6900 9115 6635 9433 6953 9168 7218
4 0 0 50 0 0 24 5.4978 4 255 315 8903 6847 -1\001
-6
6 13095 1080 18045 3555
2 1 0 3 0 7 50 0 -1 0.000 0 0 -1 0 0 4
	 13125 3525 18000 3525 18000 1125 13200 1125
2 1 0 3 0 7 50 0 -1 0.000 0 0 -1 0 0 2
	 13200 1125 15600 3525
2 1 0 3 0 7 50 0 -1 0.000 0 0 -1 0 0 3
	 13125 3525 15600 1125 18000 3525
-6
6 14265 1350 15030 2205
2 1 0 1 0 7 50 0 -1 0.000 0 0 -1 0 0 4
	 14550 2175 14285 1910 14815 1380 15027 1592
4 0 0 50 0 0 24 0.7854 4 255 630 14550 2069 0.67\001
-6
6 15975 1215 16785 1980
2 1 0 1 0 7 50 0 -1 0.000 0 0 -1 0 0 4
	 15975 1500 16240 1235 16770 1765 16558 1977
4 0 0 50 0 0 24 5.4978 4 255 630 16081 1500 0.67\001
-6
6 14625 2250 15570 3195
2 1 0 1 0 7 50 0 -1 0.000 0 0 -1 0 0 4
	 14625 2550 14890 2285 15527 2921 15261 3186
4 0 0 50 0 0 24 5.4978 4 255 810 14731 2550 0.751\001
-6
6 15750 2160 16740 3150
2 1 0 1 0 7 50 0 -1 0.000 0 0 -1 0 0 4
	 16015 3115 15750 2850 16439 2161 16705 2426
4 0 0 50 0 0 24 0.7854 4 255 945 15962 3062 -0.751\001
-6
6 13185 5355 18090 7830
2 1 0 3 0 7 50 0 -1 0.000 0 0 -1 0 0 4
	 13200 7800 18075 7800 18075 5400 13275 5400
2 1 0 3 0 7 50 0 -1 0.000 0 0 -1 0 0 2
	 13275 5400 15675 7800
2 1 0 3 0 7 50 0 -1 0.000 0 0 -1 0 0 3
	 13200 7800 15675 5400 18075 7800
-6
6 14310 7470 14760 7740
4 0 0 50 0 0 24 0.0000 4 225 105 14625 7725 t\001
4 0 0 50 0 32 24 0.0000 4 255 225 14325 7725 D\001
-6
6 16650 7470 17055 7740
4 0 0 50 0 0 24 0.0000 4 225 105 16950 7725 t\001
4 0 0 50 0 32 24 0.0000 4 255 225 16650 7725 D\001
-6
2 1 0 3 0 7 50 0 -1 0.000 0 0 -1 0 0 2
	 3600 3600 6000 1200
2 1 0 2 0 7 50 0 -1 0.000 0 0 -1 0 0 2
	 1125 3225 1125 4050
2 1 0 2 0 7 50 0 -1 0.000 0 0 -1 0 0 2
	 1200 825 1200 1650
2 1 0 1 0 7 50 0 -1 0.000 0 0 -1 0 0 2
	 825 3450 1125 3300
2 1 0 1 0 7 50 0 -1 0.000 0 0 -1 0 0 2
	 825 3675 1125 3525
2 1 0 1 0 7 50 0 -1 0.000 0 0 -1 0 0 2
	 825 3900 1125 3750
2 1 0 1 0 7 50 0 -1 0.000 0 0 -1 0 0 2
	 900 975 1200 825
2 1 0 1 0 7 50 0 -1 0.000 0 0 -1 0 0 2
	 900 1200 1200 1050
2 1 0 1 0 7 50 0 -1 0.000 0 0 -1 0 0 2
	 900 1425 1200 1275
2 1 0 1 0 7 50 0 -1 0.000 0 0 -1 0 0 2
	 900 1650 1200 1500
2 1 0 1 0 7 50 0 -1 0.000 0 0 -1 0 0 2
	 1125 4050 1125 4350
2 1 0 1 0 7 50 0 -1 0.000 0 0 -1 0 0 2
	 3600 3825 3600 4350
2 1 0 1 0 7 50 0 -1 0.000 0 0 -1 0 0 2
	 6000 3825 6000 4350
2 1 0 1 0 7 50 0 -1 0.000 0 0 -1 0 0 2
	 6225 1200 6675 1200
2 1 0 1 0 7 50 0 -1 0.000 0 0 -1 0 0 2
	 6225 3600 6675 3600
2 1 0 2 0 7 50 0 -1 0.000 0 0 -1 1 0 2
	1 1 2.00 120.00 240.00
	 6000 675 6000 1125
2 1 0 1 0 7 50 0 -1 0.000 0 0 -1 1 1 2
	1 1 1.00 60.00 120.00
	1 1 1.00 60.00 120.00
	 1125 4125 3600 4125
2 1 0 1 0 7 50 0 -1 0.000 0 0 -1 1 1 2
	1 1 1.00 60.00 120.00
	1 1 1.00 60.00 120.00
	 3600 4125 6000 4125
2 1 0 1 0 7 50 0 -1 0.000 0 0 -1 1 1 2
	1 1 1.00 60.00 120.00
	1 1 1.00 60.00 120.00
	 6525 3600 6525 1200
2 1 0 3 0 7 50 0 -1 0.000 0 0 -1 0 0 2
	 9825 3600 11325 2100
2 1 0 3 0 7 50 0 -1 0.000 0 0 -1 0 0 2
	 12000 1425 12225 1200
2 1 0 2 0 7 50 0 -1 0.000 0 0 -1 1 0 2
	1 1 2.00 120.00 240.00
	 11400 2025 11625 1800
2 1 0 2 0 7 50 0 -1 0.000 0 0 -1 1 0 2
	1 1 2.00 120.00 240.00
	 11925 1500 11700 1725
2 1 0 2 0 7 50 0 -1 0.000 0 0 -1 1 0 2
	1 1 2.00 120.00 240.00
	 6000 4875 6000 5325
2 1 0 1 0 7 50 0 -1 0.000 0 0 -1 0 0 4
	 2100 7800 2100 7425 2625 7425 2625 7800
2 1 0 1 0 7 50 0 -1 0.000 0 0 -1 0 0 4
	 2175 5400 2175 5025 2700 5025 2700 5400
2 1 0 1 0 7 50 0 -1 0.000 0 0 -1 0 0 4
	 4575 5400 4575 5025 5100 5025 5100 5400
2 1 0 1 0 7 50 0 -1 0.000 0 0 -1 0 0 4
	 2775 6975 3075 6675 3375 6975 3075 7275
2 1 0 3 0 7 50 0 -1 0.000 0 0 -1 0 0 2
	 9787 7762 11287 6262
2 1 0 2 0 7 50 0 -1 0.000 0 0 -1 1 0 2
	1 1 2.00 120.00 240.00
	 11362 6187 11587 5962
2 1 0 2 0 7 50 0 -1 0.000 0 0 -1 1 0 2
	1 1 2.00 120.00 240.00
	 11812 5737 11587 5962
2 1 0 3 0 7 50 0 -1 0.000 0 0 -1 0 0 2
	 11925 5625 12150 5400
2 1 0 1 0 7 50 0 -1 0.000 0 0 -1 0 0 4
	 13875 3525 13875 3900 14925 3900 14925 3525
2 1 0 1 0 7 50 0 -1 0.000 0 0 -1 0 0 4
	 16425 3525 16425 3900 17475 3900 17475 3525
2 1 0 1 0 7 50 0 -1 0.000 0 0 -1 0 0 4
	 18000 2925 17625 2925 17625 1875 18000 1875
2 1 0 1 0 7 50 0 -1 0.000 0 0 -1 0 0 4
	 14100 1125 14100 750 14700 750 14700 1125
2 1 0 1 0 7 50 0 -1 0.000 0 0 -1 0 0 4
	 16500 1125 16500 750 17400 750 17400 1125
2 1 0 3 0 7 50 0 -1 0.000 0 0 -1 0 0 2
	 15675 7800 18075 5400
2 1 0 1 0 7 50 0 -1 0.000 0 0 -1 0 0 2
	 18150 5400 18525 5400
2 1 0 1 0 7 50 0 -1 0.000 0 0 -1 0 0 2
	 18150 5850 18525 5850
2 1 0 2 0 7 50 0 -1 0.000 0 0 -1 1 0 2
	1 1 2.00 120.00 240.00
	 18375 5400 18375 5850
2 1 0 3 0 7 50 0 -1 0.000 0 0 -1 0 0 2
	 15600 3525 18000 1125
4 0 0 50 0 0 24 0.0000 4 255 180 1500 3525 1\001
4 0 0 50 0 0 24 0.0000 4 255 180 4050 3525 2\001
4 0 0 50 0 0 24 0.0000 4 255 180 5400 3525 3\001
4 0 0 50 0 0 24 0.0000 4 255 180 1575 1500 4\001
4 0 0 50 0 0 24 0.0000 4 255 180 4050 1500 5\001
4 0 0 50 0 0 24 0.0000 4 255 180 5400 1500 6\001
4 0 0 50 0 0 24 0.0000 4 255 600 5250 1050 F=1\001
4 0 0 50 0 0 24 0.0000 4 255 180 2250 4050 1\001
4 0 0 50 0 0 24 0.0000 4 255 180 4650 4050 1\001
4 0 0 50 0 0 24 1.5708 4 255 180 6450 2625 1\001
4 0 0 50 0 0 24 0.0000 4 255 270 11775 2100 X\001
4 0 0 50 0 0 24 0.0000 4 255 3900 7950 1050 PRIMARY STRUCTURE\001
4 0 0 50 0 0 32 0.0000 4 345 615 3300 5175 N :\001
4 0 0 50 0 0 24 0.0000 4 180 180 3600 5250 o\001
4 0 0 50 0 0 24 0.0000 4 255 315 2175 7725 -1\001
4 0 0 50 0 0 24 0.0000 4 255 600 5250 5100 F=1\001
4 0 0 50 0 0 24 0.0000 4 255 180 4800 5325 0\001
4 0 0 50 0 0 24 0.0000 4 255 180 2325 5325 2\001
4 0 0 50 0 0 24 5.4978 4 255 180 2925 6975 0\001
4 0 0 50 0 0 24 0.0000 4 255 180 11400 5925 1\001
4 0 0 50 0 0 32 0.0000 4 345 615 9675 5175 N :\001
4 0 0 50 0 32 32 0.0000 4 375 240 9450 5175 d\001
4 0 0 50 0 0 24 0.0000 4 255 630 14100 1050 1.41\001
4 0 0 50 0 0 24 0.0000 4 255 810 16575 1050 0.531\001
4 0 0 50 0 0 24 0.0000 4 255 945 13950 3825 -1.531\001
4 0 0 50 0 0 24 0.0000 4 255 945 16425 3825 -0.469\001
4 0 0 50 0 0 24 1.5708 4 255 945 17925 2925 -0.469\001
4 0 0 50 0 0 24 0.0000 4 255 4215 13650 4350 FINAL MEMBER FORCES\001
4 0 0 50 0 0 24 0.0000 4 255 4260 13500 5250 LC 2 - THERMAL EFFECT\001
4 0 0 50 0 0 24 0.0000 4 255 540 18000 5250 v=?\001
4 0 0 50 0 0 24 0.0000 4 255 3660 1350 1050 LC 1 - FORCE EFFECT\001
