#FIG 3.2
Landscape
Center
Metric
A4      
100.00
Single
-2
1200 2
6 1935 5310 7560 8415
6 1935 7605 2520 7695
2 1 0 1 0 7 50 0 -1 0.000 0 0 -1 0 0 2
	 1935 7605 2520 7605
2 1 0 1 0 7 50 0 -1 0.000 0 0 -1 0 0 2
	 2070 7605 1980 7695
2 1 0 1 0 7 50 0 -1 0.000 0 0 -1 0 0 2
	 2205 7605 2115 7695
2 1 0 1 0 7 50 0 -1 0.000 0 0 -1 0 0 2
	 2340 7605 2250 7695
2 1 0 1 0 7 50 0 -1 0.000 0 0 -1 0 0 2
	 2475 7605 2385 7695
-6
6 4410 7470 5175 8235
5 1 0 2 0 7 50 0 -1 0.000 0 1 1 0 4654.360 7755.174 4635 8145 4950 8010 5040 7695
	1 1 2.00 120.00 240.00
2 1 0 2 0 7 50 0 -1 0.000 0 0 -1 1 0 2
	1 1 2.00 120.00 240.00
	 4500 8190 4500 7695
2 1 0 2 0 7 50 0 -1 0.000 0 0 -1 1 0 2
	1 1 2.00 120.00 240.00
	 4635 7560 5130 7560
-6
6 6210 7200 7560 8415
6 6615 7515 7380 8280
5 1 0 2 0 7 50 0 -1 0.000 0 1 1 0 6859.360 7800.174 6840 8190 7155 8055 7245 7740
	1 1 2.00 120.00 240.00
2 1 0 2 0 7 50 0 -1 0.000 0 0 -1 1 0 2
	1 1 2.00 120.00 240.00
	 6705 8235 6705 7740
2 1 0 2 0 7 50 0 -1 0.000 0 0 -1 1 0 2
	1 1 2.00 120.00 240.00
	 6840 7605 7335 7605
-6
4 0 0 50 0 0 24 0.0000 4 255 270 6210 8100 X\001
4 0 0 50 0 0 24 0.0000 4 255 270 6795 7470 X\001
4 0 0 50 0 0 24 0.0000 4 255 270 7155 8325 X\001
4 0 0 50 0 0 18 0.0000 4 195 135 6480 8190 5\001
4 0 0 50 0 0 18 0.0000 4 195 135 7110 7560 4\001
4 0 0 50 0 0 18 0.0000 4 195 135 7425 8415 6\001
-6
6 5040 7965 5445 8325
4 0 0 50 0 0 24 0.0000 4 255 270 5040 8235 X\001
4 0 0 50 0 0 18 0.0000 4 195 135 5310 8325 3\001
-6
6 4770 7110 5220 7515
4 0 0 50 0 0 24 0.0000 4 255 270 4770 7380 X\001
4 0 0 50 0 0 18 0.0000 4 195 135 5085 7515 1\001
-6
6 3960 7830 4365 8190
4 0 0 50 0 0 24 0.0000 4 255 270 3960 8100 X\001
4 0 0 50 0 0 18 0.0000 4 195 135 4230 8190 2\001
-6
6 2160 5310 6750 7650
2 1 0 2 0 7 50 0 -1 0.000 0 0 -1 0 0 4
	 2205 7605 2205 5355 6705 5355 6705 7605
2 1 0 2 0 7 50 0 -1 0.000 0 0 -1 0 0 2
	 4500 5355 4500 7605
-6
-6
6 1935 8595 6975 10980
6 4230 10890 4815 10980
2 1 0 1 0 7 50 0 -1 0.000 0 0 -1 0 0 2
	 4230 10890 4815 10890
2 1 0 1 0 7 50 0 -1 0.000 0 0 -1 0 0 2
	 4365 10890 4275 10980
2 1 0 1 0 7 50 0 -1 0.000 0 0 -1 0 0 2
	 4500 10890 4410 10980
2 1 0 1 0 7 50 0 -1 0.000 0 0 -1 0 0 2
	 4635 10890 4545 10980
2 1 0 1 0 7 50 0 -1 0.000 0 0 -1 0 0 2
	 4770 10890 4680 10980
-6
6 6390 10890 6975 10980
2 1 0 1 0 7 50 0 -1 0.000 0 0 -1 0 0 2
	 6390 10890 6975 10890
2 1 0 1 0 7 50 0 -1 0.000 0 0 -1 0 0 2
	 6525 10890 6435 10980
2 1 0 1 0 7 50 0 -1 0.000 0 0 -1 0 0 2
	 6660 10890 6570 10980
2 1 0 1 0 7 50 0 -1 0.000 0 0 -1 0 0 2
	 6795 10890 6705 10980
2 1 0 1 0 7 50 0 -1 0.000 0 0 -1 0 0 2
	 6930 10890 6840 10980
-6
6 1935 10890 2520 10980
2 1 0 1 0 7 50 0 -1 0.000 0 0 -1 0 0 2
	 1935 10890 2520 10890
2 1 0 1 0 7 50 0 -1 0.000 0 0 -1 0 0 2
	 2070 10890 1980 10980
2 1 0 1 0 7 50 0 -1 0.000 0 0 -1 0 0 2
	 2205 10890 2115 10980
2 1 0 1 0 7 50 0 -1 0.000 0 0 -1 0 0 2
	 2340 10890 2250 10980
2 1 0 1 0 7 50 0 -1 0.000 0 0 -1 0 0 2
	 2475 10890 2385 10980
-6
6 4500 8640 5265 9405
5 1 0 2 0 7 50 0 -1 0.000 0 1 1 0 4744.359 8925.174 4725 9315 5040 9180 5130 8865
	1 1 2.00 120.00 240.00
2 1 0 2 0 7 50 0 -1 0.000 0 0 -1 1 0 2
	1 1 2.00 120.00 240.00
	 4590 9360 4590 8865
2 1 0 2 0 7 50 0 -1 0.000 0 0 -1 1 0 2
	1 1 2.00 120.00 240.00
	 4725 8730 5220 8730
-6
6 5040 9180 5445 9540
4 0 0 50 0 0 24 0.0000 4 255 270 5040 9450 X\001
4 0 0 50 0 0 18 0.0000 4 195 135 5310 9540 6\001
-6
6 4635 8775 5040 9135
4 0 0 50 0 0 24 0.0000 4 255 270 4635 9045 X\001
4 0 0 50 0 0 18 0.0000 4 195 135 4905 9135 5\001
-6
6 5220 8685 5490 8955
4 0 0 50 0 0 24 0.0000 4 255 270 5220 8955 X\001
-6
6 3690 8685 4455 9450
5 1 0 2 0 7 50 0 -1 0.000 0 1 1 0 3934.360 8970.174 3915 9360 4230 9225 4320 8910
	1 1 2.00 120.00 240.00
2 1 0 2 0 7 50 0 -1 0.000 0 0 -1 1 0 2
	1 1 2.00 120.00 240.00
	 3780 9405 3780 8910
2 1 0 2 0 7 50 0 -1 0.000 0 0 -1 1 0 2
	1 1 2.00 120.00 240.00
	 3915 8775 4410 8775
-6
6 3285 9000 3690 9360
4 0 0 50 0 0 24 0.0000 4 255 270 3285 9270 X\001
4 0 0 50 0 0 18 0.0000 4 195 135 3555 9360 2\001
-6
6 4050 9360 4455 9720
4 0 0 50 0 0 24 0.0000 4 255 270 4050 9630 X\001
4 0 0 50 0 0 18 0.0000 4 195 135 4320 9720 3\001
-6
6 3825 8820 4275 9225
4 0 0 50 0 0 24 0.0000 4 255 270 3825 9090 X\001
4 0 0 50 0 0 18 0.0000 4 195 135 4140 9225 1\001
-6
2 1 0 2 0 7 50 0 -1 0.000 0 0 -1 0 0 3
	 2205 10890 2205 8640 4185 8640
2 1 0 2 0 7 50 0 -1 0.000 0 0 -1 0 0 3
	 6705 10890 6705 8640 4860 8640
2 1 0 2 0 7 50 0 -1 0.000 0 0 -1 0 0 2
	 4500 8640 4500 10890
4 0 0 50 0 0 18 0.0000 4 195 135 5490 9090 4\001
-6
6 -3105 6930 1980 9315
6 -3105 9225 -2520 9315
2 1 0 1 0 7 50 0 -1 0.000 0 0 -1 0 0 2
	 -3105 9225 -2520 9225
2 1 0 1 0 7 50 0 -1 0.000 0 0 -1 0 0 2
	 -2970 9225 -3060 9315
2 1 0 1 0 7 50 0 -1 0.000 0 0 -1 0 0 2
	 -2835 9225 -2925 9315
2 1 0 1 0 7 50 0 -1 0.000 0 0 -1 0 0 2
	 -2700 9225 -2790 9315
2 1 0 1 0 7 50 0 -1 0.000 0 0 -1 0 0 2
	 -2565 9225 -2655 9315
-6
6 -855 9225 -270 9315
2 1 0 1 0 7 50 0 -1 0.000 0 0 -1 0 0 2
	 -855 9225 -270 9225
2 1 0 1 0 7 50 0 -1 0.000 0 0 -1 0 0 2
	 -720 9225 -810 9315
2 1 0 1 0 7 50 0 -1 0.000 0 0 -1 0 0 2
	 -585 9225 -675 9315
2 1 0 1 0 7 50 0 -1 0.000 0 0 -1 0 0 2
	 -450 9225 -540 9315
2 1 0 1 0 7 50 0 -1 0.000 0 0 -1 0 0 2
	 -315 9225 -405 9315
-6
6 1395 9225 1980 9315
2 1 0 1 0 7 50 0 -1 0.000 0 0 -1 0 0 2
	 1395 9225 1980 9225
2 1 0 1 0 7 50 0 -1 0.000 0 0 -1 0 0 2
	 1530 9225 1440 9315
2 1 0 1 0 7 50 0 -1 0.000 0 0 -1 0 0 2
	 1665 9225 1575 9315
2 1 0 1 0 7 50 0 -1 0.000 0 0 -1 0 0 2
	 1800 9225 1710 9315
2 1 0 1 0 7 50 0 -1 0.000 0 0 -1 0 0 2
	 1935 9225 1845 9315
-6
2 1 0 2 0 7 50 0 -1 0.000 0 0 -1 0 0 4
	 -2835 9225 -2835 6975 1665 6975 1665 9225
2 1 0 2 0 7 50 0 -1 0.000 0 0 -1 0 0 2
	 -585 6975 -585 9225
-6
6 7920 5310 12510 7650
2 1 0 2 0 7 50 0 -1 0.000 0 0 -1 0 0 4
	 7965 7605 7965 5355 12465 5355 12465 7605
2 1 0 2 0 7 50 0 -1 0.000 0 0 -1 0 0 2
	 10260 5355 10260 7605
-6
6 13545 5265 18135 7605
2 1 0 2 0 7 50 0 -1 0.000 0 0 -1 0 0 4
	 13590 7560 13590 5310 18090 5310 18090 7560
2 1 0 2 0 7 50 0 -1 0.000 0 0 -1 0 0 2
	 15885 5310 15885 7560
-6
2 1 0 1 0 7 50 0 -1 0.000 0 0 -1 0 0 2
	 12465 7605 11880 5355
2 1 0 1 0 7 50 0 -1 0.000 0 0 -1 0 0 2
	 8010 5805 12465 5805
2 1 0 1 0 7 50 0 -1 0.000 0 0 -1 0 0 2
	 7965 7605 8505 5355
2 1 0 1 0 7 50 0 -1 0.000 0 0 -1 0 0 2
	 13590 6435 18090 5310
2 1 0 1 0 7 50 0 -1 0.000 0 0 -1 0 0 2
	 14850 5310 13590 7515
2 1 0 2 0 7 50 0 -1 0.000 0 0 -1 0 0 3
	 13590 10890 13590 8640 15570 8640
2 1 0 2 0 7 50 0 -1 0.000 0 0 -1 0 0 2
	 15885 8640 15885 10890
2 1 0 2 0 7 50 0 -1 0.000 0 0 -1 0 0 3
	 18090 10890 18090 8640 16245 8640
2 1 0 1 0 7 50 0 -1 0.000 0 0 -1 0 0 2
	 16245 8640 18090 9135
2 1 0 1 0 7 50 0 -1 0.000 0 0 -1 0 0 3
	 17595 8640 17595 10890 18090 10890
2 1 0 2 0 7 50 0 -1 0.000 0 0 -1 0 0 3
	 7920 10890 7920 8640 9900 8640
2 1 0 2 0 7 50 0 -1 0.000 0 0 -1 0 0 3
	 12420 10890 12420 8640 10575 8640
2 1 0 2 0 7 50 0 -1 0.000 0 0 -1 0 0 2
	 10215 8640 10215 10890
2 1 0 1 0 7 50 0 -1 0.000 0 0 -1 0 0 3
	 10215 8640 10665 10845 10215 10845
2 1 0 1 0 7 50 0 -1 0.000 0 0 -1 0 0 3
	 12375 8640 11925 10845 12375 10845
4 0 0 50 0 1 32 0.0000 4 345 825 9990 5130 M  :\001
4 0 0 50 0 1 32 0.0000 4 345 825 15615 5085 M  :\001
4 0 0 50 0 1 32 0.0000 4 345 825 15615 8370 M  :\001
4 0 0 50 0 1 32 0.0000 4 345 825 9945 8370 M  :\001
4 0 0 50 0 0 24 0.0000 4 255 180 10395 5220 4\001
4 0 0 50 0 0 24 0.0000 4 255 180 16020 5175 5\001
4 0 0 50 0 0 24 0.0000 4 255 180 10305 8460 4\001
4 0 0 50 0 0 24 0.0000 4 255 180 15975 8460 5\001
