#FIG 3.2
Landscape
Center
Metric
A4      
100.00
Single
-2
1200 2
6 2700 1710 4995 2115
4 0 0 50 0 0 18 0.0000 4 195 630 3420 2025 upper\001
4 0 0 50 0 0 24 0.0000 4 225 1455 2880 1935 t= t      - t\001
4 0 0 50 0 0 18 0.0000 4 195 615 4365 2025 lower\001
4 0 0 50 0 32 18 0.0000 4 195 165 2700 1935 D\001
-6
6 2160 3960 6840 5400
2 1 0 2 0 7 50 0 -1 0.000 0 0 -1 0 0 2
	 2205 4005 4455 4005
2 1 0 2 0 7 50 0 -1 0.000 0 0 -1 0 0 2
	 4545 4005 6795 4005
2 1 0 1 0 7 50 0 -1 0.000 0 0 -1 1 0 2
	1 1 1.00 60.00 120.00
	 2205 4005 2205 4500
2 1 0 1 0 7 50 0 -1 0.000 0 0 -1 1 0 2
	1 1 1.00 60.00 120.00
	 4500 4005 4500 4635
2 1 0 1 0 7 50 0 -1 0.000 0 0 -1 1 0 2
	1 1 1.00 60.00 120.00
	 6795 4005 6795 4275
2 1 0 1 0 7 50 0 -1 0.000 0 0 -1 0 0 2
	 2205 4635 2205 5355
2 1 0 1 0 7 50 0 -1 0.000 0 0 -1 0 0 2
	 4500 4725 4500 5400
2 1 0 1 0 7 50 0 -1 0.000 0 0 -1 0 0 2
	 6795 4365 6795 5400
2 1 0 1 0 7 50 0 -1 0.000 0 0 -1 1 1 2
	1 1 1.00 60.00 120.00
	1 1 1.00 60.00 120.00
	 2205 5265 4500 5265
2 1 0 1 0 7 50 0 -1 0.000 0 0 -1 1 1 2
	1 1 1.00 60.00 120.00
	1 1 1.00 60.00 120.00
	 4500 5265 6795 5265
2 1 1 2 0 7 50 0 -1 6.000 0 0 -1 0 0 3
	 2205 4455 4500 4590 6795 4230
4 0 0 50 0 1 24 0.0000 4 165 135 2295 4275 s\001
4 0 0 50 0 0 18 0.0000 4 195 165 2385 4365 L\001
4 0 0 50 0 1 24 0.0000 4 165 135 4545 4320 s\001
4 0 0 50 0 0 18 0.0000 4 195 180 4635 4455 C\001
4 0 0 50 0 1 24 0.0000 4 165 135 6345 4590 s\001
4 0 0 50 0 0 18 0.0000 4 195 180 6435 4725 R\001
4 0 0 50 0 1 24 0.0000 4 255 90 5625 5175 l\001
4 0 0 50 0 1 24 0.0000 4 255 90 3285 5175 l\001
4 0 0 50 0 0 18 0.0000 4 195 165 3375 5265 L\001
4 0 0 50 0 0 18 0.0000 4 195 165 5715 5265 L\001
-6
2 1 0 2 0 7 50 0 -1 0.000 0 0 -1 0 0 2
	 2250 2250 4500 2250
2 1 0 1 0 7 50 0 -1 0.000 0 0 -1 0 0 2
	 2250 2340 4455 2340
2 1 0 1 0 7 50 0 -1 0.000 0 0 -1 0 1 2
	1 1 1.00 60.00 120.00
	 2610 2160 2610 1800
2 1 0 1 0 7 50 0 -1 0.000 0 0 -1 0 1 2
	1 1 1.00 60.00 120.00
	 2610 2340 2610 2745
2 1 0 1 0 7 50 0 -1 0.000 0 0 -1 0 0 2
	 2250 2160 4455 2160
2 1 0 1 0 7 50 0 -1 0.000 0 0 -1 0 0 2
	 2250 2520 2250 3195
2 1 0 1 0 7 50 0 -1 0.000 0 0 -1 0 0 2
	 4455 2520 4455 3195
2 1 0 1 0 7 50 0 -1 0.000 0 0 -1 1 1 2
	1 1 1.00 60.00 120.00
	1 1 1.00 60.00 120.00
	 2250 3060 4455 3060
2 1 0 1 0 7 50 0 -1 0.000 0 0 -1 0 1 2
	1 1 1.00 60.00 120.00
	 2430 2160 2430 1800
2 1 0 1 0 7 50 0 -1 0.000 0 0 -1 0 1 2
	1 1 1.00 60.00 120.00
	 2430 2340 2430 2745
4 0 0 50 0 1 24 0.0000 4 255 90 3285 3015 l\001
4 0 0 50 0 0 24 1.5708 4 255 195 2340 2070 h\001
