#FIG 3.2
Landscape
Center
Metric
A4      
100.00
Single
-2
1200 2
6 1755 4860 4590 5535
2 1 0 2 0 7 50 0 -1 0.000 0 0 -1 0 0 2
	 2250 5490 1800 5400
2 1 0 2 0 7 50 0 -1 0.000 0 0 -1 0 0 3
	 2250 4905 2250 5490 4545 4905
-6
6 4185 4500 4725 4770
4 0 0 50 0 0 24 0.0000 4 255 330 4365 4770 M\001
4 0 0 50 0 32 24 0.0000 4 270 180 4185 4770 d\001
-6
6 4185 5760 4725 6030
4 0 0 50 0 0 24 0.0000 4 255 330 4365 6030 M\001
4 0 0 50 0 32 24 0.0000 4 270 180 4185 6030 d\001
-6
6 4455 7380 7290 8055
2 1 0 2 0 7 50 0 -1 0.000 0 0 -1 0 0 2
	 6795 8010 7245 7920
2 1 0 2 0 7 50 0 -1 0.000 0 0 -1 0 0 3
	 6795 7425 6795 8010 4500 7425
-6
6 1755 135 7290 2880
6 2115 855 2385 1080
2 3 0 1 0 7 50 0 -1 0.000 0 0 -1 0 0 4
	 2115 1035 2250 855 2385 1035 2115 1035
2 1 0 1 0 7 50 0 -1 0.000 0 0 -1 0 0 2
	 2115 1080 2385 1080
-6
6 4365 2655 4635 2880
2 3 0 1 0 7 50 0 -1 0.000 0 0 -1 0 0 4
	 4365 2835 4500 2655 4635 2835 4365 2835
2 1 0 1 0 7 50 0 -1 0.000 0 0 -1 0 0 2
	 4365 2880 4635 2880
-6
6 2115 2655 2385 2880
2 3 0 1 0 7 50 0 -1 0.000 0 0 -1 0 0 4
	 2115 2835 2250 2655 2385 2835 2115 2835
2 1 0 1 0 7 50 0 -1 0.000 0 0 -1 0 0 2
	 2115 2880 2385 2880
-6
6 6615 2655 6885 2880
2 3 0 1 0 7 50 0 -1 0.000 0 0 -1 0 0 4
	 6615 2835 6750 2655 6885 2835 6615 2835
2 1 0 1 0 7 50 0 -1 0.000 0 0 -1 0 0 2
	 6615 2880 6885 2880
-6
6 1890 2115 2610 2520
5 1 0 1 0 7 50 0 -1 0.000 0 1 1 0 1895.192 2473.269 2205 2520 2115 2250 1890 2160
	1 1 1.00 60.00 120.00
5 1 0 1 0 7 50 0 -1 0.000 0 0 1 0 2604.808 2473.269 2295 2520 2385 2250 2610 2160
	1 1 1.00 60.00 120.00
-6
6 4140 2115 4860 2520
5 1 0 1 0 7 50 0 -1 0.000 0 1 1 0 4145.192 2473.269 4455 2520 4365 2250 4140 2160
	1 1 1.00 60.00 120.00
5 1 0 1 0 7 50 0 -1 0.000 0 0 1 0 4854.808 2473.269 4545 2520 4635 2250 4860 2160
	1 1 1.00 60.00 120.00
-6
6 6390 2115 7110 2520
5 1 0 1 0 7 50 0 -1 0.000 0 1 1 0 6395.192 2473.269 6705 2520 6615 2250 6390 2160
	1 1 1.00 60.00 120.00
5 1 0 1 0 7 50 0 -1 0.000 0 0 1 0 7104.808 2473.269 6795 2520 6885 2250 7110 2160
	1 1 1.00 60.00 120.00
-6
2 1 0 2 0 7 50 0 -1 0.000 0 0 -1 0 0 2
	 1800 855 7200 855
2 3 0 1 0 7 50 0 -1 0.000 0 0 -1 0 0 4
	 4365 1035 4500 855 4635 1035 4365 1035
2 3 0 1 0 7 50 0 -1 0.000 0 0 -1 0 0 4
	 6615 1035 6750 855 6885 1035 6615 1035
2 1 0 1 0 7 50 0 -1 0.000 0 0 -1 0 0 2
	 4365 1080 4635 1080
2 1 0 1 0 7 50 0 -1 0.000 0 0 -1 0 0 2
	 6615 1080 6885 1080
2 1 0 1 0 7 50 0 -1 0.000 0 0 -1 0 0 2
	 2250 1125 2250 1935
2 1 0 1 0 7 50 0 -1 0.000 0 0 -1 0 0 2
	 4500 1125 4500 1665
2 1 0 1 0 7 50 0 -1 0.000 0 0 -1 0 0 2
	 6750 1125 6750 1935
2 1 0 1 0 7 50 0 -1 0.000 0 0 -1 1 1 2
	1 1 1.00 60.00 120.00
	1 1 1.00 60.00 120.00
	 2250 1485 4500 1485
2 1 0 1 0 7 50 0 -1 0.000 0 0 -1 1 1 2
	1 1 1.00 60.00 120.00
	1 1 1.00 60.00 120.00
	 4500 1485 6750 1485
2 1 0 2 0 7 50 0 -1 0.000 0 0 -1 0 0 2
	 1800 2655 2160 2655
2 1 0 2 0 7 50 0 -1 0.000 0 0 -1 0 0 2
	 2340 2655 4410 2655
2 1 0 2 0 7 50 0 -1 0.000 0 0 -1 0 0 2
	 4590 2655 6660 2655
2 1 0 2 0 7 50 0 -1 0.000 0 0 -1 0 0 2
	 6885 2655 7245 2655
2 1 0 1 0 7 50 0 -1 0.000 0 0 -1 0 0 2
	 4500 540 4500 855
2 1 0 1 0 7 50 0 -1 0.000 0 0 -1 0 0 2
	 4860 585 4860 855
2 1 0 1 0 7 50 0 -1 0.000 0 0 -1 0 0 2
	 5220 585 5220 855
2 1 0 1 0 7 50 0 -1 0.000 0 0 -1 0 0 2
	 5580 585 5580 855
2 1 0 1 0 7 50 0 -1 0.000 0 0 -1 0 0 2
	 5940 540 5940 855
2 1 0 1 0 7 50 0 -1 0.000 0 0 -1 0 0 2
	 6255 495 6255 855
2 1 0 1 0 7 50 0 -1 0.000 0 0 -1 0 0 2
	 6525 450 6525 855
2 1 0 1 0 7 50 0 -1 0.000 0 0 -1 0 0 2
	 6795 450 6795 855
2 1 0 1 0 7 50 0 -1 0.000 0 0 -1 0 0 2
	 7110 495 7110 855
2 1 0 2 0 7 50 0 -1 0.000 0 0 -1 1 0 2
	1 1 2.00 120.00 240.00
	 2970 180 2970 810
2 1 0 1 0 7 50 0 -1 0.000 0 0 -1 1 0 2
	1 1 1.00 60.00 120.00
	 2250 1800 3015 1800
2 1 0 1 0 7 50 0 -1 0.000 0 0 -1 1 0 2
	1 1 1.00 60.00 120.00
	 6750 1845 5895 1845
3 0 0 1 0 7 50 0 -1 0.000 0 0 0 4
	 4500 540 5535 630 6750 405 7200 495
	 0.000 1.000 1.000 0.000
4 0 0 50 0 0 24 0.0000 4 255 270 4230 2160 X\001
4 0 0 50 0 0 24 0.0000 4 255 270 6480 2160 X\001
4 0 0 50 0 0 24 0.0000 4 255 270 1980 2160 X\001
4 0 0 50 0 0 18 0.0000 4 195 165 2250 2250 L\001
4 0 0 50 0 0 18 0.0000 4 195 180 4500 2250 C\001
4 0 0 50 0 0 18 0.0000 4 195 180 6750 2250 R\001
4 0 0 50 0 0 24 0.0000 4 255 210 2520 1260 L\001
4 0 0 50 0 0 24 0.0000 4 255 240 4770 1260 C\001
4 0 0 50 0 0 24 0.0000 4 255 240 6975 1215 R\001
4 0 0 50 0 0 24 0.0000 4 255 90 3240 1395 l\001
4 0 0 50 0 0 24 0.0000 4 255 90 5760 1395 l\001
4 0 0 50 0 0 18 0.0000 4 195 165 3375 1485 L\001
4 0 0 50 0 0 18 0.0000 4 195 180 5895 1485 R\001
4 0 0 50 0 0 24 0.0000 4 180 195 3105 1935 x\001
4 0 0 50 0 0 24 0.0000 4 180 195 5670 1980 x\001
4 0 0 50 0 0 18 0.0000 4 195 165 3330 2070 L\001
4 0 0 50 0 0 18 0.0000 4 195 180 5895 2115 R\001
-6
2 1 0 1 0 7 50 0 -1 0.000 0 0 -1 0 0 2
	 1800 4905 7200 4905
2 1 0 1 0 7 50 0 -1 0.000 0 0 -1 0 0 2
	 1800 6165 7200 6165
2 1 0 2 0 7 50 0 -1 0.000 0 0 -1 0 0 3
	 2250 6165 4500 6750 6750 6165
2 1 0 2 0 7 50 0 -1 0.000 0 0 -1 0 0 2
	 4500 6165 4500 6750
2 1 0 1 0 7 50 0 -1 0.000 0 0 -1 0 0 2
	 1800 7425 7200 7425
2 1 0 1 0 7 50 0 -1 0.000 0 0 -1 0 0 2
	 1800 8595 7200 8595
2 1 0 2 0 7 50 0 -1 0.000 0 0 -1 0 0 3
	 2250 8190 2970 9090 4500 8190
2 1 0 2 0 7 50 0 -1 0.000 0 0 -1 0 0 2
	 2250 8190 1845 8640
2 1 0 1 0 7 50 0 -1 0.000 0 0 -1 0 0 2
	 1800 3600 7200 3600
2 1 0 2 0 7 50 0 -1 0.000 0 0 -1 0 0 3
	 2250 3600 2970 4005 4500 3600
3 0 0 2 0 7 50 0 -1 0.000 0 0 0 5
	 4500 8190 4815 8730 5355 9000 6030 8955 6795 8100
	 0.000 1.000 1.000 1.000 0.000
3 0 0 2 0 7 50 0 -1 0.000 0 0 0 3
	 6795 8145 6930 8415 7200 8685
	 0.000 1.000 0.000
3 0 0 2 0 7 50 0 -1 0.000 0 0 0 3
	 4500 3600 5985 4050 6750 3600
	 0.000 1.000 0.000
3 0 0 2 0 7 50 0 -1 0.000 0 0 0 2
	 2250 3600 1845 3600
	 0.000 0.000
3 0 0 2 0 7 50 0 -1 0.000 0 0 0 2
	 6750 3600 7200 3780
	 0.000 0.000
4 0 0 50 0 0 18 0.0000 4 195 165 4680 4860 L\001
4 0 0 50 0 0 18 0.0000 4 195 180 4680 6120 C\001
4 0 0 50 0 0 18 0.0000 4 195 180 4680 7380 R\001
4 0 0 50 0 0 24 0.0000 4 255 330 4365 7290 M\001
4 0 0 50 0 32 24 0.0000 4 270 180 4185 7290 d\001
4 0 0 50 0 32 18 0.0000 4 195 135 2475 5670 1\001
4 0 0 50 0 32 18 0.0000 4 195 135 4815 6930 1\001
4 0 0 50 0 32 18 0.0000 4 195 135 6390 8145 1\001
4 0 0 50 0 0 24 0.0000 4 255 330 4275 3420 M\001
4 0 0 50 0 0 18 0.0000 4 135 135 4590 3510 o\001
4 0 0 50 0 0 24 0.0000 4 255 1065 4365 8100 final M\001
