#FIG 3.2
Landscape
Center
Metric
A4      
100.00
Single
-2
1200 2
5 1 0 3 0 7 50 0 -1 0.000 0 0 0 0 16740.227 8235.228 14490 8235 16740 5985 18990 8190
5 1 0 1 0 7 50 0 -1 0.000 0 1 1 0 7360.714 2071.072 8595 2250 8505 1575 8055 1035
	1 1 1.00 60.00 120.00
5 1 0 3 0 7 50 0 -1 0.000 0 0 0 0 6750.227 2205.227 4500 2205 6750 -45 9000 2160
5 1 0 3 0 7 50 0 -1 0.000 0 0 0 0 16695.227 2205.227 14445 2205 16695 -45 18945 2160
5 1 0 3 0 7 50 0 -1 0.000 0 0 0 0 6885.227 8280.228 4635 8280 6885 6030 9135 8235
6 4725 -315 4950 -90
2 1 0 1 0 7 50 0 -1 0.000 0 0 -1 0 0 2
	 4725 -315 4725 -90
2 1 0 1 0 7 50 0 -1 0.000 0 0 -1 0 0 2
	 4950 -315 4950 -90
-6
6 5175 -315 5400 -90
2 1 0 1 0 7 50 0 -1 0.000 0 0 -1 0 0 2
	 5175 -315 5175 -90
2 1 0 1 0 7 50 0 -1 0.000 0 0 -1 0 0 2
	 5400 -315 5400 -90
-6
6 5625 -315 5850 -90
2 1 0 1 0 7 50 0 -1 0.000 0 0 -1 0 0 2
	 5625 -315 5625 -90
2 1 0 1 0 7 50 0 -1 0.000 0 0 -1 0 0 2
	 5850 -315 5850 -90
-6
6 6075 -315 6300 -90
2 1 0 1 0 7 50 0 -1 0.000 0 0 -1 0 0 2
	 6075 -315 6075 -90
2 1 0 1 0 7 50 0 -1 0.000 0 0 -1 0 0 2
	 6300 -315 6300 -90
-6
6 6525 -315 6750 -90
2 1 0 1 0 7 50 0 -1 0.000 0 0 -1 0 0 2
	 6525 -315 6525 -90
2 1 0 1 0 7 50 0 -1 0.000 0 0 -1 0 0 2
	 6750 -315 6750 -90
-6
6 6975 -315 7200 -90
2 1 0 1 0 7 50 0 -1 0.000 0 0 -1 0 0 2
	 6975 -315 6975 -90
2 1 0 1 0 7 50 0 -1 0.000 0 0 -1 0 0 2
	 7200 -315 7200 -90
-6
6 7425 -315 7650 -90
2 1 0 1 0 7 50 0 -1 0.000 0 0 -1 0 0 2
	 7425 -315 7425 -90
2 1 0 1 0 7 50 0 -1 0.000 0 0 -1 0 0 2
	 7650 -315 7650 -90
-6
6 8325 -315 8550 -90
2 1 0 1 0 7 50 0 -1 0.000 0 0 -1 0 0 2
	 8325 -315 8325 -90
2 1 0 1 0 7 50 0 -1 0.000 0 0 -1 0 0 2
	 8550 -315 8550 -90
-6
6 8775 -315 9000 -90
2 1 0 1 0 7 50 0 -1 0.000 0 0 -1 0 0 2
	 8775 -315 8775 -90
2 1 0 1 0 7 50 0 -1 0.000 0 0 -1 0 0 2
	 9000 -315 9000 -90
-6
6 7875 -315 8100 -90
2 1 0 1 0 7 50 0 -1 0.000 0 0 -1 0 0 2
	 7875 -315 7875 -90
2 1 0 1 0 7 50 0 -1 0.000 0 0 -1 0 0 2
	 8100 -315 8100 -90
-6
1 4 0 1 0 7 50 0 -1 0.000 1 0.0000 14490 8280 68 68 14423 8280 14558 8280
1 4 0 1 0 7 50 0 -1 0.000 1 0.0000 4500 2250 68 68 4433 2250 4568 2250
1 4 0 1 0 7 50 0 -1 0.000 1 0.0000 14445 2250 68 68 14378 2250 14513 2250
1 4 0 1 0 7 50 0 -1 0.000 1 0.0000 4635 8325 68 68 4568 8325 4703 8325
2 3 0 1 0 7 50 0 -1 0.000 0 0 -1 0 0 4
	 2070 4770 2250 4500 2430 4770 2070 4770
2 3 0 1 0 7 50 0 -1 0.000 0 0 -1 0 0 4
	 4320 4770 4500 4500 4680 4770 4320 4770
2 2 0 1 0 7 50 0 -1 0.000 0 0 -1 0 0 5
	 4500 -90 9045 -90 9045 -315 4500 -315 4500 -90
2 1 0 1 0 7 50 0 -1 0.000 0 0 -1 0 0 2
	 2250 4860 2250 5400
2 1 0 1 0 7 50 0 -1 0.000 0 0 -1 0 0 2
	 4500 4860 4500 5400
2 1 0 1 0 7 50 0 -1 0.000 0 0 -1 0 0 2
	 9000 2655 9000 5310
2 1 0 1 0 7 50 0 -1 0.000 0 0 -1 1 1 2
	1 1 1.00 60.00 120.00
	1 1 1.00 60.00 120.00
	 2295 5310 4500 5310
2 1 0 1 0 7 50 0 -1 0.000 0 0 -1 1 1 2
	1 1 1.00 60.00 120.00
	1 1 1.00 60.00 120.00
	 4500 5310 9000 5310
2 1 0 1 0 7 50 0 -1 0.000 0 0 -1 0 0 2
	 9135 -45 10080 -45
2 1 0 1 0 7 50 0 -1 0.000 0 0 -1 0 0 2
	 9225 2160 10125 2160
2 1 0 1 0 7 50 0 -1 0.000 0 0 -1 0 0 2
	 9180 4500 10170 4500
2 1 0 1 0 7 50 0 -1 0.000 0 0 -1 1 1 2
	1 1 1.00 60.00 120.00
	1 1 1.00 60.00 120.00
	 9945 0 9945 2160
2 1 0 1 0 7 50 0 -1 0.000 0 0 -1 1 1 2
	1 1 1.00 60.00 120.00
	1 1 1.00 60.00 120.00
	 9945 2160 9945 4500
2 3 0 1 0 7 50 0 -1 0.000 0 0 -1 0 0 4
	 12015 4725 12195 4455 12375 4725 12015 4725
2 3 0 1 0 7 50 0 -1 0.000 0 0 -1 0 0 4
	 14265 4725 14445 4455 14625 4725 14265 4725
2 1 0 1 0 7 50 0 -1 0.000 0 0 -1 0 0 2
	 18765 2475 19170 2475
2 1 0 2 0 7 50 0 -1 0.000 0 0 -1 1 0 2
	1 1 2.00 120.00 240.00
	 17820 2160 18855 2160
2 1 0 3 0 7 50 0 -1 0.000 0 0 -1 0 0 3
	 12240 10530 12240 8280 14445 8280
2 1 0 3 0 7 50 0 -1 0.000 0 0 -1 0 0 2
	 14490 8325 14490 10530
2 3 0 1 0 7 50 0 -1 0.000 0 0 -1 0 0 4
	 18810 8415 18990 8145 19170 8415 18810 8415
2 1 0 1 0 7 50 0 -1 0.000 0 0 -1 0 0 2
	 16695 5985 16695 6570
2 1 0 1 0 7 50 0 -1 0.000 0 0 -1 0 0 3
	 14445 8280 12240 7695 12240 8280
2 1 0 1 0 7 50 0 -1 0.000 0 0 -1 0 0 3
	 12240 10485 11655 8280 12240 8280
2 1 0 1 0 7 50 0 -1 0.000 0 0 -1 0 0 2
	 6750 2250 8640 2250
2 3 0 1 0 7 50 0 -1 0.000 0 0 -1 0 0 4
	 4320 5130 4500 4860 4680 5130 4320 5130
2 1 0 1 0 7 50 0 -1 0.000 0 0 -1 0 0 2
	 4500 4500 5355 4500
2 1 0 1 0 7 50 0 -1 0.000 0 0 -1 0 0 2
	 4500 4860 5355 4860
2 1 0 1 0 7 50 0 -1 0.000 0 0 -1 1 0 2
	1 1 1.00 60.00 120.00
	 5265 4500 5265 4860
2 1 0 3 0 7 50 0 -1 0.000 0 0 -1 0 0 3
	 2250 4500 2250 2250 4455 2250
2 1 0 3 0 7 50 0 -1 0.000 0 0 -1 0 0 2
	 4500 2295 4500 4500
2 3 0 1 0 7 50 0 -1 0.000 0 0 -1 0 0 4
	 8820 2385 9000 2115 9180 2385 8820 2385
2 1 0 1 0 7 50 0 -1 0.000 0 0 -1 1 0 2
	1 1 1.00 60.00 120.00
	 6750 2250 8415 675
2 1 0 3 0 7 50 0 -1 0.000 0 0 -1 0 0 3
	 12195 4500 12195 2250 14400 2250
2 1 0 3 0 7 50 0 -1 0.000 0 0 -1 0 0 2
	 14445 2295 14445 4500
2 3 0 1 0 7 50 0 -1 0.000 0 0 -1 0 0 4
	 18765 2385 18945 2115 19125 2385 18765 2385
2 1 0 1 0 7 50 0 -1 0.000 0 0 -1 1 0 2
	1 1 1.00 60.00 120.00
	 16695 2250 18360 675
2 1 0 3 0 7 50 0 -1 0.000 0 0 -1 0 0 3
	 2385 10575 2385 8325 4590 8325
2 1 0 3 0 7 50 0 -1 0.000 0 0 -1 0 0 2
	 4635 8370 4635 10575
2 3 0 1 0 7 50 0 -1 0.000 0 0 -1 0 0 4
	 8955 8460 9135 8190 9315 8460 8955 8460
2 1 0 1 0 7 50 0 -1 0.000 0 0 -1 0 0 2
	 6885 6030 6885 6705
3 0 0 2 0 7 50 0 -1 0.000 0 0 0 4
	 14490 8235 14985 7380 15885 6660 16785 6570
	 0.000 1.000 1.000 0.000
3 0 0 2 0 7 50 0 -1 0.000 0 0 0 4
	 18987 8220 18492 7365 17592 6645 16740 6570
	 0.000 1.000 1.000 0.000
3 0 0 2 0 7 50 0 -1 0.000 0 0 0 6
	 4635 8280 4680 7920 5130 7065 5805 6660 6525 6705 6885 6705
	 0.000 1.000 1.000 1.000 1.000 0.000
3 0 0 2 0 7 50 0 -1 0.000 0 0 0 6
	 9180 8280 9135 7920 8685 7065 8010 6660 7290 6705 6885 6705
	 0.000 1.000 1.000 1.000 1.000 0.000
4 0 0 50 0 0 24 0.0000 4 255 180 3240 5220 5\001
4 0 0 50 0 0 24 0.0000 4 255 360 6885 5220 10\001
4 0 0 50 0 0 24 1.5708 4 255 180 9855 3555 5\001
4 0 0 50 0 0 24 1.5708 4 255 180 9855 1260 5\001
4 0 0 50 0 0 24 0.0000 4 255 1650 11970 1080 PRIMARY\001
4 0 0 50 0 0 24 0.0000 4 255 2250 11970 1500 STRUCTURE:\001
4 0 0 50 0 1 32 0.0000 4 330 285 18090 2025 X\001
4 0 0 50 0 0 24 0.0000 4 255 180 16650 7020 5\001
4 0 0 50 0 0 24 0.0000 4 255 180 11925 8100 5\001
4 0 0 50 0 1 32 0.0000 4 330 660 12825 7200 M :\001
4 0 0 50 0 32 32 0.0000 4 435 270 8100 1890 f\001
4 0 0 50 0 1 32 1.5708 4 330 1305 5220 4770 s=0.01\001
4 0 0 50 0 1 32 0.0000 4 435 690 3735 -90 f=1\001
4 0 0 50 0 1 32 0.7854 4 330 735 7335 1620 r=5\001
4 0 0 50 0 1 32 0.7854 4 330 735 17280 1620 r=5\001
4 0 0 50 0 0 18 0.0000 4 195 135 13185 7290 1\001
4 0 0 50 0 0 18 0.0000 4 135 135 3690 7065 o\001
4 0 0 50 0 0 24 0.0000 4 255 630 6705 7155 12.5\001
4 0 0 50 0 1 32 0.0000 4 330 660 3330 6975 M :\001
