#FIG 3.2
Landscape
Center
Metric
A4      
100.00
Single
-2
1200 2
6 2205 2205 9045 4545
2 1 0 3 0 7 50 0 -1 0.000 0 0 -1 0 0 2
	 2250 2250 9000 2250
2 1 0 3 0 7 50 0 -1 0.000 0 0 -1 0 0 2
	 4500 2250 4500 4500
-6
6 10305 2250 17145 4590
2 1 0 3 0 7 50 0 -1 0.000 0 0 -1 0 0 2
	 10350 2295 17100 2295
2 1 0 3 0 7 50 0 -1 0.000 0 0 -1 0 0 2
	 12600 2295 12600 4545
-6
2 1 0 2 0 7 50 0 -1 6.000 0 0 -1 0 0 3
	 4500 4500 5625 4500 3510 2250
2 1 0 2 0 7 50 0 -1 6.000 0 0 -1 0 0 2
	 2250 2250 4545 2655
2 1 0 2 0 7 50 0 -1 6.000 0 0 -1 0 0 4
	 4500 2250 4500 1620 9000 1620 9000 2250
2 1 0 1 0 7 50 0 -1 0.000 0 0 -1 0 0 4
	 10350 2295 10350 2115 12600 2115 12600 2295
2 1 0 1 0 7 50 0 -1 0.000 0 0 -1 0 0 3
	 12600 4545 13995 4545 13995 2295
4 0 0 50 0 32 24 0.0000 4 255 360 5760 4500 59\001
4 0 0 50 0 32 24 0.0000 4 255 360 4635 2835 17\001
4 0 0 50 0 32 24 0.0000 4 255 360 3375 2205 45\001
4 0 0 50 0 32 24 0.0000 4 255 360 4140 1845 28\001
4 0 0 50 0 32 32 0.0000 4 330 540 3015 1530 M:\001
4 0 0 50 0 0 32 0.0000 4 330 450 10350 1710 V:\001
4 0 0 50 0 0 24 0.0000 4 255 450 12240 2070 3.4\001
4 0 0 50 0 0 24 0.0000 4 255 840 14085 4635 -20.8\001
