#FIG 3.2
Landscape
Center
Metric
A4      
100.00
Single
-2
1200 2
2 1 0 2 0 7 50 0 -1 0.000 0 0 -1 0 0 2
	 1800 1800 7200 1800
2 1 0 2 0 7 50 0 -1 0.000 0 0 -1 0 0 2
	 3600 1800 3600 3600
2 1 0 1 0 7 50 0 -1 0.000 0 0 -1 0 0 3
	 1800 1800 1800 1980 3600 2385
2 1 0 1 0 7 50 0 -1 0.000 0 0 -1 0 0 3
	 3690 1800 3690 3600 3600 3600
2 1 0 1 0 7 50 0 -1 0.000 0 0 -1 0 0 3
	 3600 1800 3600 990 7155 1800
2 1 0 2 0 7 50 0 -1 0.000 0 0 -1 0 0 2
	 8100 1800 13500 1800
2 1 0 2 0 7 50 0 -1 0.000 0 0 -1 0 0 2
	 9900 1800 9900 3600
2 1 0 1 0 7 50 0 -1 0.000 0 0 -1 0 0 3
	 9765 1800 9990 3600 9900 3600
2 1 0 1 0 7 50 0 -1 0.000 0 0 -1 0 0 2
	 9900 1080 9900 1800
3 0 0 1 0 7 50 0 -1 0.000 0 0 0 3
	 8100 1800 8775 1710 9900 1170
	 0.000 1.000 0.000
3 0 0 1 0 7 50 0 -1 0.000 0 0 0 4
	 9855 1080 11475 1935 12735 2385 13365 2385
	 0.000 1.000 1.000 0.000
4 0 0 50 0 0 24 0.0000 4 255 840 1665 2385 -2.66\001
4 0 0 50 0 0 24 0.0000 4 255 840 3780 2565 -7.66\001
4 0 0 50 0 0 24 0.0000 4 255 840 3780 3735 -1.06\001
4 0 0 50 0 0 24 0.0000 4 255 360 3150 1260 10\001
4 0 0 50 0 0 32 0.0000 4 330 450 1800 1395 V:\001
4 0 0 50 0 0 32 0.0000 4 330 540 8145 1305 M:\001
4 0 0 50 0 0 24 0.0000 4 255 630 8955 1305 25.8\001
4 0 0 50 0 0 24 0.0000 4 255 630 10170 1215 29.5\001
4 0 0 50 0 0 24 0.0000 4 255 630 12600 2745 20.5\001
4 0 0 50 0 0 24 0.0000 4 255 630 9225 2115 3.78\001
4 0 0 50 0 0 24 0.0000 4 255 630 10080 3645 1.89\001
