#FIG 3.2
Landscape
Center
Metric
A4      
100.00
Single
-2
1200 2
6 2790 1800 3510 2430
2 3 0 1 0 7 50 0 -1 4.000 0 0 -1 0 0 4
	 2790 2295 3150 1800 3510 2295 2790 2295
2 1 0 1 0 7 50 0 -1 4.000 0 0 -1 0 0 2
	 2790 2430 3510 2430
-6
6 1890 1800 2610 2430
2 3 0 1 0 7 50 0 -1 4.000 0 0 -1 0 0 4
	 1890 2295 2250 1800 2610 2295 1890 2295
2 1 0 1 0 7 50 0 -1 4.000 0 0 -1 0 0 2
	 1890 2430 2610 2430
-6
2 1 0 3 0 7 50 0 -1 8.000 0 0 -1 0 0 2
	 900 1800 2295 1800
2 1 0 3 0 7 50 0 -1 8.000 0 0 -1 0 0 2
	 3150 1800 4500 1800
2 1 3 3 0 7 50 0 -1 8.000 0 0 -1 0 0 2
	 2700 585 2700 3240
2 3 0 1 0 7 50 0 -1 4.000 0 0 -1 0 0 5
	 2340 3285 3060 2880 3060 3285 2340 2880 2340 3285
2 3 0 1 0 7 50 0 -1 4.000 0 0 -1 0 0 5
	 2340 1170 3060 765 3060 1170 2340 765 2340 1170
