<svg width="48" height="48" viewBox="0 0 48 48" fill="none" xmlns="http://www.w3.org/2000/svg">
<path d="M32.5639 43.202C31.1967 43.202 29.8178 42.8993 28.5307 42.2772C23.6996 39.9383 19.3119 36.8153 15.4887 32.993C11.6684 29.1717 8.54442 24.783 6.20552 19.951C4.49162 16.411 5.20262 12.1678 7.97502 9.39441L11.0893 6.28011C11.9506 5.41781 13.142 5.00371 14.352 5.13171C15.5639 5.26351 16.6342 5.92961 17.2905 6.95691L21.0259 12.8133C22.0435 14.408 21.8198 16.4559 20.482 17.7928L18.0631 20.2117C19.3981 22.2293 20.9391 24.116 22.652 25.8299C24.3659 27.5428 26.2526 29.0838 28.2702 30.4188L30.6891 27.9999C32.0065 26.6825 34.0993 26.455 35.6696 27.456L41.526 31.1923C42.5524 31.8476 43.2174 32.9179 43.3502 34.1288C43.483 35.3407 43.065 36.5302 42.2027 37.3925L39.0875 40.5068C37.3229 42.2724 34.9613 43.202 32.5639 43.202ZM13.9145 7.10831C13.3872 7.10831 12.8823 7.31531 12.5034 7.69421L9.38912 10.8085C7.21822 12.9804 6.66252 16.3046 8.00632 19.08C10.2475 23.7109 13.2407 27.9159 16.9028 31.579C20.5669 35.2421 24.7729 38.2362 29.4018 40.4765C32.1811 41.8212 35.5034 41.2636 37.6733 39.0927L40.7885 35.9784C41.2192 35.5477 41.4281 34.953 41.3617 34.3466C41.2953 33.7411 40.9633 33.206 40.4496 32.8778L34.5932 29.1415C33.809 28.6435 32.7612 28.7567 32.103 29.414L28.5483 32.9687L27.8725 32.5429C25.477 31.0331 23.2455 29.2509 21.2377 27.2441C19.2309 25.2363 17.4486 23.0048 15.9389 20.6093L15.5131 19.9335L19.0678 16.3788C19.7367 15.7099 19.8481 14.6864 19.3403 13.8895L15.6049 8.03311C15.2768 7.51851 14.7406 7.18641 14.1352 7.12001C14.061 7.11221 13.9877 7.10831 13.9145 7.10831Z" fill="white"/>
</svg>
