<?xml version="1.0" encoding="UTF-8" standalone="no"?>
<!-- Created with Inkscape (http://www.inkscape.org/) -->

<svg
   xmlns:dc="http://purl.org/dc/elements/1.1/"
   xmlns:cc="http://creativecommons.org/ns#"
   xmlns:rdf="http://www.w3.org/1999/02/22-rdf-syntax-ns#"
   xmlns:svg="http://www.w3.org/2000/svg"
   xmlns="http://www.w3.org/2000/svg"
   xmlns:sodipodi="http://sodipodi.sourceforge.net/DTD/sodipodi-0.dtd"
   xmlns:inkscape="http://www.inkscape.org/namespaces/inkscape"
   width="297mm"
   height="210mm"
   viewBox="0 0 297 210"
   version="1.1"
   id="svg8"
   inkscape:version="0.92.3 (2405546, 2018-03-11)"
   sodipodi:docname="modelhouse.svg"
   inkscape:export-filename="/home/fon/daten/bilder/modell/modelhouse.png"
   inkscape:export-xdpi="181.42857"
   inkscape:export-ydpi="181.42857">
  <defs
     id="defs2" />
  <sodipodi:namedview
     id="base"
     pagecolor="#ffffff"
     bordercolor="#666666"
     borderopacity="1.0"
     inkscape:pageopacity="0.0"
     inkscape:pageshadow="2"
     inkscape:zoom="0.7"
     inkscape:cx="113.41366"
     inkscape:cy="351.40929"
     inkscape:document-units="mm"
     inkscape:current-layer="layer1"
     showgrid="false"
     inkscape:window-width="1916"
     inkscape:window-height="1033"
     inkscape:window-x="0"
     inkscape:window-y="22"
     inkscape:window-maximized="0" />
  <metadata
     id="metadata5">
    <rdf:RDF>
      <cc:Work
         rdf:about="">
        <dc:format>image/svg+xml</dc:format>
        <dc:type
           rdf:resource="http://purl.org/dc/dcmitype/StillImage" />
        <dc:title />
      </cc:Work>
    </rdf:RDF>
  </metadata>
  <g
     inkscape:label="Ebene 1"
     inkscape:groupmode="layer"
     id="layer1"
     transform="translate(0,-87)">
    <rect
       style="fill:#ffaaaa;stroke:#1a1a1a;stroke-width:1.85208333;stroke-miterlimit:4;stroke-dasharray:none"
       id="rect815"
       width="46.869045"
       height="43.845234"
       x="126.24405"
       y="175.29167"
       ry="5.6696429" />
    <rect
       style="fill:#afe9dd;stroke:#1a1a1a;stroke-width:0.88194444;stroke-miterlimit:4;stroke-dasharray:none"
       id="rect817"
       width="42.993977"
       height="101.20231"
       x="23.29319"
       y="148.46529"
       ry="9.0359325" />
    <path
       sodipodi:type="star"
       style="fill:#87aade;stroke:#1a1a1a;stroke-width:2.99810512;stroke-miterlimit:4;stroke-dasharray:none"
       id="path819"
       sodipodi:sides="3"
       sodipodi:cx="21.544643"
       sodipodi:cy="131.82442"
       sodipodi:r1="230.28647"
       sodipodi:r2="115.14324"
       sodipodi:arg1="0.52240343"
       sodipodi:arg2="1.569601"
       inkscape:flatsided="false"
       inkscape:rounded="0"
       inkscape:randomized="0"
       d="M 221.11607,246.72918 21.682277,246.96758 -177.75151,247.20596 -78.241075,74.372032 21.269372,-98.461887 121.19273,74.133643 Z"
       inkscape:transform-center-x="-0.089208321"
       inkscape:transform-center-y="-7.6703889"
       transform="matrix(0.64815545,0,0,0.1335087,136.23956,109.7171)" />
    <rect
       style="fill:#e9ddaf;stroke:#1a1a1a;stroke-width:0.88194444;stroke-miterlimit:4;stroke-dasharray:none"
       id="rect821"
       width="258.9137"
       height="30.238094"
       x="23.056547"
       y="254.66667"
       ry="5.6696506" />
    <rect
       style="fill:#afe9dd;stroke:#1a1a1a;stroke-width:0.88194444;stroke-miterlimit:4;stroke-dasharray:none"
       id="rect817-3"
       width="42.993977"
       height="101.20231"
       x="236.56317"
       y="146.36171"
       ry="9.0359335" />
    <rect
       style="fill:#deaa87;stroke:#1a1a1a;stroke-width:0.88194442;stroke-miterlimit:4;stroke-dasharray:none"
       id="rect815-6"
       width="43.30904"
       height="21.764399"
       x="74.912804"
       y="151.14571"
       ry="2.814362" />
    <rect
       style="fill:#deaa87;stroke:#1a1a1a;stroke-width:0.88194442;stroke-miterlimit:4;stroke-dasharray:none"
       id="rect815-6-7"
       width="43.30904"
       height="21.764399"
       x="74.912804"
       y="223.5596"
       ry="2.814362" />
    <rect
       style="fill:#deaa87;stroke:#1a1a1a;stroke-width:0.88194442;stroke-miterlimit:4;stroke-dasharray:none"
       id="rect815-6-5"
       width="43.30904"
       height="21.764399"
       x="184.53149"
       y="151.14572"
       ry="2.814362" />
    <rect
       style="fill:#deaa87;stroke:#1a1a1a;stroke-width:0.88194442;stroke-miterlimit:4;stroke-dasharray:none"
       id="rect815-6-3"
       width="43.30904"
       height="21.764399"
       x="184.53149"
       y="223.5596"
       ry="2.814362" />
    <text
       xml:space="preserve"
       style="font-style:normal;font-weight:normal;font-size:6.87382317px;line-height:125%;font-family:sans-serif;letter-spacing:0px;word-spacing:0px;fill:#000000;fill-opacity:1;stroke:none;stroke-width:0.17184557px;stroke-linecap:butt;stroke-linejoin:miter;stroke-opacity:1"
       x="83.242577"
       y="236.33815"
       id="text882"><tspan
         sodipodi:role="line"
         id="tspan880"
         x="83.242577"
         y="236.33815"
         style="stroke-width:0.17184557px">Original</tspan></text>
    <text
       xml:space="preserve"
       style="font-style:normal;font-weight:normal;font-size:6.87382317px;line-height:125%;font-family:sans-serif;letter-spacing:0px;word-spacing:0px;fill:#000000;fill-opacity:1;stroke:none;stroke-width:0.17184557px;stroke-linecap:butt;stroke-linejoin:miter;stroke-opacity:1"
       x="82.985817"
       y="164.53008"
       id="text886"><tspan
         sodipodi:role="line"
         id="tspan884"
         x="82.985817"
         y="164.53008"
         style="stroke-width:0.17184557px">Context</tspan></text>
    <text
       xml:space="preserve"
       style="font-style:normal;font-weight:normal;font-size:6.87382317px;line-height:125%;font-family:sans-serif;letter-spacing:0px;word-spacing:0px;fill:#000000;fill-opacity:1;stroke:none;stroke-width:0.17184557px;stroke-linecap:butt;stroke-linejoin:miter;stroke-opacity:1"
       x="186.19554"
       y="160.29436"
       id="text890"><tspan
         sodipodi:role="line"
         id="tspan888"
         x="186.19554"
         y="160.29436"
         style="stroke-width:0.17184557px">Community</tspan><tspan
         sodipodi:role="line"
         x="186.19554"
         y="168.88664"
         style="stroke-width:0.17184557px"
         id="tspan892">of Practice</tspan></text>
    <text
       xml:space="preserve"
       style="font-style:normal;font-weight:normal;font-size:6.87382317px;line-height:125%;font-family:sans-serif;letter-spacing:0px;word-spacing:0px;fill:#000000;fill-opacity:1;stroke:none;stroke-width:0.17184557px;stroke-linecap:butt;stroke-linejoin:miter;stroke-opacity:1"
       x="198.78525"
       y="237.00439"
       id="text896"><tspan
         sodipodi:role="line"
         id="tspan894"
         x="198.78525"
         y="237.00439"
         style="stroke-width:0.17184557px">Task</tspan></text>
    <text
       xml:space="preserve"
       style="font-style:normal;font-weight:normal;font-size:10.58333302px;line-height:125%;font-family:sans-serif;letter-spacing:0px;word-spacing:0px;fill:#000000;fill-opacity:1;stroke:none;stroke-width:0.26458332px;stroke-linecap:butt;stroke-linejoin:miter;stroke-opacity:1"
       x="34.395832"
       y="272.05356"
       id="text900"><tspan
         sodipodi:role="line"
         id="tspan898"
         x="34.395832"
         y="272.05356"
         style="stroke-width:0.26458332px">Foundation: Theory, Assumptions, Culture, ...</tspan></text>
    <text
       xml:space="preserve"
       style="font-style:normal;font-weight:normal;font-size:10.58333302px;line-height:125%;font-family:sans-serif;letter-spacing:0px;word-spacing:0px;fill:#000000;fill-opacity:1;stroke:none;stroke-width:0.26458332px;stroke-linecap:butt;stroke-linejoin:miter;stroke-opacity:1"
       x="-227.12698"
       y="71.306183"
       id="text904"
       transform="rotate(-81.875711)"><tspan
         sodipodi:role="line"
         id="tspan902"
         x="-227.12698"
         y="71.306183"
         style="stroke-width:0.26458332px">Development</tspan><tspan
         sodipodi:role="line"
         x="-227.12698"
         y="84.535347"
         style="stroke-width:0.26458332px"
         id="tspan906">Methods</tspan></text>
    <text
       xml:space="preserve"
       style="font-style:normal;font-weight:normal;font-size:10.58333302px;line-height:125%;font-family:sans-serif;letter-spacing:0px;word-spacing:0px;fill:#000000;fill-opacity:1;stroke:none;stroke-width:0.26458332px;stroke-linecap:butt;stroke-linejoin:miter;stroke-opacity:1"
       x="-197.4202"
       y="290.00555"
       id="text910"
       transform="rotate(-80.961134)"><tspan
         sodipodi:role="line"
         id="tspan908"
         x="-197.4202"
         y="290.00555"
         style="stroke-width:0.26458332px">Usage Methods</tspan></text>
    <text
       xml:space="preserve"
       style="font-style:normal;font-weight:normal;font-size:10.58333302px;line-height:125%;font-family:sans-serif;letter-spacing:0px;word-spacing:0px;fill:#000000;fill-opacity:1;stroke:none;stroke-width:0.26458332px;stroke-linecap:butt;stroke-linejoin:miter;stroke-opacity:1"
       x="103.09148"
       y="123.66486"
       id="text914"
       transform="rotate(2.4026849)"><tspan
         sodipodi:role="line"
         id="tspan912"
         x="103.09148"
         y="123.66486"
         style="stroke-width:0.26458332px">Scenarios of usage</tspan></text>
    <text
       xml:space="preserve"
       style="font-style:normal;font-weight:normal;font-size:8.70114803px;line-height:125%;font-family:sans-serif;text-align:center;letter-spacing:0px;word-spacing:0px;text-anchor:middle;fill:#000000;fill-opacity:1;stroke:none;stroke-width:0.2175287px;stroke-linecap:butt;stroke-linejoin:miter;stroke-opacity:1"
       x="96.087227"
       y="195.44777"
       id="text918"><tspan
         sodipodi:role="line"
         id="tspan916"
         x="96.087227"
         y="195.44777"
         style="text-align:center;text-anchor:middle;stroke-width:0.2175287px">developing</tspan><tspan
         sodipodi:role="line"
         x="96.087227"
         y="206.3242"
         style="text-align:center;text-anchor:middle;stroke-width:0.2175287px"
         id="tspan928">-&gt;</tspan></text>
    <text
       xml:space="preserve"
       style="font-style:normal;font-weight:normal;font-size:8.70114803px;line-height:125%;font-family:sans-serif;text-align:center;letter-spacing:0px;word-spacing:0px;text-anchor:middle;fill:#000000;fill-opacity:1;stroke:none;stroke-width:0.2175287px;stroke-linecap:butt;stroke-linejoin:miter;stroke-opacity:1"
       x="205.60394"
       y="195.44777"
       id="text922"><tspan
         sodipodi:role="line"
         id="tspan920"
         x="205.60394"
         y="195.44777"
         style="text-align:center;text-anchor:middle;stroke-width:0.2175287px">using</tspan><tspan
         sodipodi:role="line"
         x="205.60394"
         y="206.3242"
         style="text-align:center;text-anchor:middle;stroke-width:0.2175287px"
         id="tspan930">-&gt;</tspan></text>
    <text
       xml:space="preserve"
       style="font-style:normal;font-weight:normal;font-size:10.58333302px;line-height:125%;font-family:sans-serif;letter-spacing:0px;word-spacing:0px;fill:#000000;fill-opacity:1;stroke:none;stroke-width:0.26458332px;stroke-linecap:butt;stroke-linejoin:miter;stroke-opacity:1"
       x="131.53571"
       y="201.32639"
       id="text926"><tspan
         sodipodi:role="line"
         id="tspan924"
         x="131.53571"
         y="201.32639"
         style="font-style:normal;font-variant:normal;font-weight:bold;font-stretch:normal;font-family:sans-serif;-inkscape-font-specification:'sans-serif Bold';stroke-width:0.26458332px">Model</tspan></text>
  </g>
</svg>
