[general]
creator=R package 'raster'
created=2018-09-23 23:21:28
[georeference]
nrows=518
ncols=529
xmin=4302351
ymin=3368967
xmax=4349961
ymax=3415587
projection=NA
[data]
datatype=FLT4S
byteorder=little
nbands=1
bandorder=BIL
categorical=FALSE
minvalue=-11.3022422277565
maxvalue=128.706855567912
nodatavalue=-3.4e+38
[legend]
legendtype=
values=
color=
[description]
layername=X3geodata.SH_srtm90.asc
