<?xml version="1.0" encoding="UTF-8" standalone="no"?>
<!-- Created with Inkscape (http://www.inkscape.org/) -->

<svg
   xmlns:dc="http://purl.org/dc/elements/1.1/"
   xmlns:cc="http://creativecommons.org/ns#"
   xmlns:rdf="http://www.w3.org/1999/02/22-rdf-syntax-ns#"
   xmlns:svg="http://www.w3.org/2000/svg"
   xmlns="http://www.w3.org/2000/svg"
   xmlns:sodipodi="http://sodipodi.sourceforge.net/DTD/sodipodi-0.dtd"
   xmlns:inkscape="http://www.inkscape.org/namespaces/inkscape"
   width="358.57144"
   height="172.5"
   id="svg2"
   version="1.1"
   inkscape:version="0.91 r13725"
   sodipodi:docname="t01_en_v01.svg"
   viewBox="0 0 358.57144 172.5">
  <defs
     id="defs4">
    <filter
       inkscape:collect="always"
       style="color-interpolation-filters:sRGB"
       id="filter4885"
       x="-0.061323192"
       width="1.1226465"
       y="-0.039432764"
       height="1.0788655">
      <feGaussianBlur
         inkscape:collect="always"
         stdDeviation="2.4"
         id="feGaussianBlur4887" />
    </filter>
  </defs>
  <sodipodi:namedview
     id="base"
     pagecolor="#ffffff"
     bordercolor="#666666"
     borderopacity="1.0"
     inkscape:pageopacity="0.0"
     inkscape:pageshadow="2"
     inkscape:zoom="2.8"
     inkscape:cx="185.48109"
     inkscape:cy="46.940436"
     inkscape:document-units="px"
     inkscape:current-layer="layer2"
     showgrid="false"
     units="cm"
     inkscape:window-width="1276"
     inkscape:window-height="981"
     inkscape:window-x="1920"
     inkscape:window-y="20"
     inkscape:window-maximized="0"
     fit-margin-top="0"
     fit-margin-left="0"
     fit-margin-right="0"
     fit-margin-bottom="0" />
  <metadata
     id="metadata7">
    <rdf:RDF>
      <cc:Work
         rdf:about="">
        <dc:format>image/svg+xml</dc:format>
        <dc:type
           rdf:resource="http://purl.org/dc/dcmitype/StillImage" />
        <dc:title />
      </cc:Work>
    </rdf:RDF>
  </metadata>
  <g
     inkscape:label="Ebene 1"
     inkscape:groupmode="layer"
     id="layer1"
     transform="translate(-48.92857,-742.00373)"
     style="display:none"
     sodipodi:insensitive="true" />
  <g
     inkscape:groupmode="layer"
     id="layer2"
     inkscape:label="hintergrund"
     transform="translate(-48.92857,-114.8397)">
    <rect
       style="opacity:1;fill:#faf8ee;fill-opacity:1;fill-rule:nonzero;stroke:none;stroke-width:3;stroke-linejoin:round;stroke-miterlimit:4;stroke-dasharray:none;stroke-dashoffset:0;stroke-opacity:1"
       id="rect4907"
       width="358.57144"
       height="172.5"
       x="48.92857"
       y="114.8397" />
    <rect
       style="opacity:1;fill:#9083af;fill-opacity:1;fill-rule:nonzero;stroke:none;stroke-width:3;stroke-linejoin:round;stroke-miterlimit:4;stroke-dasharray:none;stroke-dashoffset:0;stroke-opacity:1;filter:url(#filter4885)"
       id="rect4859"
       width="93.928574"
       height="146.07143"
       x="157.14285"
       y="130.19684" />
    <rect
       style="opacity:1;fill:#d66f97;fill-opacity:1;fill-rule:nonzero;stroke:#000000;stroke-width:3;stroke-linejoin:round;stroke-miterlimit:4;stroke-dasharray:none;stroke-dashoffset:0;stroke-opacity:1"
       id="rect4701"
       width="90"
       height="46.42857"
       x="155.71428"
       y="193.05399" />
    <rect
       style="opacity:1;fill:#87aade;fill-opacity:1;fill-rule:nonzero;stroke:#000000;stroke-width:3.50625968;stroke-linejoin:round;stroke-miterlimit:4;stroke-dasharray:none;stroke-dashoffset:0;stroke-opacity:1"
       id="rect4701-8"
       width="89.493744"
       height="63.779453"
       x="155.8998"
       y="128.69914" />
    <rect
       style="opacity:1;fill:#816647;fill-opacity:1;fill-rule:nonzero;stroke:#000000;stroke-width:2.41416168;stroke-linejoin:round;stroke-miterlimit:4;stroke-dasharray:none;stroke-dashoffset:0;stroke-opacity:1"
       id="rect4701-6"
       width="90.585838"
       height="29.871552"
       x="155.44487"
       y="239.93796" />
    <text
       sodipodi:linespacing="100%"
       xml:space="preserve"
       style="font-style:normal;font-variant:normal;font-weight:600;font-stretch:normal;font-size:25px;line-height:100%;font-family:'Myriad Pro';-inkscape-font-specification:'Myriad Pro Semi-Bold';text-align:center;writing-mode:lr-tb;text-anchor:middle;opacity:1;fill:#000000;fill-opacity:1;fill-rule:nonzero;stroke:#000000;stroke-width:3;stroke-linejoin:round;stroke-miterlimit:4;stroke-dasharray:none;stroke-dashoffset:0;stroke-opacity:1"
       x="201.02542"
       y="156.26825"
       id="text4724"><tspan
         sodipodi:role="line"
         id="tspan4726"
         x="202.83694"
         y="156.26825"
         style="font-style:normal;font-variant:normal;font-weight:600;font-stretch:normal;font-size:17.5px;line-height:100%;font-family:'Myriad Pro';-inkscape-font-specification:'Myriad Pro, Semi-Bold';text-align:center;writing-mode:lr-tb;text-anchor:middle;fill:#000000;stroke:none">structured </tspan><tspan
         sodipodi:role="line"
         x="201.02542"
         y="173.76825"
         style="font-style:normal;font-variant:normal;font-weight:600;font-stretch:normal;font-size:17.5px;line-height:100%;font-family:'Myriad Pro';-inkscape-font-specification:'Myriad Pro, Semi-Bold';text-align:center;writing-mode:lr-tb;text-anchor:middle;fill:#000000;stroke:none"
         id="tspan4756">data</tspan></text>
    <text
       sodipodi:linespacing="100%"
       xml:space="preserve"
       style="font-style:normal;font-variant:normal;font-weight:600;font-stretch:normal;font-size:25px;line-height:100%;font-family:'Myriad Pro';-inkscape-font-specification:'Myriad Pro Semi-Bold';text-align:center;writing-mode:lr-tb;text-anchor:middle;opacity:1;fill:#000000;fill-opacity:1;fill-rule:nonzero;stroke:#000000;stroke-width:3;stroke-linejoin:round;stroke-miterlimit:4;stroke-dasharray:none;stroke-dashoffset:0;stroke-opacity:1"
       x="200.59335"
       y="211.3131"
       id="text4724-6"><tspan
         sodipodi:role="line"
         id="tspan4726-4"
         x="202.40488"
         y="211.3131"
         style="font-style:normal;font-variant:normal;font-weight:600;font-stretch:normal;font-size:17.5px;line-height:100%;font-family:'Myriad Pro';-inkscape-font-specification:'Myriad Pro, Semi-Bold';text-align:center;writing-mode:lr-tb;text-anchor:middle;fill:#000000;stroke:none">individual </tspan><tspan
         sodipodi:role="line"
         x="200.59335"
         y="228.8131"
         style="font-style:normal;font-variant:normal;font-weight:600;font-stretch:normal;font-size:17.5px;line-height:100%;font-family:'Myriad Pro';-inkscape-font-specification:'Myriad Pro, Semi-Bold';text-align:center;writing-mode:lr-tb;text-anchor:middle;fill:#000000;stroke:none"
         id="tspan4754">data</tspan></text>
    <text
       xml:space="preserve"
       style="font-style:normal;font-variant:normal;font-weight:600;font-stretch:normal;font-size:25px;font-family:'Myriad Pro';-inkscape-font-specification:'Myriad Pro Semi-Bold';text-align:start;writing-mode:lr-tb;text-anchor:start;opacity:1;fill:#000000;fill-opacity:1;fill-rule:nonzero;stroke:#000000;stroke-width:3;stroke-linejoin:round;stroke-miterlimit:4;stroke-dasharray:none;stroke-dashoffset:0;stroke-opacity:1"
       x="180.76596"
       y="260.24167"
       id="text4724-3"><tspan
         sodipodi:role="line"
         id="tspan4726-41"
         x="180.76596"
         y="260.24167"
         style="font-size:17.5px;fill:#000000;stroke:none">noise</tspan></text>
    <text
       xml:space="preserve"
       style="font-style:normal;font-variant:normal;font-weight:normal;font-stretch:normal;font-size:12.5px;line-height:100%;font-family:FreeSans;-inkscape-font-specification:'FreeSans, Normal';text-align:center;writing-mode:lr-tb;text-anchor:middle;opacity:1;fill:#000000;fill-opacity:1;fill-rule:nonzero;stroke:none;stroke-width:3;stroke-linejoin:round;stroke-miterlimit:4;stroke-dasharray:none;stroke-dashoffset:0;stroke-opacity:1"
       x="328.00677"
       y="154.92912"
       id="text4182"
       sodipodi:linespacing="100%"><tspan
         sodipodi:role="line"
         x="329.56927"
         y="154.92912"
         id="tspan4184"><tspan
           x="328.00677"
           y="154.92912"
           style="font-style:normal;font-variant:normal;font-weight:normal;font-stretch:normal;font-size:12.5px;line-height:100%;font-family:FreeSans;-inkscape-font-specification:'FreeSans, Normal';text-align:center;writing-mode:lr-tb;text-anchor:middle"
           id="tspan4186">quantitative approaches </tspan></tspan><tspan
         sodipodi:role="line"
         x="344.63275"
         y="167.42912"
         id="tspan4188"><tspan
           x="344.63275"
           y="167.42912"
           style="font-style:normal;font-variant:normal;font-weight:normal;font-stretch:normal;font-size:12.5px;line-height:100%;font-family:FreeSans;-inkscape-font-specification:'FreeSans, Normal';text-align:center;writing-mode:lr-tb;text-anchor:middle"
           id="tspan4190">(science tradition)</tspan></tspan></text>
    <text
       xml:space="preserve"
       style="font-style:normal;font-variant:normal;font-weight:normal;font-stretch:normal;font-size:12.5px;line-height:100%;font-family:FreeSans;-inkscape-font-specification:'FreeSans, Normal';text-align:center;writing-mode:lr-tb;text-anchor:middle;opacity:1;fill:#000000;fill-opacity:1;fill-rule:nonzero;stroke:none;stroke-width:3;stroke-linejoin:round;stroke-miterlimit:4;stroke-dasharray:none;stroke-dashoffset:0;stroke-opacity:1"
       x="327.27759"
       y="211.8871"
       id="text4192"
       sodipodi:linespacing="100%"><tspan
         sodipodi:role="line"
         x="328.84009"
         y="211.8871"
         id="tspan4194"><tspan
           x="327.27759"
           y="211.8871"
           style="font-style:normal;font-variant:normal;font-weight:normal;font-stretch:normal;font-size:12.5px;line-height:100%;font-family:FreeSans;-inkscape-font-specification:'FreeSans, Normal';text-align:center;writing-mode:lr-tb;text-anchor:middle"
           id="tspan4196">hermeneutic approaches </tspan></tspan><tspan
         sodipodi:role="line"
         x="337.31177"
         y="224.3871"
         id="tspan4198"><tspan
           x="337.31177"
           y="224.3871"
           style="font-style:normal;font-variant:normal;font-weight:normal;font-stretch:normal;font-size:12.5px;line-height:100%;font-family:FreeSans;-inkscape-font-specification:'FreeSans, Normal';text-align:center;writing-mode:lr-tb;text-anchor:middle"
           id="tspan4200">(humanities tradition)</tspan></tspan></text>
    <text
       xml:space="preserve"
       style="font-style:normal;font-variant:normal;font-weight:normal;font-stretch:normal;font-size:12.5px;line-height:100%;font-family:FreeSans;-inkscape-font-specification:'FreeSans, Normal';text-align:center;writing-mode:lr-tb;text-anchor:middle;opacity:1;fill:#000000;fill-opacity:1;fill-rule:nonzero;stroke:none;stroke-width:3;stroke-linejoin:round;stroke-miterlimit:4;stroke-dasharray:none;stroke-dashoffset:0;stroke-opacity:1"
       x="329.03387"
       y="258.6279"
       id="text4202"
       sodipodi:linespacing="100%"><tspan
         sodipodi:role="line"
         x="329.03387"
         y="258.6279"
         id="tspan4204"><tspan
           x="329.03387"
           y="258.6279"
           style="font-style:normal;font-variant:normal;font-weight:normal;font-stretch:normal;font-size:12.5px;line-height:100%;font-family:FreeSans;-inkscape-font-specification:'FreeSans, Normal';text-align:center;writing-mode:lr-tb;text-anchor:middle"
           id="tspan4206">no analytical approaches</tspan></tspan></text>
    <text
       xml:space="preserve"
       style="font-style:normal;font-variant:normal;font-weight:normal;font-stretch:normal;font-size:15px;line-height:100%;font-family:FreeSans;-inkscape-font-specification:'FreeSans, Normal';text-align:center;writing-mode:lr-tb;text-anchor:middle;opacity:1;fill:#000000;fill-opacity:1;fill-rule:nonzero;stroke:none;stroke-width:3;stroke-linejoin:round;stroke-miterlimit:4;stroke-dasharray:none;stroke-dashoffset:0;stroke-opacity:1"
       x="89.726013"
       y="211.4187"
       id="text4208"
       sodipodi:linespacing="100%"><tspan
         sodipodi:role="line"
         x="91.288513"
         y="211.4187"
         id="tspan4210"><tspan
           x="89.726013"
           y="211.4187"
           style="font-style:normal;font-variant:normal;font-weight:normal;font-stretch:normal;font-size:12.5px;line-height:100%;font-family:FreeSans;-inkscape-font-specification:'FreeSans, Normal';text-align:center;writing-mode:lr-tb;text-anchor:middle"
           id="tspan4212">depends on </tspan></tspan><tspan
         sodipodi:role="line"
         x="104.72845"
         y="223.9187"
         id="tspan4214"><tspan
           x="104.72845"
           y="223.9187"
           style="font-style:normal;font-variant:normal;font-weight:normal;font-stretch:normal;font-size:12.5px;line-height:100%;font-family:FreeSans;-inkscape-font-specification:'FreeSans, Normal';text-align:center;writing-mode:lr-tb;text-anchor:middle"
           id="tspan4216">theory</tspan></tspan></text>
    <path
       style="opacity:1;fill:#808080;fill-opacity:1;fill-rule:nonzero;stroke:none;stroke-width:3;stroke-linejoin:round;stroke-miterlimit:4;stroke-dasharray:none;stroke-dashoffset:0;stroke-opacity:1"
       inkscape:transform-center-x="6.0602644"
       inkscape:transform-center-y="-3.6454498"
       d="m 153.03811,192.35668 -27.52535,20.92795 -0.003,-10.16238 z"
       id="path4889"
       inkscape:connector-curvature="0"
       sodipodi:nodetypes="cccc" />
    <path
       style="opacity:1;fill:#808080;fill-opacity:1;fill-rule:nonzero;stroke:none;stroke-width:3;stroke-linejoin:round;stroke-miterlimit:4;stroke-dasharray:none;stroke-dashoffset:0;stroke-opacity:1"
       inkscape:transform-center-x="6.0602644"
       inkscape:transform-center-y="-3.6454498"
       d="m 153.41776,238.94601 -27.90416,-13.66977 -0.003,-10.16238 z"
       id="path4889-9"
       inkscape:connector-curvature="0"
       sodipodi:nodetypes="cccc" />
  </g>
  <g
     inkscape:groupmode="layer"
     id="layer3"
     inkscape:label="inhalt"
     transform="translate(-48.92857,-114.8397)" />
  <g
     inkscape:groupmode="layer"
     id="layer4"
     inkscape:label="text"
     transform="translate(-48.92857,-114.8397)" />
  <g
     inkscape:groupmode="layer"
     id="layer5"
     inkscape:label="hilfslinien"
     style="display:none"
     sodipodi:insensitive="true"
     transform="translate(-48.92857,-114.8397)" />
</svg>
