-10,[food] snacks,2021-04-26T00:00:00
-1.95,[food] bubblegum,2021-04-27T17:20:31
-9.95,[food] hot dog,2021-04-27T00:00:00
-3.33,donation,2021-04-28T00:00:00
-30,[medicine] cardiologist,2021-04-29T00:00:00
