<svg version="1.1" viewBox="0 0 32 32" xml:space="preserve" xmlns="http://www.w3.org/2000/svg">
    <style type="text/css">
    .st0{fill:#767676;}.st1{fill:#9B9B9B;}
  </style>
  <path class="st0" d="M 6.013 31.745 C 5.925 31.858 5.691 31.9 5.458 31.817 C 5.258 31.717 5.058 31.5 5.058 31.2 L 5.058 26.325 L 3.758 26.325 C 1.758 26.325 0.158 24.6 0.158 22.2 L 0.158 4.4 C 0.158 2 1.758 0.275 3.758 0.275 L 28.258 0.275 C 30.258 0.275 31.858 2 31.858 4.4 L 31.858 22.2 C 31.858 24.6 30.258 26.435 28.258 26.435 L 25.558 26.435 C 25.258 26.468 24.919 26.278 24.913 25.778 C 24.908 25.295 25.224 25.077 25.558 25.11 L 28.258 25.11 C 29.558 25.11 30.658 23.7 30.658 22.1 L 30.658 4.4 C 30.658 2.8 29.558 1.5 28.258 1.5 L 3.758 1.5 C 2.458 1.5 1.358 2.8 1.358 4.4 L 1.358 22.2 C 1.358 23.8 2.458 25.1 3.758 25.1 L 5.658 25.1 C 5.958 25.1 6.258 25.18 6.258 25.68 L 6.258 29.4 L 9.558 25.3 C 9.658 25.2 9.858 25.1 9.958 25.1 L 20.658 25.1 C 20.941 25.067 21.285 25.289 21.285 25.789 C 21.285 26.299 20.941 26.458 20.658 26.425 L 10.158 26.425 L 6.013 31.745 Z"/>
  <path class="st1" d="M 25.591 17.609 C 25.29 17.883 24.956 17.956 24.6 17.6 L 22.9 15.9 L 21.2 17.6 C 20.873 17.928 20.582 17.928 20.3 17.6 L 18.2 15.5 C 18.1 15.4 18 15.2 18 15.1 C 18 15 18.1 14.8 18.2 14.7 L 19.9 13 L 18.2 11.3 C 18.1 11.2 18 11 18 10.9 C 18 10.7 18.1 10.6 18.2 10.5 L 20.3 8.4 C 20.6 8 21 8 21.3 8.3 L 23 10 L 24.7 8.3 C 24.8 8.2 25 8.1 25.1 8.1 C 25.3 8.1 25.4 8.2 25.5 8.3 L 27.6 10.4 C 27.8 10.6 27.8 11 27.6 11.3 L 25.9 13 L 27.6 14.7 C 27.8 14.9 27.8 15.3 27.6 15.6 L 25.591 17.609 Z M 19.6 15 L 20.8 16.2 L 22.5 14.5 C 22.7 14.3 23.1 14.3 23.4 14.5 L 25.1 16.2 L 26.3 15 L 24.6 13.3 C 24.4 13.1 24.4 12.7 24.6 12.4 L 26.267 10.75 L 25 9.6 L 23.3 11.3 C 23.1 11.5 22.7 11.5 22.4 11.3 L 20.7 9.6 L 19.5 10.8 L 21.2 12.5 C 21.3 12.6 21.4 12.8 21.4 12.9 C 21.4 13 21.3 13.2 21.2 13.3 L 19.6 15 Z"/>
  <path class="st1" d="M 8.4 17.6 C 8.2 17.6 8.1 17.5 8 17.4 L 7 16.5 L 4.2 13.7 C 4 13.5 4 13.1 4.2 12.8 L 6.3 10.7 C 6.5 10.5 6.9 10.5 7.2 10.7 L 8.4 11.9 L 11.8 8.5 C 12 8.3 12.4 8.3 12.7 8.5 L 14.8 10.6 C 14.9 10.7 15 10.9 15 11 C 15 11.1 14.9 11.3 14.8 11.4 L 8.9 17.3 C 8.7 17.5 8.5 17.6 8.4 17.6 L 8.4 17.6 Z M 7.8 15.5 L 8.3 16 L 13.3 11 L 12.1 9.8 L 8.7 13.2 C 8.5 13.4 8.082 13.473 7.8 13.2 L 6.6 12 L 5.4 13.2 L 7.8 15.5 L 7.8 15.5 Z"/>
  <circle style="fill: rgb(155, 155, 155);" cx="23.12" cy="25.757" r="0.663"/>
</svg>