<svg version="1.1" viewBox="0 0 32 32" xml:space="preserve" xmlns="http://www.w3.org/2000/svg">
  <style>
    .st0{fill:#767676}
  </style>
  <path class="st0" d="M 28.7 3.4 L 21.5 3.4 L 21.5 2.7 C 21.5 2.1 21 1.5 20.3 1.5 C 19.7 1.5 19.1 2 19.1 2.7 L 19.1 3.5 L 13 3.5 L 13 2.7 C 13 2.1 12.5 1.5 11.8 1.5 C 11.2 1.5 10.6 2 10.6 2.7 L 10.6 3.5 L 3.6 3.5 C 3 3.5 2.4 4 2.4 4.7 L 2.4 29.9 C 2.4 30.5 2.9 31.1 3.6 31.1 L 21.2 31.1 C 20.296 30.561 19.433 29.541 19.062 28.8 L 4.7 28.8 L 4.7 12 L 27.6 12 L 27.6 18.6 C 28.561 18.819 29.3 19.3 29.9 19.9 L 29.9 4.6 C 29.9 3.9 29.4 3.4 28.7 3.4 Z M 27.6 9.7 L 4.7 9.7 L 4.7 5.7 L 10.8 5.7 L 10.8 7.2 C 10.8 7.8 11.3 8.4 12 8.4 C 12.6 8.4 13.2 7.9 13.2 7.2 L 13.2 5.7 L 19.3 5.7 L 19.3 7.2 C 19.3 7.8 19.8 8.4 20.5 8.4 C 21.1 8.4 21.7 7.9 21.7 7.2 L 21.7 5.7 L 27.8 5.7 L 27.8 9.7 L 27.6 9.7 Z"/>
  <circle cx="25.1" cy="25.2" r="5.7" fill="none" stroke="#9b9b9b" stroke-miterlimit="10"/>
  <path fill="none" stroke="#767676" stroke-miterlimit="10" d="M24.5 21.7v4.6h4.8"/>
</svg>