<svg version="1.1" viewBox="0 0 512 512" xml:space="preserve" xmlns="http://www.w3.org/2000/svg">
  <style>
    .st1{fill:#9b9b9b}
  </style>
  <path d="M502 271.3l-51.6-90.1c-1.8-3.1-4.5-5.3-7.6-6.5l-69.6-25.5c.3 1.5-.1 3.1-1.4 4.1-6.3 5.3-12.5 12.6-19.1 19.6l42.5 15.6-139.9 51.4-141.9-51.4 31.4-11.3c-.1-.1-.2-.1-.3-.2-12-4.7-23.3-11.3-33.3-18.8l-45.8 16.5c-3.2 1.1-6 3.4-7.7 6.5L5.9 271.3c-2.1 3.7-2.5 8.1-1.1 12.2 1.4 4 4.5 7.2 8.5 8.8l42.3 16.4v112c0 6.2 3.9 11.7 9.7 13.8l183.9 66.2c1.9.9 4 1.4 6.2 1.4h.2c1.7 0 3.4-.3 5-.9l185.3-66.7c5.8-2.1 9.7-7.6 9.7-13.8V307.4l39.1-15.2c4-1.5 7.1-4.7 8.5-8.8 1.3-4 .9-8.4-1.2-12.1zM39.8 271l37-64.7 157 56.9-39.4 67.8-154.6-60zm200.9 195.4L84.9 410.3V320l110.7 43c1.7.7 3.5 1 5.3 1 5.1 0 10-2.7 12.7-7.3l27.2-46.8v156.5zm29.3.2V312.4l24.2 44c3.5 6.4 11.3 9.2 18.1 6.6l113.8-44.2v91.6L270 466.6zM313.7 331l-37.3-67.6 154.7-56.9 37 64.6L313.7 331z" fill="#767676"/>
  <path class="st1" d="M160.4 97.3l30.9 55.8c4.9 8.8 1.7 19.9-7.1 24.7l-.3.2c-4.2 2.3-9.1 2.9-13.8 1.6-4.7-1.3-8.5-4.4-10.9-8.6l-36.4-65.7c-3.3-6-1.1-13.6 4.9-16.9l.2-.1c6-3.3 13.6-1.1 16.9 4.9l36.2 65.4c1.8 3.3.6 7.4-2.6 9.2l-.2.1c-1.6.9-3.4 1.1-5.1.6-1.7-.5-3.2-1.6-4-3.2l-30.8-55.6c-.8-1.4-2.6-1.9-4-1.1-1.4.8-1.9 2.6-1.1 4l30.8 55.6c1.6 2.9 4.3 5.1 7.5 6 3.2.9 6.6.5 9.6-1.1l.2-.1c6.1-3.4 8.3-11 4.9-17.1L150 90.5c-4.9-8.8-16.1-12-24.9-7.1l-.2.1c-8.8 4.9-12 16.1-7.1 24.9l36.4 65.7c3.1 5.6 8.2 9.7 14.4 11.4 6.2 1.8 12.7 1 18.3-2.1l.3-.2c5.8-3.2 9.7-8.5 11.4-14.4 1.7-5.9 1.1-12.5-2.1-18.3l-30.9-55.8c-.8-1.4-2.6-1.9-4-1.1-1.5.5-2 2.3-1.2 3.7zM353.8 103.5l-114-33c-2-.6-4.2.6-4.8 2.6l-21.3 73.7c-.6 2 .6 4.2 2.6 4.8l114 33c2 .6 4.2-.6 4.8-2.6.3-1 21.1-73 21.3-73.7.6-2.1-.6-4.2-2.6-4.8zm-131.6 41.9l2.7-9.5 25.6-14.1c.7 1.2 19.8 35.8 20.8 37.8-7.4-2.2-48.5-14.1-49.1-14.2zm106.5 30.8l-46.9-13.6-12.5-22.6 37.9-20.8 25.3 43.6-3.8 13.4zm-16.6-64.1c-1-1.8-3.3-2.4-5.2-1.4l-41.3 22.6-10.2-18.6c-1-1.9-3.4-2.5-5.2-1.5L228 125.4 241.4 79 348 109.8l-12.4 42.8-23.5-40.5z"/>
  <path fill="none" stroke="#9b9b9b" stroke-width="8" stroke-miterlimit="10" d="M303.4 88.9l12.3-33.1 117.8 33.1-21.4 60.2-62.1-18.7"/>
</svg>
