module gitlab.com/nishanth.shetty.netbook/interceptors

go 1.17

require (
	github.com/go-kit/kit v0.11.0
	github.com/gogo/status v1.1.0
	go.uber.org/zap v1.19.1
	google.golang.org/grpc v1.44.0
)

require (
	github.com/go-logfmt/logfmt v0.5.0 // indirect
	github.com/gogo/googleapis v0.0.0-20180223154316-0cd9801be74a // indirect
	github.com/gogo/protobuf v1.3.2 // indirect
	github.com/golang/protobuf v1.5.2 // indirect
	go.uber.org/atomic v1.7.0 // indirect
	go.uber.org/multierr v1.6.0 // indirect
	golang.org/x/net v0.0.0-20210405180319-a5a99cb37ef4 // indirect
	golang.org/x/sys v0.0.0-20210603081109-ebe580a85c40 // indirect
	golang.org/x/text v0.3.5 // indirect
	google.golang.org/genproto v0.0.0-20210602131652-f16073e35f0c // indirect
	google.golang.org/protobuf v1.27.1 // indirect
)
