#In-silico ESI-MS/MS [M+H]+ Spectra
#PREDICTED BY CFM-ID 4.0.8
#SMILES=n1cnc2c(c1N)[n+](cn2[C@H]1C[C@H]([C@H](O1)CO)O)C1C(C2C(O1)Oc1c2c2c(c(c1)O)c1c(c(=O)o2)C(=O)CC1)O
#InChiKey=VHFQDFIZCUXPGS-JJWZORPRSA-O
energy0
450.10442 68.00 9 57 52 58 27 37 50 60 20 24 65 29 71 67 63 69 32 36 62 70 35 23 (31.513 0.099889 0.082679 0.069826 0.066968 0.065112 0.031867 0.019332 0.019298 0.009406 0.0083632 0.0081861 0.0066278 0.0051569 0.0043011 0.0042973 0.0024182 0.0023869 0.0021113 0.0014484 0.00066519 0.00020731)
452.12007 100.00 72 86 103 102 110 97 114 124 118 120 84 123 99 79 122 128 88 125 119 95 130 126 91 116 115 94 117 83 (39.624 1.3331 1.2503 1.0842 1.0283 0.62961 0.38179 0.32346 0.21093 0.17889 0.13629 0.13594 0.099248 0.098654 0.086736 0.085728 0.083387 0.079324 0.063743 0.050592 0.02607 0.024891 0.022942 0.022574 0.020735 0.0080106 0.0048857 0.00095307)
566.15177 17.32 0 196 224 228 213 184 227 179 220 232 183 219 239 237 176 235 223 181 243 246 236 244 233 238 245 188 177 182 178 (6.5817 0.51298 0.23452 0.22091 0.13739 0.13243 0.10402 0.056274 0.031776 0.024344 0.017918 0.015772 0.015096 0.013081 0.012467 0.012308 0.0072736 0.005343 0.0045909 0.0040745 0.0035589 0.0026537 0.0020276 0.0017294 0.0013205 0.00087912 0.00038706 0.00036513 0.00031138)
energy1
136.06177 100.00 8 (38.667)
450.10442 54.00 9 57 52 37 60 36 20 50 32 58 24 71 29 67 63 23 62 69 27 70 65 35 (17.197 0.92091 0.84134 0.33184 0.24075 0.2122 0.20123 0.17536 0.13554 0.10944 0.10718 0.10097 0.083369 0.053869 0.036801 0.026267 0.024057 0.023845 0.023033 0.019287 0.0128 0.0011697)
452.12007 59.92 72 103 102 91 97 110 114 84 99 130 95 125 128 119 115 88 126 79 120 86 83 122 118 124 116 123 117 94 (14.453 1.9385 1.9169 0.53229 0.46571 0.39205 0.38117 0.3605 0.35401 0.34251 0.27812 0.20516 0.19565 0.18733 0.16374 0.14348 0.1393 0.1381 0.10489 0.099351 0.097153 0.09005 0.082388 0.040565 0.035743 0.017525 0.0078643 0.0056014)
energy2
121.05087 2.68 33 (0.81703)
123.06652 3.13 30 (0.9554)
134.04612 5.96 14 (1.8163)
136.06177 100.00 8 (30.49)
138.07742 15.88 15 (4.8411)
140.09307 2.37 16 (0.72319)
148.06177 5.18 49 (1.5782)
150.07742 6.15 48 (1.8766)
164.05669 2.15 40 (0.65446)
192.08799 2.64 151 (0.80492)
208.08290 1.99 159 (0.60678)
234.09855 3.94 153 146 (1.1306 0.072234)
236.11420 4.18 170 165 164 (1.0215 0.15433 0.099616)
237.09822 2.12 167 (0.64578)
287.05501 5.94 44 (1.8121)
289.07066 3.07 45 (0.9362)
422.10951 2.70 68 66 38 (0.50478 0.29766 0.020854)
423.09353 3.98 22 31 (1.1219 0.090309)
434.10951 5.81 78 76 101 75 77 (0.77961 0.28751 0.25824 0.24138 0.20575)
435.09353 3.47 80 73 96 85 (0.65074 0.24374 0.10978 0.054564)
450.10442 25.95 9 37 24 32 52 27 29 36 58 20 50 67 69 71 65 23 57 63 70 35 62 60 (5.265 0.51624 0.46954 0.2549 0.21205 0.196 0.14361 0.12398 0.1133 0.087123 0.082538 0.07691 0.072643 0.06539 0.056621 0.048927 0.039361 0.025436 0.021173 0.016699 0.013655 0.0097142)
452.12007 38.87 72 102 84 97 91 79 99 88 130 95 86 126 110 83 103 123 125 115 119 124 120 128 122 117 118 94 116 114 (9.893 0.29043 0.28009 0.21635 0.17204 0.11665 0.10714 0.099989 0.077578 0.06706 0.055054 0.051741 0.050349 0.049874 0.046234 0.036767 0.032811 0.027657 0.023489 0.021829 0.021511 0.020488 0.019805 0.019377 0.016947 0.015642 0.011911 0.010852)
478.09934 2.97 185 (0.9043)
506.13064 4.09 193 (1.2482)
508.14629 3.70 194 (1.127)
520.14629 3.11 137 (0.94933)
548.14120 2.08 195 173 174 229 175 139 138 140 (0.26113 0.14607 0.14599 0.066176 0.0042521 0.0039488 0.0031483 0.0029169)

0 566.1517683881 NC1=C2C(=NC=N1)N(C1CC(O)C(CO)O1)C=[N+]2C1OC2OC3=C(C4=C(C(O)=C3)C3=C(C(=O)CC3)C(=O)O4)C2C1O
1 549.1252192921 OC1=CC2=C(C3=C1C1CCC(O)C1C(O)O3)C1=C(O2)OC(N2CN(C3=CC(O)=C(C=[OH+])O3)C3=NC=NC=C32)=C1O
2 119.0702706321 OC1CCOC1C[OH2+]
3 117.0546205681 OC1C=COC1C[OH2+]
4 117.0546205681 C=COC(=CO)C[OH2+] Intermediate Fragment 
5 117.0546205681 OC=C=C(O)CC[OH2+] Intermediate Fragment 
6 115.0389705041 OC1=C(C[OH2+])OC=C1
7 448.0887742081 [NH3+]C1=C2C(=NC=N1)N=CN2C1=C(O)C2=C(OC3=C2C2=C(C(O)=C3)C3=C(C(=O)O2)C(O)CC3)O1
8 136.0617716121 [NH2+]=C1N=CN=C2NCN=C12
9 450.1044242721 [NH3+]C1=C2C(=NC=N1)N=CN2C1=C(O)C2=C(OC3=C2C2=C(C(O)=C3)C3=C(C(O)CC3)C(O)O2)O1
10 433.0778751761 O=C1OC2=C(C([OH2+])=CC3=C2C2=C(O3)OC(N3C=NC4=NC=NC=C43)=C2O)C2=C1C(O)CC2
11 317.0655791761 OC1=COC2=C1C1=C(C=C([OH2+])C3=C1OC(O)C1=C3CCC1O)O2
12 315.0499291121 O=C1OC2=C(C([OH2+])=CC3=C2C2=C(OC=C2O)O3)C2=C1C(O)CC2
13 313.0342790481 O=C1CCC2=C1C(=O)OC1=C2C([OH2+])=CC2=C1C1=C(OC=C1O)O2
14 134.0461215481 [NH2+]=C1N=CN=C2N=CN=C12
15 138.0774216761 [NH2+]=C1N=CN=C2NCNC12
16 140.0930717401 [NH3+]C1N=CN=C2NCNC21
17 432.0938595881 [NH3+]C1=C2C(=NC=N1)N=CN2C1=C(O)C2=C(OC3=C2C2=C(C(O)=C3)C3=C(CO2)C(=O)CC3)O1
18 432.0938595881 [NH3+]C1=C2C(=NC=N1)N=CN2C1=C(O)C2=C(OC3=C2C2=C(C(O)=C3)C3=C(CCC3)C(=O)O2)O1
19 432.0938595881 [NH3+]C1=C2C(=NC=N1)N=CN2C1=CC2=C(O1)OC1=C2C2=C(C(O)=C1)C1=C(C(=O)O2)C(O)CC1
20 450.1044242721 N=C=NC1=C(C#[NH+])N(C2=C(O)C3=C(OC4=C3C3=C(C(O)=C4)C4CCC(O)C4C(O)O3)O2)C=N1 Intermediate Fragment 
21 433.0778751761 C=[NH+]C1=C(C#N)N(C2=C(O)C3=C(OC4=C3C3=C(C(O)=C4)C4=C(C(=O)O3)C(O)CC4)O2)C=N1
22 423.0935252401 N=C=C1C(=[NH2+])N=CN1C1=C(O)C2=C(OC3=C2C2=C(C(O)=C3)C3=C(C(O)CC3)C(O)O2)O1
23 450.1044242721 [NH+]#CN=C=NC1=CN(C2=C(O)C3=C(OC4=C3C3=C(C(O)=C4)C4CCC(O)C4C(O)O3)O2)C=N1 Intermediate Fragment 
24 450.1044242721 C=NC([NH3+])=C1C(=N)N=CN1C1=C(O)C2=C(OC3=C2C2=C(C(O)=C3)C3=C(C(=O)O2)C(O)CC3)O1 Intermediate Fragment 
25 419.0622251121 N=C=C1C(=[NH2+])N=CN1C1=C(O)C2=C(OC3=C2C2=C(C(O)=C3)C3=C(C(=O)CC3)C(=O)O2)O1
26 421.0778751761 N=C=C1C(=[NH2+])N=CN1C1=C(O)C2=C(OC3=C2C2=C(C(O)=C3)C3=C(C(=O)O2)C(O)CC3)O1
27 450.1044242721 C=NC1=C(C(N)=[NH2+])N(C2=C(O)C3=C(OC4=C3C3=C(C(O)=C4)C4=C(C(=O)O3)C(O)CC4)O2)C=N1 Intermediate Fragment 
28 408.0826262081 C=[NH+]C1=CN(C2=C(O)C3=C(OC4=C3C3=C(C(O)=C4)C4=C(C(=O)O3)C(O)CC4)O2)C=N1
29 450.1044242721 C=NC1=NC=NC([NH3+])=C1N=C1OC2OC3=C(C4=C(C(O)=C3)C3=C(C(=O)O4)C(O)CC3)C2=C1O Intermediate Fragment 
30 123.0665226441 C=NC1=NC=NC([NH3+])=C1
31 423.0935252401 [NH3+]C1=C(N=C2OC3OC4=C(C5=C(C(O)=C4)C4=C(C(=O)O5)C(O)CC4)C3=C2O)C=NC=N1
32 450.1044242721 [NH3+]C1=CC(N=C=NC2=C(O)C3=C(OC4=C3C3=C(C(O)=C4)C4=C(C(O)CC4)C(O)O3)O2)=NC=N1 Intermediate Fragment 
33 121.0508725801 C#[N+]C1=NC=NC(N)=C1
34 340.0451780801 C=[NH+]C1=C(O)C2=C(OC3=C2C2=C(C(O)=C3)C3=C(C(=O)CC3)C(=O)O2)O1
35 450.1044242721 N=CN(C1=C([NH3+])N=CN=C1)C1=C(O)C2=C(OC3=C2C2=C(C(O)=C3)C3=C(C(=O)O2)C(O)CC3)O1 Intermediate Fragment 
36 450.1044242721 CN(C1=C(O)C2=C(OC3=C2C2=C(C(O)=C3)C3=C(C(=O)CC3)C(=O)O2)O1)C1=C([NH3+])N=CN=C1N Intermediate Fragment 
37 450.1044242721 [NH3+]C1=C2C(=NC=N1)N=CN2COC1OC2=C(C1=CO)C1=C(C(O)=C2)C2=C(C(=O)CC2)C(=O)O1 Intermediate Fragment 
38 422.1095096521 [NH3+]C1=C2C(=NC=N1)N=CN2COC1=CC2=C(C=C(O)C3=C2OC(=O)C2=C3CCC2O)O1
39 420.0938595881 [NH3+]C1=C2C(=NC=N1)N=CN2COC1=CC2=C(C=C(O)C3=C2OC(=O)C2=C3CCC2=O)O1
40 164.0566862321 [NH3+]C1=C2C(=NC=N1)N=CN2C=O
41 162.0410361681 NC1=C2C(=NC=N1)N=CN2C#[O+]
42 283.0237143641 O=CC1=COC2=C1C1=C(C([OH2+])=C2)C2=C(C(=O)C=C2)C(=O)O1
43 285.0393644281 O=C1C=CC2=C1C(=O)OC1=C2C([OH2+])=CC2=C1C(CO)=CO2
44 287.0550144921 O=C1CCC2=C1C(=O)OC1=C2C([OH2+])=CC2=C1C(CO)=CO2
45 289.0706645561 O=C1OC2=C(C([OH2+])=CC3=C2C(CO)=CO3)C2=C1C(O)CC2
46 154.1087218041 CN1CNC2=NC=NC([NH3+])C21
47 152.0930717401 CN1CNC2=NC=NC([NH3+])=C21
48 150.0774216761 CN1C=NC2=NC=NC([NH3+])=C21
49 148.0617716121 [CH2+]N1C=NC2=NC=NC(N)=C21
50 450.1044242721 [NH3+]C1=C2C(=NC=N1)N=CN2C=C(O)C1=C(O)OC2=C1C1=C(C(O)=C2)C2=C(C(=O)O1)C(O)CC2 Intermediate Fragment 
51 180.0879863601 [NH3+]C1=C2C(=NC=N1)N=CN2CCO
52 450.1044242721 [NH3+]C1=C2C(=NC=N1)N=CN2C(O)=C(O)C1=COC2=C1C1=C(C(O)=C2)C2=C(C(=O)O1)C(O)CC2 Intermediate Fragment 
53 166.0723362961 [NH3+]C1=C2C(=NC=N1)N=CN2CO
54 192.0516008521 [NH3+]C1=C2C(=NC=N1)N=CN2C(=O)C=O
55 194.0672509161 [NH3+]C1=C2C(=NC=N1)N=CN2C(O)C=O
56 196.0829009801 [NH3+]C1=C2C(=NC=N1)N=CN2C(O)CO
57 450.1044242721 [NH3+]C1=C2C(=NC=N1)N=CN2C(=CO)OC1=CC2=C(C=C(O)C3=C2OC(=O)C2=C3CCC2O)O1 Intermediate Fragment 
58 450.1044242721 [NH3+]C1=C2C(=NC=N1)N=CN2C1=C(O)C(C2=C3OC(=O)C4=C(CCC4O)C3=C(O)CC2=O)=CO1 Intermediate Fragment 
59 231.0287997441 O=C1C=CC2=C1C(=O)OC1=CC(=[OH+])CC(O)=C12
60 450.1044242721 [NH3+]C1=C2C(=NC=N1)N=CN2C1=C(O)C=C(OC2=CC3=C(C(O)=C2)C2=C(C(=O)O3)C(O)CC2)O1 Intermediate Fragment 
61 220.0829009801 [NH3+]C1=C2C(=NC=N1)N=CN2C1=C(O)CCO1
62 450.1044242721 [NH3+]C1=C2C(=NC=N1)N=CN2C1=C(O)C2=C(OC(C=C=O)=C2C2=CC3=C(C(O)CC3)C(O)O2)O1 Intermediate Fragment 
63 450.1044242721 [NH3+]C1=C2C(=NC=N1)N=CN2C1=C(O)C2=C(OC3=C2C=C(C2=C(C(=O)O)C(O)CC2)C(O)=C3)O1 Intermediate Fragment 
64 406.1145950321 [NH3+]C1=C2C(=NC=N1)N=CN2C1=C(O)C2=C(OC3=C2C=C(C2=CC(O)CC2)C(O)=C3)O1
65 450.1044242721 [NH3+]C1=C2C(=NC=N1)N=CN2C1=C(O)C2=C(OC3=C2C(OC=O)=C(C2=CC(O)CC2)C(O)=C3)O1 Intermediate Fragment 
66 422.1095096521 [NH3+]C1=C2C(=NC=N1)N=CN2C1=C(O)C2=C(OC3=C2C(O)=C(C2=CC(O)CC2)C(O)=C3)O1
67 450.1044242721 [NH3+]C1=C2C(=NC=N1)N=CN2C1=C(O)C2=C(OC3=C2C2=C(C(O)=C3)C(CCCO)=CC(=O)O2)O1 Intermediate Fragment 
68 422.1095096521 CCC1=CC(O)OC2=C1C(O)=CC1=C2C2=C(O1)OC(N1C=NC3=NC=NC([NH3+])=C31)=C2O
69 450.1044242721 CCC(O)C1=CC2=C(OC1=O)C1=C(C=C2O)OC2=C1C(O)=C(N1C=NC3=NC=NC([NH3+])=C31)O2 Intermediate Fragment 
70 450.1044242721 CC1=C(C(C)O)C(=O)OC2=C1C(O)=CC1=C2C2=C(O1)OC(N1C=NC3=NC=NC([NH3+])=C31)=C2O Intermediate Fragment 
71 450.1044242721 CCC1=C(CO)C(=O)OC2=C1C(O)=CC1=C2C2=C(O1)OC(N1C=NC3=NC=NC([NH3+])=C31)=C2O Intermediate Fragment 
72 452.1200743361 [NH3+]C1=C2C(=NC=N1)N=CN2C1=C(O)C2=C(OC3=C2C2=C(C(O)=C3)C3CCC(O)C3C(O)O2)O1
73 435.0935252401 OC1=C(N2C=NC3=NC=NC=C32)OC2=C1C1=C(C=C([OH2+])C3=C1OC(O)C1=C3CCC1O)O2
74 142.1087218041 [NH3+]C1N=CNC2NCNC12
75 434.1095096521 [NH3+]C1=C2C(=NC=N1)N=CN2C1=C(O)C2=C(OC3=C2C2=C(C=C3)C3=C(C(O)CC3)C(O)O2)O1
76 434.1095096521 [NH3+]C1=C2C(=NC=N1)N=CN2C1=C(O)C2=C(OC3=C2C2=C(C(O)=C3)C3=C(CO2)C(O)CC3)O1
77 434.1095096521 [NH3+]C1=C2C(=NC=N1)N=CN2C1=C(O)C2=C(OC3=C2C2=C(C(O)=C3)C3=C(CCC3)C(O)O2)O1
78 434.1095096521 [NH3+]C1=C2C(=NC=N1)N=CN2C1=CC2=C(O1)OC1=C2C2=C(C(O)=C1)C1=C(C(O)CC1)C(O)O2
79 452.1200743361 N=C=NC1=C(C#[NH+])N(C2=C(O)C3=C(OC4=C3C3=C(C(O)C4)C4CCC(O)C4C(O)O3)O2)C=N1 Intermediate Fragment 
80 435.0935252401 C=[NH+]C1=C(C#N)N(C2=C(O)C3=C(OC4=C3C3=C(C(O)=C4)C4=C(C(O)CC4)C(O)O3)O2)C=N1
81 425.1091753041 N=C=C1C(=[NH2+])N=CN1C1=C(O)C2=C(OC3=C2C2=C(C(O)=C3)C3CCC(O)C3C(O)O2)O1
82 408.0826262081 [NH+]#CC1=CN=CN1C1=C(O)C2=C(OC3=C2C2=C(C(O)=C3)C3=C(C(O)CC3)C(O)O2)O1
83 452.1200743361 [NH+]#CN=C=NC1=CN(C2=C(O)C3=C(OC4=C3C3=C(C(O)C4)C4CCC(O)C4C(O)O3)O2)C=N1 Intermediate Fragment 
84 452.1200743361 C=NC([NH3+])=C1C(=N)N=CN1C1=C(O)C2=C(OC3=C2C2=C(C(O)=C3)C3=C(C(O)CC3)C(O)O2)O1 Intermediate Fragment 
85 435.0935252401 C=[NH+]C(=N)C1=CN=CN1C1=C(O)C2=C(OC3=C2C2=C(C(O)=C3)C3=C(C(=O)O2)C(O)CC3)O1
86 452.1200743361 C=NC1=C(C(N)=[NH2+])N(C2=C(O)C3=C(OC4=C3C3=C(C(O)=C4)C4=C(C(O)CC4)C(O)O3)O2)C=N1 Intermediate Fragment 
87 410.0982762721 C=[NH+]C1=CN(C2=C(O)C3=C(OC4=C3C3=C(C(O)=C4)C4=C(C(O)CC4)C(O)O3)O2)C=N1
88 452.1200743361 C=NC1=NC=NC([NH3+])=C1N=C1OC2OC3=C(C4=C(C(O)=C3)C3=C(C(O)CC3)C(O)O4)C2=C1O Intermediate Fragment 
89 425.1091753041 [NH3+]C1=C(N=C2OC3OC4=C(C5=C(C(O)=C4)C4=C(C(O)CC4)C(O)O5)C3=C2O)C=NC=N1
90 421.0778751761 [NH3+]C1=C(N=C2OC3OC4=C(C5=C(C(O)=C4)C4=C(C(=O)CC4)C(=O)O5)C3=C2O)C=NC=N1
91 452.1200743361 [NH3+]C1=CC(N=C=NC2=C(O)C3=C(OC4=C3C3=C(C(O)=C4)C4CCC(O)C4C(O)O3)O2)=NC=N1 Intermediate Fragment 
92 129.1134728361 CNC1CC([NH3+])N=CN1
93 342.0608281441 C=[NH+]C1=C(O)C2=C(OC3=C2C2=C(C(O)=C3)C3=C(C(=O)O2)C(O)CC3)O1
94 452.1200743361 N=CN(C1=C([NH3+])N=CN=C1)C1=C(O)C2=C(OC3=C2C2=C(C(O)=C3)C3=C(C(O)CC3)C(O)O2)O1 Intermediate Fragment 
95 452.1200743361 CN(C1=C(O)C2=C(OC3=C2C2=C(C(O)=C3)C3=C(C(=O)O2)C(O)CC3)O1)C1=C([NH3+])N=CN=C1N Intermediate Fragment 
96 435.0935252401 CN(C1=C([NH3+])N=CN=C1)C1=C(O)C2=C(OC3=C2C2=C(C(O)=C3)C3=C(C(=O)CC3)C(=O)O2)O1
97 452.1200743361 [NH3+]C1=C2C(=NC=N1)N=CN2COC1OC2=C(C1=CO)C1=C(C(O)=C2)C2=C(C(=O)O1)C(O)CC2 Intermediate Fragment 
98 156.1243718681 CN1CNC2NC=NC([NH3+])C21
99 452.1200743361 [NH3+]C1=C2C(=NC=N1)N=CN2C=C(O)C1=C(O)OC2=C1C1=C(C(O)=C2)C2=C(C(O)CC2)C(O)O1 Intermediate Fragment 
100 303.0499291121 O=C1OC2=C(C(O)=CC3=C2C(=CO)C(=[OH+])O3)C2=C1C(O)CC2
101 434.1095096521 [NH3+]C1=C2C(=NC=N1)N=CN2C=C(O)C1=COC2=C1C1=C(C(O)=C2)C2=C(C(=O)O1)C(O)CC2
102 452.1200743361 [NH3+]C1=C2C(=NC=N1)N=CN2C(O)=C(O)C1=COC2=C1C1=C(C(O)=C2)C2=C(C(O)CC2)C(O)O1 Intermediate Fragment 
103 452.1200743361 [NH3+]C1=C2C(=NC=N1)N=CN2C(=CO)OC1=CC2=C(C=C(O)C3=C2OC(O)C2=C3CCC2O)O1 Intermediate Fragment 
104 190.0359507881 NC1=C2C(=NC=N1)N=CN2C(=O)C#[O+]
105 255.0287997441 O=C1C=CC2=C1C(=O)OC1=C2C([OH2+])=CC2=C1C=CO2
106 259.0600998721 O=C1OC2=C(C([OH2+])=CC3=C2C=CO3)C2=C1C(O)CC2
107 271.0237143641 O=C1C=CC2=C1C(=O)OC1=C2C(=O)C=C2OC(=[OH+])CC21
108 273.0393644281 O=C1C=CC2=C1C(=O)OC1=C2C(=O)CC2OC(=[OH+])CC12
109 275.0550144921 O=C1CCC2=C1C(=O)OC1=C2C(=O)CC2OC(=[OH+])CC12
110 452.1200743361 [NH3+]C1=C2C(=NC=N1)N=CN2C1=C(O)C(C2=C3OC(O)C4=C(CCC4O)C3=C(O)CC2=O)=CO1 Intermediate Fragment 
111 222.0985510441 [NH3+]C1=C2C(=NC=N1)N=CN2C1OCCC1O
112 218.0672509161 [NH3+]C1=C2C(=NC=N1)N=CN2C1=C(O)C=CO1
113 233.0444498081 O=C1CCC2=C1C(=O)OC1=CC(=[OH+])CC(O)=C12
114 452.1200743361 [NH3+]C1=C2C(=NC=N1)N=CN2C1=C(O)C=C(OC2=CC3=C(C(O)=C2)C2=C(C(O)CC2)C(O)O3)O1 Intermediate Fragment 
115 452.1200743361 [NH3+]C1=C2C(=NC=N1)N=CN2C1=C(O)C(C2=CC=C(O)C3=C2OC(O)C2=C3CCC2O)=C(O)O1 Intermediate Fragment 
116 452.1200743361 CC1=C(C2=C(C=O)C3=C(C(O)CC3)C(O)O2)C2=C(O1)OC(N1C=NC3=NC=NC([NH3+])=C31)=C2O Intermediate Fragment 
117 452.1200743361 C=C(O)C1=C(C2=COC3=C2C(O)=C(N2C=NC4=NC=NC([NH3+])=C42)O3)OC(O)C2=C1CCC2O Intermediate Fragment 
118 452.1200743361 [NH3+]C1=C2C(=NC=N1)N=CN2C1=C(O)C2=C(OC(C=C(O)C3=COC(O)C4=C3CCC4O)=C2)O1 Intermediate Fragment 
119 452.1200743361 [NH3+]C1=C2C(=NC=N1)N=CN2C1=C(O)C2=C(OC(C=C=O)=C2C2=CC3CCC(O)C3C(O)O2)O1 Intermediate Fragment 
120 452.1200743361 [NH3+]C1=C2C(=NC=N1)N=CN2C1=C(O)C2=C(OC3=C2C(O)=C(C2=C(CO)C(O)CC2)C(O)=C3)O1 Intermediate Fragment 
121 424.1251597161 [NH3+]C1=C2C(=NC=N1)N=CN2C1=C(O)C2=C(OC3=C2C(O)=C(C2CCC(O)C2)C(O)=C3)O1
122 452.1200743361 [NH3+]C1=C2C(=NC=N1)N=CN2C1=C(O)C2=C(OC3=C2C=C(C2=C(C(O)O)C(O)CC2)C(O)=C3)O1 Intermediate Fragment 
123 452.1200743361 [NH3+]C1=C2C(=NC=N1)N=CN2C1=C(O)C2=C(OC3=C2C(OC(O)C2=CCCC2O)=CC(O)=C3)O1 Intermediate Fragment 
124 452.1200743361 [NH3+]C1=C2C(=NC=N1)N=CN2C1=C(O)C2=C(OC3=C2C(OCO)=C(C2=CC(O)CC2)C(O)=C3)O1 Intermediate Fragment 
125 452.1200743361 [NH3+]C1=C2C(=NC=N1)N=CN2C1=C(O)C2=C(OC3=C2C2=C(C(O)=C3)C(CCCO)=CC(O)O2)O1 Intermediate Fragment 
126 452.1200743361 CCC(O)C1=CC2=C(OC1O)C1=C(C=C2O)OC2=C1C(O)=C(N1C=NC3=NC=NC([NH3+])=C31)O2 Intermediate Fragment 
127 394.0782095241 [NH3+]C1=C2C(=NC=N1)N=CN2C1=C(O)C2=C(OC3=C2C2=C(C=CC(O)O2)C(O)=C3)O1
128 452.1200743361 CC1=C(C(C)O)C(O)OC2=C1C(O)=CC1=C2C2=C(O1)OC(N1C=NC3=NC=NC([NH3+])=C31)=C2O Intermediate Fragment 
129 408.0938595881 CC1=CC(O)OC2=C1C(O)=CC1=C2C2=C(O1)OC(N1C=NC3=NC=NC([NH3+])=C31)=C2O
130 452.1200743361 CCC1=C(CO)C(O)OC2=C1C(O)=CC1=C2C2=C(O1)OC(N1C=NC3=NC=NC([NH3+])=C31)=C2O Intermediate Fragment 
131 422.0731241441 [NH3+]C1=C2C(=NC=N1)N=CN2C1=C(O)C2=C(OC3=C2C2=C(C=C(CO)C(=O)O2)C(O)=C3)O1
132 454.1357244001 [NH3+]C1=C2C(=NC=N1)N=CN2C1=C(O)C2=C(OC3=C2C2=C(C(O)C3)C3CCC(O)C3C(O)O2)O1
133 456.1513744641 [NH3+]C1=C2C(=NC=N1)N=CN2C1=C(O)C2=C(OC3=C2C2OC(O)C4C(O)CCC4C2C(O)C3)O1
134 534.1255536401 [NH3+]C1=C2C(=NC=N1)N(C1=CC(O)=CO1)CN2C1=C(O)C2=C(OC3=C2C2=C(C(O)=C3)C3=C(C(O)CC3)C(O)O2)O1
135 536.1412037041 [NH3+]C1=C2C(=NC=N1)N(C1=CC(O)=CO1)CN2C1=C(O)C2=C(OC3=C2C2=C(C(O)=C3)C3CCC(O)C3C(O)O2)O1
136 538.1568537681 [NH3+]C1=C2C(=NC=N1)N(C1=CC(O)=CO1)CN2C1=C(O)C2=C(OC3=C2C2=C(C(O)C3)C3CCC(O)C3C(O)O2)O1
137 520.1462890841 [NH3+]C1=C2C(=NC=N1)N(C1=CC=CO1)CN2C1=C(O)C2=C(OC3=C2C2=C(C(O)=C3)C3CCC(O)C3C(O)O2)O1
138 548.1412037041 CC1=C(O)C=C(N2CN(C3=C(O)C4=C(OC5=C4C4=C(C(O)=C5)C5=C(C(O)CC5)C(O)O4)O3)C3=C([NH3+])N=CN=C32)O1
139 548.1412037041 CC(=O)C(O)=C=CN1CN(C2=C(O)C3=C(OC4=C3C3=C(C(O)=C4)C4=C(C(O)CC4)C(O)O3)O2)C2=C([NH3+])N=CN=C21 Intermediate Fragment 
140 548.1412037041 [NH3+]C1=C2C(=NC=N1)N(C1=CC=C(C=O)O1)CN2C1=C(O)C2=C(OC3=C2C2=C(C(O)=C3)C3CCC(O)C3C(O)O2)O1
141 244.0465154721 NC1=C2N=CN(C3=CC(O)=C(C#[O+])O3)C2=NC=N1
142 246.0621655361 [NH3+]C1=C2N=CN(C3=CC(O)=C(C=O)O3)C2=NC=N1
143 248.0778156001 [NH3+]C1=C2N=CN(C3=CC(O)=C(CO)O3)C2=NC=N1
144 250.0934656641 [NH3+]C1=C2N=CN(C3=CC(O)C(CO)O3)C2=NC=N1
145 252.1091157281 [NH3+]C1=C2N=CN(C3CC(O)C(CO)O3)C2=NC=N1
146 234.0985510441 [NH3+]C1=C2N=CN(C3=CCC(CO)O3)C2=NC=N1
147 252.1091157281 [NH3+]C1=C2N=CN(C=CC(O)C(O)CO)C2=NC=N1 Intermediate Fragment 
148 91.0389705041 OC=C([OH2+])CO
149 162.0774216761 C=CN1C=NC2=C([NH3+])N=CN=C21
150 190.0723362961 [NH3+]C1=C2N=CN(C#CCO)C2=NC=N1
151 192.0879863601 [NH3+]C1=C2N=CN(C=CCO)C2=NC=N1
152 194.1036364241 [NH3+]C1=C2N=CN(CCCO)C2=NC=N1
153 234.0985510441 [NH3+]C1=C2N=CN(C#CC(O)CCO)C2=NC=N1
154 252.1091157281 [NH3+]C1=C2N=CN(C(O)=CC(O)CCO)C2=NC=N1 Intermediate Fragment 
155 75.0440558841 OC=CC[OH2+]
156 73.0284058201 OC#CC[OH2+]
157 182.1036364241 CC(O)N1CNC2=C([NH3+])N=CN=C21
158 206.0672509161 [NH3+]C1=C2N=CN(C(O)=C=CO)C2=NC=N1
159 208.0829009801 [NH3+]C1=C2N=CN(C(O)=CCO)C2=NC=N1
160 252.1091157281 [NH3+]C1=C2N=CN(C(=CCO)OCCO)C2=NC=N1 Intermediate Fragment 
161 210.0985510441 [NH3+]C1=C2N=CN(C(O)CCO)C2=NC=N1
162 254.1247657921 [NH3+]C1=C2NCN(C3CC(O)C(CO)O3)C2=NC=N1
163 144.1243718681 [NH3+]C1NCNC2NCNC12
164 236.1142011081 CC1OC(N2C=NC3=C([NH3+])N=CN=C32)CC1O
165 236.1142011081 [NH3+]C1=C2N=CN(C3CCC(CO)O3)C2=NC=N1
166 254.1247657921 N=CN(C1=NC=NC([NH3+])=C1)C1CC(O)C(CO)O1 Intermediate Fragment 
167 237.0982166961 CN(C1=CC(O)=C(CO)O1)C1=NC=NC([NH3+])=C1
168 254.1247657921 C=NC1=C([NH3+])N=CN=C1NC1CC(O)C(CO)O1 Intermediate Fragment 
169 254.1247657921 [NH3+]C1=C2N=CN(CCC(O)C(O)CO)C2=NC=N1 Intermediate Fragment 
170 236.1142011081 [NH3+]C1=C2N=CN(C=CC(O)CCO)C2=NC=N1
171 254.1247657921 [NH3+]C1=C2N=CN(C(O)CC(O)CCO)C2=NC=N1 Intermediate Fragment 
172 256.1404158561 [NH3+]C1N=CN=C2C1NCN2C1CC(O)C(CO)O1
173 548.1412037041 [NH3+]C1=C2C(=NC=N1)N(C1=CC(O)=C(C=O)O1)CN2C1=C(O)C2=C(OC3=C2C2=C(C=C3)C3CCC(O)C3C(O)O2)O1
174 548.1412037041 [NH3+]C1=C2C(=NC=N1)N(C1=CC(O)=C(C=O)O1)CN2C1=C(O)C2=C(OC3=C2C2=C(C(O)=C3)C3CCC(O)C3CO2)O1
175 548.1412037041 [NH3+]C1=C2C(=NC=N1)N(C1=CC(O)=C(C=O)O1)CN2C1=CC2=C(O1)OC1=C2C2=C(C(O)=C1)C1CCC(O)C1C(O)O2
176 566.1517683881 N=C=NC1=C(C#[NH+])N(C2=C(O)C3=C(OC4=C3C3OC(O)C5C(O)CCC5C3C(O)C4)O2)CN1C1=CC(O)=C(C=O)O1 Intermediate Fragment 
177 566.1517683881 [NH+]#CN=C=NC1=CN(C2=C(O)C3=C(OC4=C3C3OC(O)C5C(O)CCC5C3C(O)C4)O2)CN1C1=CC(O)=C(C=O)O1 Intermediate Fragment 
178 566.1517683881 N=C=NC(=[NH2+])C1=CN(C2=CC(O)=C(C=O)O2)CN1C1=C(O)C2=C(OC3=C2C2=C(C(O)C3)C3CCC(O)C3C(O)O2)O1 Intermediate Fragment 
179 566.1517683881 C=NC([NH3+])=C1C(=N)N(C2=CC(O)=C(C=O)O2)CN1C1=C(O)C2=C(OC3=C2C2=C(C(O)=C3)C3CCC(O)C3C(O)O2)O1 Intermediate Fragment 
180 539.1408693561 N=C=C1C(=[NH2+])N(C2=CC(O)=C(C=O)O2)CN1C1=C(O)C2=C(OC3=C2C2=C(C(O)C3)C3CCC(O)C3C(O)O2)O1
181 566.1517683881 [NH3+]C1=CC(N(C=NC2=C(O)C3=C(OC4=C3C3=C(C(O)C4)C4CCC(O)C4C(O)O3)O2)C2=CC(O)=C(C=O)O2)=NC=N1 Intermediate Fragment 
182 566.1517683881 [NH3+]C1=C(N(C=NC2=CC(O)=C(C=O)O2)C2=C(O)C3=C(OC4=C3C3=C(C(O)C4)C4CCC(O)C4C(O)O3)O2)C=NC=N1 Intermediate Fragment 
183 566.1517683881 CN(C1=C(O)C2=C(OC3=C2C2=C(C(O)C3)C3CCC(O)C3C(O)O2)O1)C1=C([NH3+])N=CN=C1N=C1C=C(O)C(=C=O)O1 Intermediate Fragment 
184 566.1517683881 C=C(O)C(=C=O)OCN1CN(C2=C(O)C3=C(OC4=C3C3=C(C(O)=C4)C4CCC(O)C4C(O)O3)O2)C2=C([NH3+])N=CN=C21 Intermediate Fragment 
185 478.0993388921 [NH3+]C1=C2C(=NC=N1)N(CO)CN2C1=C(O)C2=C(OC3=C2C2=C(C(O)=C3)C3=C(C(=O)CC3)C(=O)O2)O1
186 87.0440558841 C=C(O)C=C[OH2+]
187 462.1044242721 CN1CN(C2=C(O)C3=C(OC4=C3C3=C(C(O)=C4)C4=C(C(=O)CC4)C(=O)O3)O2)C2=C([NH3+])N=CN=C21
188 566.1517683881 [NH3+]C1=C2C(=NC=N1)N(C=C=C(O)C(=O)C=O)CN2C1=C(O)C2=C(OC3=C2C2=C(C(O)C3)C3CCC(O)C3C(O)O2)O1 Intermediate Fragment 
189 474.1044242721 C#CN1CN(C2=C(O)C3=C(OC4=C3C3=C(C(O)=C4)C4=C(C(=O)O3)C(O)CC4)O2)C2=C([NH3+])N=CN=C21
190 476.1200743361 C#CN1CN(C2=C(O)C3=C(OC4=C3C3=C(C(O)=C4)C4=C(C(O)CC4)C(O)O3)O2)C2=C([NH3+])N=CN=C21
191 478.1357244001 C#CN1CN(C2=C(O)C3=C(OC4=C3C3=C(C(O)=C4)C4CCC(O)C4C(O)O3)O2)C2=C([NH3+])N=CN=C21
192 480.1513744641 C#CN1CN(C2=C(O)C3=C(OC4=C3C3=C(C(O)C4)C4CCC(O)C4C(O)O3)O2)C2=C([NH3+])N=CN=C21
193 506.1306390201 [NH3+]C1=C2C(=NC=N1)N(C#CC=O)CN2C1=C(O)C2=C(OC3=C2C2=C(C(O)=C3)C3CCC(O)C3C(O)O2)O1
194 508.1462890841 [NH3+]C1=C2C(=NC=N1)N(C#CC=O)CN2C1=C(O)C2=C(OC3=C2C2=C(C(O)C3)C3CCC(O)C3C(O)O2)O1
195 548.1412037041 [NH3+]C1=C2C(=NC=N1)N(C#CC(O)=C=C=O)CN2C1=C(O)C2=C(OC3=C2C2=C(C(O)C3)C3CCC(O)C3C(O)O2)O1
196 566.1517683881 [NH3+]C1=C2C(=NC=N1)N(C(O)=C=C(O)C#CO)CN2C1=C(O)C2=C(OC3=C2C2=C(C(O)C3)C3CCC(O)C3C(O)O2)O1 Intermediate Fragment 
197 89.0597059481 C=C(O)CC[OH2+]
198 476.0836888281 [NH3+]C1=C2C(=NC=N1)N(CO)CN2C1=C(O)C2=C(OC3=C2C2=C(C(O)=C3)C3=C(C(=O)C=C3)C(=O)O2)O1
199 480.1149889561 [NH3+]C1=C2C(=NC=N1)N(CO)CN2C1=C(O)C2=C(OC3=C2C2=C(C(O)=C3)C3=C(C(=O)O2)C(O)CC3)O1
200 482.1306390201 [NH3+]C1=C2C(=NC=N1)N(CO)CN2C1=C(O)C2=C(OC3=C2C2=C(C(O)=C3)C3=C(C(O)CC3)C(O)O2)O1
201 77.0597059481 OCCC[OH2+]
202 59.0491412641 CC=C[OH2+]
203 57.0334912001 C#CC[OH2+]
204 45.0334912001 C=C[OH2+]
205 492.1149889561 C=C(O)N1CN(C2=C(O)C3=C(OC4=C3C3=C(C(O)=C4)C4=C(C(=O)O3)C(O)CC4)O2)C2=C([NH3+])N=CN=C21
206 494.1306390201 C=C(O)N1CN(C2=C(O)C3=C(OC4=C3C3=C(C(O)=C4)C4=C(C(O)CC4)C(O)O3)O2)C2=C([NH3+])N=CN=C21
207 180.0879863601 CC(O)N1C=NC2=C([NH3+])N=CN=C21
208 496.1462890841 C=C(O)N1CN(C2=C(O)C3=C(OC4=C3C3=C(C(O)=C4)C4CCC(O)C4C(O)O3)O2)C2=C([NH3+])N=CN=C21
209 498.1619391481 C=C(O)N1CN(C2=C(O)C3=C(OC4=C3C3=C(C(O)C4)C4CCC(O)C4C(O)O3)O2)C2=C([NH3+])N=CN=C21
210 520.1099035761 [NH3+]C1=C2C(=NC=N1)N(C(O)=C=C=O)CN2C1=C(O)C2=C(OC3=C2C2=C(C(O)=C3)C3=C(C(O)CC3)C(O)O2)O1
211 522.1255536401 [NH3+]C1=C2C(=NC=N1)N(C(O)=C=C=O)CN2C1=C(O)C2=C(OC3=C2C2=C(C(O)=C3)C3CCC(O)C3C(O)O2)O1
212 524.1412037041 [NH3+]C1=C2C(=NC=N1)N(C(O)=C=C=O)CN2C1=C(O)C2=C(OC3=C2C2=C(C(O)C3)C3CCC(O)C3C(O)O2)O1
213 566.1517683881 [NH3+]C1=C2C(=NC=N1)N(C(=C=C=O)OC#CO)CN2C1=C(O)C2=C(OC3=C2C2OC(O)C4C(O)CCC4C2C(O)C3)O1 Intermediate Fragment 
214 522.1255536401 [NH3+]C1=C2C(=NC=N1)N(COC#CO)CN2C1=C(O)C2=C(OC3=C2C2=C(C(O)=C3)C3=C(C(O)CC3)C(O)O2)O1
215 538.1568537681 C=C(OC#CO)N1CN(C2=C(O)C3=C(OC4=C3C3=C(C(O)C4)C4CCC(O)C4C(O)O3)O2)C2=C([NH3+])N=CN=C21
216 43.0178411361 C#C[OH2+]
217 510.1619391481 [NH3+]C1=C2C(=NC=N1)N(C#CC=O)CN2C1=C(O)C2=C(OC3=C2C2OC(O)C4C(O)CCC4C2C(O)C3)O1
218 504.1149889561 [NH3+]C1=C2C(=NC=N1)N(C#CC=O)CN2C1=C(O)C2=C(OC3=C2C2=C(C(O)=C3)C3=C(C(O)CC3)C(O)O2)O1
219 566.1517683881 C=C(OC(=C=O)C=O)N1CN(C2=C(O)C3=C(OC4=C3C3=C(C(O)C4)C4CCC(O)C4C(O)O3)O2)C2=C([NH3+])N=CN=C21 Intermediate Fragment 
220 566.1517683881 [NH3+]C1=C2C(=NC=N1)N(C1=CC(O)=C(C=O)O1)CN2COC1OC2=C(C1=CO)C1=C(C(O)=C2)C2=C(C(O)CC2)C(O)O1 Intermediate Fragment 
221 266.1247657921 CN1CN(C2=CC(O)C(CO)O2)C2=NC=NC([NH3+])=C21
222 264.1091157281 CN1CN(C2=CC(O)C(=CO)O2)C2=NC=NC([NH3+])=C21
223 566.1517683881 [NH3+]C1=C2C(=NC=N1)N(C1=CC(O)=C(C=O)O1)CN2C=C(O)C1=C(O)OC2=C1C1=C(C(O)=C2)C2CCC(O)C2C(O)O1 Intermediate Fragment 
224 566.1517683881 [NH3+]C1=C2C(=NC=N1)N(C1=CC(O)=C(C=O)O1)CN2C(O)=C(O)C1=COC2=C1C1=C(C(O)=C2)C2CCC(O)C2C(O)O1 Intermediate Fragment 
225 282.1196804121 [NH3+]C1=C2C(=NC=N1)N(C1=CC(O)C(CO)O1)CN2CO
226 257.0444498081 O=C1CCC2=C1C(=O)OC1=C2C([OH2+])=CC2=C1C=CO2
227 566.1517683881 [NH3+]C1=C2C(=NC=N1)N(C1=CC(O)=C(C=O)O1)CN2C(=CO)OC1=CC2=C(C=C(O)C3=C2OC(O)C2C(O)CCC32)O1 Intermediate Fragment 
228 566.1517683881 [NH3+]C1=C2C(=NC=N1)N(C1=CC(O)=C(C=O)O1)CN2C1=C(O)C(C2=C3OC(O)C4C(O)CCC4C3=C(O)CC2=O)=CO1 Intermediate Fragment 
229 548.1412037041 [NH3+]C1=C2C(=NC=N1)N(C1=CC(O)=C(C=O)O1)CN2C1=C(O)C(C2=CC=C(O)C3=C2OC(O)C2=C3CCC2O)=CO1
230 336.1302450961 [NH3+]C1=C2C(=NC=N1)N(C1=CC(O)=C(CO)O1)CN2C1OCCC1O
231 334.1145950321 [NH3+]C1=C2C(=NC=N1)N(C1=CC(O)=C(C=O)O1)CN2C1OCCC1O
232 566.1517683881 [NH3+]C1=C2C(=NC=N1)N(C1=CC(O)=C(C=O)O1)CN2C1=C(O)C=C(OC2=CC3=C(C(O)=C2)C2CCC(O)C2C(O)O3)O1 Intermediate Fragment 
233 566.1517683881 CC1=C(C2=C(C=O)C3CCC(O)C3C(O)O2)C2=C(O1)OC(N1CN(C3=CC(O)=C(C=O)O3)C3=NC=NC([NH3+])=C31)=C2O Intermediate Fragment 
234 538.1568537681 CC1=C(C2=CC3CCC(O)C3C(O)O2)C2=C(O1)OC(N1CN(C3=CC(O)=C(C=O)O3)C3=NC=NC([NH3+])=C31)=C2O
235 566.1517683881 [NH3+]C1=C2C(=NC=N1)N(C1=CC(O)=C(C=O)O1)CN2C1=C(O)C2=C(OC(C=C(O)C3=COC(O)C4C(O)CCC34)=C2)O1 Intermediate Fragment 
236 566.1517683881 [NH3+]C1=C2C(=NC=N1)N(C1=CC(O)=C(C=O)O1)CN2C1=C(O)C2=C(OC(C=CO)=C2C2=CC3CCC(O)C3C(O)O2)O1 Intermediate Fragment 
237 566.1517683881 [NH3+]C1=C2C(=NC=N1)N(C1=CC(O)=C(C=O)O1)CN2C1=C(O)C2=C(OC3=C2C(O)=C(C2CCC(O)C2CO)C(O)=C3)O1 Intermediate Fragment 
238 566.1517683881 [NH3+]C1=C2C(=NC=N1)N(C1=CC(O)=C(C=O)O1)CN2C1=C(O)C2=C(OC3=C2C(OC(O)C2CCCC2O)=CC(O)=C3)O1 Intermediate Fragment 
239 566.1517683881 [NH3+]C1=C2C(=NC=N1)N(C1=CC(O)=C(C=O)O1)CN2C1=C(O)C2=C(OC3=C2C(OCO)=C(C2CCC(O)C2)C(O)=C3)O1 Intermediate Fragment 
240 538.1568537681 [NH3+]C1=C2C(=NC=N1)N(C1=CC(O)=C(C=O)O1)CN2C1=C(O)C2=C(OC3=C2C(O)=C(C2CCC(O)C2)C(O)C3)O1
241 522.1619391481 [NH3+]C1=C2C(=NC=N1)N(C1=CC(O)=C(C=O)O1)CN2C1=C(O)C2=C(OC3=C2C=C(C2CCC(O)C2)C(O)C3)O1
242 408.1302450961 [NH3+]C1=C2C(=NC=N1)N=CN2C1=C(O)C2=C(OC3=C2C=C(C2CCC(O)C2)C(O)=C3)O1
243 566.1517683881 [NH3+]C1=C2C(=NC=N1)N(C1=CC(O)=C(C=O)O1)CN2C1=C(O)C2=C(OC3=C2C2=C(C(O)=C3)C(CCCO)CC(O)O2)O1 Intermediate Fragment 
244 566.1517683881 CCC(O)C1CC2=C(OC1O)C1=C(C=C2O)OC2=C1C(O)=C(N1CN(C3=CC(O)=C(C=O)O3)C3=NC=NC([NH3+])=C31)O2 Intermediate Fragment 
245 566.1517683881 CC(O)C1C(O)OC2=C(C(O)=CC3=C2C2=C(O3)OC(N3CN(C4=CC(O)=C(C=O)O4)C4=NC=NC([NH3+])=C43)=C2O)C1C Intermediate Fragment 
246 566.1517683881 CCC1C2=C(OC(O)C1CO)C1=C(C=C2O)OC2=C1C(O)=C(N1CN(C3=CC(O)=C(C=O)O3)C3=NC=NC([NH3+])=C31)O2 Intermediate Fragment 
