#In-silico ESI-MS/MS [M+H]+ Spectra
#PREDICTED BY CFM-ID 4.0.8
#SMILES=[C@H]1(C[C@@H](O[C@@H]1CO)n1cc(c(=O)nc1OCCCCO)C)O
#InChiKey=HOWSAPIWONOTGW-IJLUTSLNSA-N
energy0
55.05423 23.20 148 (4.9617)
57.03349 10.84 125 (2.318)
73.06479 10.23 10 218 (2.1875 0.00044899)
99.04406 21.17 112 124 6 67 (1.7319 1.4411 1.3543 0.00029071)
117.05462 10.65 110 122 113 132 128 120 (0.97812 0.96222 0.12078 0.11708 0.078015 0.022449)
125.03455 98.97 31 (21.165)
127.05020 82.12 32 (17.562)
181.09715 23.58 48 21 (4.9091 0.13343)
199.10772 100.00 4 50 71 86 88 97 91 (19.701 0.66667 0.29877 0.27989 0.16263 0.15233 0.12477)
energy1
41.03858 4.13 149 (1.5404)
43.05423 17.40 146 (6.4886)
45.03349 3.55 117 (1.3238)
53.03858 9.33 150 (3.4783)
55.05423 100.00 148 (37.29)
71.04914 9.42 28 216 (3.393 0.11895)
73.06479 15.32 10 218 (5.4599 0.254)
99.04406 7.23 6 124 112 67 (1.1807 0.99225 0.51982 0.0036134)
101.05971 4.98 7 137 134 66 (0.72098 0.71611 0.20986 0.20839)
125.03455 6.75 31 (2.5172)
127.05020 10.64 32 (3.9663)
167.08150 4.25 45 (1.5835)
181.09715 8.96 48 21 (3.14 0.19966)
183.07642 3.75 49 201 (1.3889 0.0084653)
199.10772 11.73 4 50 97 71 91 88 86 (3.973 0.11928 0.074422 0.071754 0.053359 0.04786 0.03421)
energy2
43.01784 5.26 121 (1.0891)
43.05423 7.79 146 (1.613)
45.03349 9.24 117 (1.9115)
55.01784 4.74 94 (0.98033)
55.05423 100.00 148 (20.695)
57.03349 9.59 125 (1.9849)
57.06988 39.86 147 (8.2488)
59.04914 8.96 36 (1.8546)
71.04914 3.72 216 28 (0.62617 0.14381)
73.06479 27.85 10 218 (5.6124 0.15194)
84.04439 5.29 62 73 (0.88263 0.21266)
99.04406 6.41 6 112 67 124 (0.60314 0.55252 0.11359 0.057203)
101.05971 10.97 7 134 137 66 (0.78477 0.72957 0.42487 0.33194)
109.03964 10.37 24 (2.1465)
125.03455 8.77 31 (1.8158)
127.05020 15.21 32 (3.1475)
131.08150 6.38 34 87 (1.1747 0.14485)
139.05020 7.32 37 176 (0.90507 0.61066)
153.06585 15.52 42 184 (2.0888 1.1224)
169.06077 3.44 209 89 (0.69993 0.011585)
181.09715 16.66 48 21 (3.1241 0.32343)
183.07642 13.35 49 201 (2.2392 0.52318)
199.10772 18.86 50 4 71 91 88 86 97 (1.3208 1.1033 0.74458 0.34385 0.17262 0.16806 0.049408)
225.12337 13.44 172 (2.7821)
229.11828 14.08 179 143 (2.7335 0.18075)
239.13902 3.49 199 (0.72131)

0 315.1550628761 Cc1cn(C2CC(O)C(C[OH2+])O2)c(OCCCCO)nc1=O
1 283.1288481281 CC1=CN(C2C=C(O)CO2)C(OCCCCO)=NC1=[OH+]
2 297.1444981921 C=C1OC(N2C=C(C)C(=[OH+])NC2OCCCCO)C=C1O
3 201.1233688241 CC1=C([OH2+])NC(OCCCCO)N=C1
4 199.1077187601 CC1=C([OH2+])N=C(OCCCCO)N=C1
5 197.0920686961 CC1=C([OH2+])N=C(OC=CCCO)N=C1
6 99.0440558841 C=C1OC=CC1[OH2+]
7 101.0597059481 CC1OC=CC1[OH2+]
8 209.0920686961 C=C1OC(N2C=C(C)C(=[OH+])NC2)C=C1O
9 75.0804413921 CCCC[OH2+]
10 73.0647913281 C=CCC[OH2+]
11 225.0869833161 C=C1OC(N2C=C(C)C(=[OH+])NC2O)C=C1O
12 227.1026333801 C=C1OC(N2C=C(C)C([OH2+])NC2O)C=C1O
13 279.1339335081 C=C1OC(N2C=C(C)C(=[OH+])N=C2OCCCC)C=C1O
14 297.1444981921 CC(=O)C(O)=C=CN1C=C(C)C(=[OH+])NC1OCCCCO Intermediate Fragment 
15 205.1546689521 CC1CNC(OCCCCO)NC1[OH2+]
16 91.0753560121 OCCCC[OH2+]
17 115.0865893921 CC1C=NCNC1[OH2+]
18 61.0647913281 CCC[OH2+]
19 203.1390188881 CC1C=NC(OCCCCO)NC1[OH2+]
20 201.1233688241 CC(=C=N)C(=[OH+])NCOCCCCO Intermediate Fragment 
21 181.0971540761 CC1=CN=C([OH+]C=CCCO)N=C1
22 89.0597059481 OCCCC=[OH+]
23 87.0440558841 OCCC=C=[OH+]
24 109.0396392001 [CH2+]C1=C(O)N=CN=C1
25 111.0552892641 CC1=C([OH2+])N=CN=C1
26 113.0709393281 CC1=C([OH2+])NCN=C1
27 117.1022394561 CC1CNCNC1[OH2+]
28 71.0491412641 C#CCC[OH2+]
29 69.0334912001 C#CC=C[OH2+]
30 67.0178411361 C#CC#C[OH2+]
31 125.0345538201 [CH2+]C1=C(O)N=C(O)N=C1
32 127.0502038841 CC1=C([OH2+])N=C(O)N=C1
33 129.0658539481 CC1=C([OH2+])NC(O)N=C1
34 131.0815040121 CC1C=NC(O)NC1[OH2+]
35 133.0971540761 CC1CNC(O)NC1[OH2+]
36 59.0491412641 C=CC[OH2+]
37 139.0502038841 C=[O+]C1=NC(O)=C(C)C=N1
38 141.0658539481 COC1=NC([OH2+])=C(C)C=N1
39 143.0815040121 COC1N=CC(C)=C([OH2+])N1
40 145.0971540761 COC1N=CC(C)C([OH2+])N1
41 147.1128041401 COC1NCC(C)C([OH2+])N1
42 153.0658539481 C=COC1=NC([OH2+])=C(C)C=N1
43 155.0815040121 CCOC1=NC([OH2+])=C(C)C=N1
44 157.0971540761 CCOC1N=CC(C)=C([OH2+])N1
45 167.0815040121 CC=COC1=NC([OH2+])=C(C)C=N1
46 169.0971540761 CCCOC1=NC([OH2+])=C(C)C=N1
47 171.1128041401 CCCOC1N=CC(C)=C([OH2+])N1
48 181.0971540761 CCC=COC1=NC([OH2+])=C(C)C=N1
49 183.0764186321 OCCC=COC1=NC([OH2+])=CC=N1
50 199.1077187601 CC(=C=N)C(=[OH+])N=COCCCCO Intermediate Fragment 
51 182.0811696641 C=C(C)C(=O)[NH+]=COC#CCCO
52 172.0968197281 CC=C(O)[NH+]=COC=CCCO
53 144.0655196001 O=C=[NH+]COC=CCCO
54 142.0498695361 O=C=[NH+]COC#CCCO
55 140.0342194721 O=C=[NH+]COC#CC=CO
56 56.0494756121 CCC#[NH+]
57 118.0862550441 [NH2+]=COCCCCO
58 116.0706049801 [NH+]#COCCCCO
59 110.0236547881 [NH+]#COC#CC=CO
60 80.0130901041 [CH2+]C(=C=O)C#N
61 82.0287401681 CC(=C=O)C#[NH+]
62 84.0443902321 CC(C#[NH+])=CO
63 86.0600402961 CC(C#[NH+])CO
64 90.0913404241 CC(C[NH3+])CO
65 103.0753560121 C[OH+]C=CCCO
66 101.0597059481 C[OH+]C#CCCO
67 99.0440558841 C[OH+]C#CC=CO
68 97.0396392001 C=C(C#[NH+])C(N)=O
69 99.0552892641 CC(C#[NH+])C(N)=O
70 101.0709393281 CC(C#[NH+])C(N)O
71 199.1077187601 CC(=C=NCOC=CCCO)C(N)=[OH+] Intermediate Fragment 
72 86.0600402961 C=C(C)C([NH3+])=O
73 84.0443902321 [CH+]=C(C)C(N)=O
74 112.0393048521 [NH3+]COC#CC#CO
75 114.0549549161 [NH3+]COC#CC=CO
76 72.0443902321 C=CC([NH3+])=O
77 124.0393048521 C=[NH+]COC#CC#CO
78 126.0549549161 C=[NH+]COC#CC=CO
79 128.0706049801 C=[NH+]COC#CCCO
80 152.0706049801 CC=C=[NH+]COC#CC=CO
81 154.0862550441 CC=C=[NH+]COC#CCCO
82 156.1019051081 CC=C=[NH+]COC=CCCO
83 182.0811696641 CC(=C=[NH+]COC#CCCO)C=O
84 95.0239891361 [CH+]=C(C#N)C(N)=O
85 197.0920686961 CC(=C=[NH+]COC#CCCO)C(N)=O
86 199.1077187601 CC(=C=NC(=N)OCCCCO)C=[OH+] Intermediate Fragment 
87 131.0815040121 N=C([NH3+])OC=CCCO
88 199.1077187601 CC=C=NC(N=C=[OH+])OCCCCO Intermediate Fragment 
89 169.0607685681 C=[NH+]C(N=C=O)OC#CCCO
90 171.1128041401 CC=C=[NH+]C(=N)OCCCCO
91 199.1077187601 C=NC(=NC([OH2+])=CC)OC=CCCO Intermediate Fragment 
92 145.0971540761 C=[NH+]C(=N)OCCCCO
93 143.0815040121 C=[NH+]C(=N)OC=CCCO
94 55.0178411361 C=C=C=[OH+]
95 168.0655196001 CC=C(O)[NH+]=COC#CC=CO
96 170.0811696641 CC=C(O)[NH+]=COC#CCCO
97 199.1077187601 C=C(C)C(=[OH+])N=C(N)OC=CCCO Intermediate Fragment 
98 151.0502038841 C#COC1=NC([OH2+])=C(C)C=N1
99 179.0815040121 CCC#COC1=NC([OH2+])=C(C)C=N1
100 197.0920686961 CC(=C=N)C(=[OH+])N=COC=CCCO Intermediate Fragment 
101 197.0920686961 CC(=C=NC(=N)OC=CCCO)C=[OH+] Intermediate Fragment 
102 111.0076703761 O=C1C=COC1=C=[OH+]
103 113.0233204401 OC1C=COC1=C=[OH+]
104 85.0284058201 [OH+]=C1C=COC1
105 113.0233204401 C=C=C(O)C(=O)C=[OH+] Intermediate Fragment 
106 115.0389705041 OC1C=COC1=C[OH2+]
107 87.0440558841 [OH2+]C1C=COC1
108 115.0389705041 C=C=C(O)C(=O)C[OH2+] Intermediate Fragment 
109 115.0389705041 O=C=C=C(O)CC[OH2+] Intermediate Fragment 
110 117.0546205681 OC1C=COC1C[OH2+]
111 89.0597059481 [OH2+]C1CCOC1
112 99.0440558841 [OH2+]C=C1C=CCO1
113 117.0546205681 C=COC(=C[OH2+])CO Intermediate Fragment 
114 91.0389705041 OCC(=[OH+])CO
115 75.0440558841 OCC=C[OH2+]
116 73.0284058201 OCC#C[OH2+]
117 45.0334912001 C=C[OH2+]
118 47.0491412641 CC[OH2+]
119 89.0597059481 C=C[OH+]CCO
120 117.0546205681 C=C(O)C(=C[OH2+])OC Intermediate Fragment 
121 43.0178411361 C#C[OH2+]
122 117.0546205681 C=C=C(O)C(O)C[OH2+] Intermediate Fragment 
123 29.0385765801 C=[CH3+]
124 99.0440558841 C=C=C(O)C=C[OH2+]
125 57.0334912001 CC#C[OH2+]
126 59.0127557561 OC=C=[OH+]
127 61.0284058201 OCC=[OH+]
128 117.0546205681 OC=C=C(O)CC[OH2+] Intermediate Fragment 
129 87.0440558841 C=C(O)C=C[OH2+]
130 89.0597059481 C=C(O)CC[OH2+]
131 71.0127557561 OC#CC=[OH+]
132 117.0546205681 OC=C=COCC[OH2+] Intermediate Fragment 
133 119.0702706321 OC1CCOC1C[OH2+]
134 101.0597059481 [OH2+]CC1C=CCO1
135 119.0702706321 CC=C(O)C(O)C[OH2+] Intermediate Fragment 
136 119.0702706321 OCC=C(O)CC[OH2+] Intermediate Fragment 
137 101.0597059481 C=C=C(O)CC[OH2+]
138 297.1444981921 CC1=CN(C2C=C(O)C(=C=[OH+])O2)C(OCCCCO)NC1
139 225.0869833161 CC1=CN(C2C=C(O)C(=C=[OH+])O2)CNC1O
140 225.0869833161 CC1=CN(C=C=C(O)C(=O)C=[OH+])CNC1O Intermediate Fragment 
141 227.1026333801 CC1CN(C2C=C(O)C(=C=[OH+])O2)CNC1O
142 227.1026333801 CC1CN(C(O)=C=C(O)C#C[OH2+])CNC1O Intermediate Fragment 
143 229.1182834441 CC1CN(C2C=C(O)C(=C[OH2+])O2)CNC1O
144 231.1339335081 CC1CN(C2C=C(O)C(C[OH2+])O2)CNC1O
145 233.1495835721 CC1CN(C2CC(O)C(C[OH2+])O2)CNC1O
146 43.0542266441 CC=[CH3+]
147 57.0698767081 CCC=[CH3+]
148 55.0542266441 [CH2+]#CCC
149 41.0385765801 [CH2+]#CC
150 53.0385765801 C=CC#[CH2+]
151 39.0229265161 [C+]#CC
152 241.0818979361 CC1=CN(C2C=C(O)C(=C=[OH+])O2)C(O)NC1O
153 243.0975480001 CC1CN(C2C=C(O)C(=C=[OH+])O2)C(O)NC1O
154 243.0975480001 CC1CN(C(O)=C=C(O)C#C[OH2+])C(O)NC1O Intermediate Fragment 
155 247.1288481281 CC1CN(C2C=C(O)C(C[OH2+])O2)C(O)NC1O
156 249.1444981921 CC1CN(C2CC(O)C(C[OH2+])O2)C(O)NC1O
157 255.0975480001 COC1NC(O)C(C)=CN1C1C=C(O)C(=C=[OH+])O1
158 261.1444981921 COC1NC(O)C(C)CN1C1C=C(O)C(C[OH2+])O1
159 263.1601482561 COC1NC(O)C(C)CN1C1CC(O)C(C[OH2+])O1
160 283.1288481281 CCCOC1NC(O)C(C)=CN1C1C=C(O)C(=C=[OH+])O1
161 287.1601482561 CCCOC1NC(O)C(C)CN1C1C=C(O)C(=C[OH2+])O1
162 297.1444981921 CCCCOC1NC(O)C(C)=CN1C1C=C(O)C(=C=[OH+])O1
163 299.1237627481 OCCCCOC1NC(O)C=CN1C1C=C(O)C(=C=[OH+])O1
164 297.1444981921 CC1=CN(C2C=CC(=C=[OH+])O2)C(OCCCCO)NC1O
165 267.1339335081 CC1=CN(C2C=CCO2)C(OCCCCO)=NC1=[OH+]
166 225.0869833161 CC1=CN(C2C=CC(=C=[OH+])O2)C(O)NC1O
167 279.1339335081 CCCCOC1NC(=O)C(C)=CN1C1C=CC(=C=[OH+])O1
168 297.1444981921 CC1=CN(C=C=CC(=O)C=[OH+])C(OCCCCO)NC1O Intermediate Fragment 
169 315.1550628761 C=C(OC(=C=[OH+])CO)N1C=C(C)C(O)NC1OCCCCO Intermediate Fragment 
170 241.1182834441 C=C([OH2+])N1C=C(C)C(=O)N=C1OCCCCO
171 243.1339335081 C=C([OH2+])N1C=C(C)C(=O)NC1OCCCCO
172 225.1233688241 C#CN1C=C(C)C(=[OH+])NC1OCCCCO
173 315.1550628761 C=C(O)C(=C=[OH+])OCN1C=C(C)C(O)NC1OCCCCO Intermediate Fragment 
174 209.0920686961 CC1=CN(C)C(OC#CCCO)=NC1=[OH+]
175 211.1077187601 CC1=CN(C)C(OC=CCCO)=NC1=[OH+]
176 139.0502038841 [CH2+]N1C=C(C)C(=O)N=C1O
177 213.1233688241 CC1=CN(C)C(OCCCCO)=NC1=[OH+]
178 227.1026333801 CC1=CN(C=[OH+])C(OCCCCO)=NC1=O
179 229.1182834441 CC1=CN(C=[OH+])C(OCCCCO)NC1=O
180 315.1550628761 CC1CN(C=C=C(O)C(=O)C=[OH+])C(OCCCCO)NC1O Intermediate Fragment 
181 231.1703190161 C=CN1CC(C)C([OH2+])NC1OCCCCO
182 229.1546689521 C#CN1CC(C)C([OH2+])NC1OCCCCO
183 227.1390188881 C#CN1C=C(C)C([OH2+])NC1OCCCCO
184 153.0658539481 C#CN1C=C(C)C(=[OH+])NC1O
185 227.1390188881 C#CN(C=C(C)C(N)=[OH+])COCCCCO Intermediate Fragment 
186 227.1390188881 C#CN(C=C(C)C=[OH+])C(N)OCCCCO Intermediate Fragment 
187 223.1077187601 C#CN1C=C(C)C(=[OH+])N=C1OCCCCO
188 89.0233204401 O=CC(=[OH+])CO
189 93.0546205681 OCC([OH2+])CO
190 75.0440558841 CC(=[OH+])CO
191 297.1444981921 CC1=CN(C=C=C(O)C#C[OH2+])C(OCCCCO)NC1O
192 77.0597059481 OCCC[OH2+]
193 279.1339335081 C#CC(O)=C=CN1C=C(C)C(=[OH+])NC1OCCCCO
194 227.1026333801 CC1CN(C=C=C(O)C#C[OH2+])C(O)NC1O
195 279.1339335081 CC1=CN(CC#CC#C[OH2+])C(OCCCCO)NC1=O
196 297.1444981921 CC(=CN=C=C=C(O)C#C[OH2+])C(O)NCOCCCCO Intermediate Fragment 
197 259.1652336361 CC1CN(CC#CO)C(OCCCCO)NC1[OH2+]
198 257.1495835721 CC1=CN(CC#CO)C(OCCCCO)NC1[OH2+]
199 239.1390188881 C#CCN1C=C(C)C(=[OH+])NC1OCCCCO
200 255.1339335081 CC1=CN(CC#CO)C(OCCCCO)NC1=[OH+]
201 183.0764186321 CC1=CN(CC#CO)C(O)NC1=[OH+]
202 237.1233688241 C#CCN1C=C(C)C(=[OH+])N=C1OCCCCO
203 253.1182834441 CC1=CN(CC#CO)C(OCCCCO)=NC1=[OH+]
204 315.1550628761 CC1CN(C(O)=C=C(O)C#C[OH2+])C(OCCCCO)NC1O Intermediate Fragment 
205 247.1652336361 C=C([OH2+])N1CC(C)C(O)NC1OCCCCO
206 245.1495835721 C=C([OH2+])N1C=C(C)C(O)NC1OCCCCO
207 239.1026333801 C=C([OH2+])N1C=C(C)C(=O)N=C1OC=CCCO
208 195.0764186321 CC1=C([OH2+])N=C(OC#CCCO)N=C1
209 169.0607685681 C=C([OH2+])N1C=C(C)C(=O)N=C1O
210 239.1026333801 C=C([OH2+])N=C=C(C)C(=O)N=COC=CCCO Intermediate Fragment 
211 68.9971056921 [O+]#CC#CO
212 231.1339335081 CC1=CN(C=[OH+])C(OCCCCO)NC1O
213 225.0869833161 CC1=CN(C=[OH+])C(OC=CCCO)=NC1=O
214 155.0451185041 CC1=CN(C=[OH+])C(O)=NC1=O
215 225.0869833161 CC(=CN=C=[OH+])C(=O)N=COC=CCCO Intermediate Fragment 
216 71.0491412641 C=CC(=C)[OH2+]
217 91.0753560121 CC(O)CC[OH2+]
218 73.0647913281 C=C([OH2+])CC
219 273.1444981921 CC1CN(C(=[OH+])C#CO)C(OCCCCO)NC1O
220 271.1288481281 CC1=CN(C(=[OH+])C#CO)C(OCCCCO)NC1O
221 269.1131980641 CC1=CN(C(=[OH+])C#CO)C(OCCCCO)NC1=O
222 315.1550628761 CC1CN(C(=C=CO)OC#C[OH2+])C(OCCCCO)NC1O Intermediate Fragment 
223 315.1550628761 CC=C(O)NC(OCCCCO)N(C)C1C=C(O)C(=C=[OH+])O1 Intermediate Fragment 
224 315.1550628761 CC=CN(C1C=C(O)C(=C=[OH+])O1)C(NCO)OCCCCO Intermediate Fragment 
225 287.1601482561 CCC[NH+](C(N)OCCCCO)C1C=C(O)C(=C=O)O1
226 174.1124697921 CCC[NH2+]C1C=C(O)C(CO)O1
227 172.0968197281 CCC[NH2+]C1C=C(O)C(=CO)O1
228 172.0968197281 CCC[NH2+]C(O)=C=C(O)C=CO Intermediate Fragment 
229 315.1550628761 CC(=CN(C(N)OCCCCO)C1C=C(O)C(=C=[OH+])O1)CO Intermediate Fragment 
230 247.1288481281 NC([NH2+]C1C=C(O)C(=CO)O1)OCCCCO
231 200.0917343481 CC(CO)C[NH2+]C1C=C(O)C(=C=O)O1
232 315.1550628761 CC(=CN(COCCCCO)C1C=C(O)C(=C=[OH+])O1)C(N)O Intermediate Fragment 
233 315.1550628761 CC(CN=C1C=C(O)C(=C=[OH+])O1)C(O)NCOCCCCO Intermediate Fragment 
234 313.1394128121 CC1=CN(C2C=C(O)C(=C=[OH+])O2)C(OCCCCO)NC1O
