#In-silico ESI-MS/MS [M+H]+ Spectra
#PREDICTED BY CFM-ID 4.0.8
#SMILES=n12c(nc3c(c1=O)ncn3[C@@H]1O[C@H](CO)[C@@H](C1)O)NCCC2
#InChiKey=HGYWFMCWAWUWRE-IWSPIJDZSA-N
energy0
192.08799 100.00 16 27 18 38 53 51 24 42 46 33 71 70 68 60 (92.107 2.2377 0.31715 0.048631 0.044293 0.031829 0.021475 0.015633 0.010446 0.0049995 0.0025934 0.0017379 0.0016993 0.0001732)
energy1
192.08799 100.00 16 53 27 24 38 46 68 33 70 51 18 60 71 42 (83.049 0.58344 0.54025 0.37903 0.21073 0.20986 0.20495 0.14142 0.14069 0.11323 0.081536 0.04919 0.036304 0.034825)
energy2
29.03858 2.26 142 (1.0017)
43.01784 2.28 152 (1.0098)
45.03349 5.37 126 (2.3787)
55.01784 3.35 154 (1.4848)
57.03349 17.70 11 (7.8333)
59.04914 4.68 156 (2.0709)
71.04914 2.53 164 165 (0.77444 0.34335)
150.04104 4.63 58 (2.0508)
150.06619 3.00 40 (1.3294)
165.07709 2.40 48 43 (0.93941 0.12195)
190.07234 3.53 15 50 67 59 69 45 32 (1.1013 0.34114 0.037906 0.022679 0.022529 0.021009 0.017282)
192.08799 100.00 46 16 53 60 51 27 33 68 18 42 24 70 38 71 (15.351 13.844 2.6412 2.3444 1.6163 1.38 1.3731 1.3393 1.0986 0.9958 0.95224 0.61551 0.50472 0.20485)
194.10364 2.37 73 (1.0481)
196.11929 8.55 74 75 (3.4715 0.31469)
216.08799 3.95 118 (1.7462)
218.10364 4.18 117 (1.8518)
232.11929 2.26 122 (1.0023)
238.12985 8.24 136 (3.6483)

0 308.1353304761 OCC1OC(n2cnc3c(=[OH+])n4c(nc32)NCCC4)CC1O
1 290.1247657921 OC1CC(N2C=NC3=C2N=C2NCCCN2C3)OC1=C=[OH+]
2 119.0702706321 OC1CCOC1C[OH2+]
3 101.0597059481 C=C1OCCC1[OH2+]
4 101.0597059481 [OH2+]C=C1CCCO1
5 119.0702706321 O=CCC(O)CC[OH2+] Intermediate Fragment 
6 117.0546205681 OC=CC(O)CC=[OH+]
7 99.0440558841 C=C1OCC=C1[OH2+]
8 99.0440558841 [OH+]=C=C1CCCO1
9 117.0546205681 CCC(O)C(=O)C=[OH+] Intermediate Fragment 
10 99.0440558841 CC=C(O)C#C[OH2+]
11 57.0334912001 CC#C[OH2+]
12 117.0546205681 OCCCOC#C[OH2+] Intermediate Fragment 
13 117.0546205681 CCOC(=C=[OH+])CO Intermediate Fragment 
14 115.0389705041 OC1CCOC1=C=[OH+]
15 190.0723362961 [OH+]=C1C2=C(N=C3N=CCCN13)NC=N2
16 192.0879863601 [OH+]=C1C2=C(N=C3NCCCN13)NC=N2
17 174.0774216761 C1=C[NH+]2CC3=C(N=C2N=C1)NC=N3
18 192.0879863601 N=C1N=CCCN1C(=[OH+])C1=CNC=N1 Intermediate Fragment 
19 124.0505382321 [NH2+]=C1N=CC=CN1C=O
20 98.0712736761 [NH3+]C1=NCCC=N1
21 96.0556236121 [NH3+]C1=NC=CC=N1
22 95.0239891361 [O+]#CC1=CNC=N1
23 97.0396392001 [OH+]=CC1=CNC=N1
24 192.0879863601 [OH+]=CN1CCC=NC1=NC1=CN=CN1 Intermediate Fragment 
25 164.0930717401 C1=NC=NC1=[NH+]C1=NCCCN1
26 162.0774216761 C1=NC=NC1=[NH+]C1=NCCC=N1
27 192.0879863601 [OH+]=C=C1N=CNC1=NC1=NCCCN1 Intermediate Fragment 
28 110.0348881681 [NH2+]=C1N=CN=C1C=O
29 108.0192381041 N=C1N=CN=C1C#[O+]
30 83.0603746441 C1=NC=[NH+]CC1
31 85.0760247081 C1=[NH+]CCCN1
32 190.0723362961 O=C=C1N=CNC1=[NH+]C1=NCCC=N1
33 192.0879863601 N=C1NC=NC1=C([OH2+])N1C=NC=CC1 Intermediate Fragment 
34 111.0552892641 [OH+]=CN1C=NC=CC1
35 82.0399735481 [NH2+]=C1C=NC=N1
36 81.0447245801 C1=C[NH+]=CN=C1
37 112.0505382321 [NH2+]=C1NCN=C1C=O
38 192.0879863601 N=C=NC1=CC(=[OH+])N2CCCNC2=N1 Intermediate Fragment 
39 175.0614372641 C=[NH+]C1=CC(=O)N2C=CC=NC2=N1
40 150.0661882961 [OH+]=C1C=CN=C2N=CCCN12
41 148.0505382321 [OH+]=C1C=CN=C2N=CC=CN12
42 192.0879863601 N=C=NC1=CN=C2NCCCN2C1=[OH+] Intermediate Fragment 
43 165.0770873281 [NH3+]C1=CN=C2N=CCCN2C1=O
44 175.0614372641 C=[NH+]C1=CN=C2N=CC=CN2C1=O
45 190.0723362961 N=C=[NH+]C1=CN=C2N=CCCN2C1=O
46 192.0879863601 C=NC1=C(N)N=C2N=CCCN2C1=[OH+] Intermediate Fragment 
47 163.0614372641 [NH3+]C1=CC(=O)N2C=CC=NC2=N1
48 165.0770873281 [NH3+]C1=CC(=O)N2CCC=NC2=N1
49 176.0566862321 N=C1N=C2N=CC=CN2C(=O)C1=[NH2+]
50 190.0723362961 C=[NH+]C1=C(N)N=C2N=CC=CN2C1=O
51 192.0879863601 C=NC1=C(N)C(=[OH+])N2CCC=NC2=N1 Intermediate Fragment 
52 163.0614372641 [NH3+]C1=CN=C2N=CC=CN2C1=O
53 192.0879863601 C=CCN1C(=[OH+])C2=C(N=C1N)NC=N2 Intermediate Fragment 
54 166.0723362961 CN1C(=O)C2=NC=NC2=NC1[NH3+]
55 164.0566862321 CN1C(=[NH2+])N=C2N=CN=C2C1=O
56 162.0410361681 [CH2+]N1C(=N)N=C2N=CN=C2C1=O
57 152.0566862321 [NH3+]C1=NC(=O)C2=NCNC2=N1
58 150.0410361681 [NH3+]C1=NC(=O)C2=NC=NC2=N1
59 190.0723362961 C#CCN1C(=O)C2=C(N=C1[NH3+])NC=N2
60 192.0879863601 C=NC1=NC2=C(N=CN2)C(=[OH+])N1CC Intermediate Fragment 
61 161.0457872001 C#CN1C=NC2=C(N=CN2)C1=[OH+]
62 176.0566862321 C#CN1C(=O)C2=C(N=C1[NH3+])NC=N2
63 176.0566862321 C#[N+]C1=NC2=C(N=CN2)C(=O)N1C
64 166.0723362961 C[NH2+]C1=NC(O)=C2N=CNC2=N1
65 164.0566862321 C=[NH+]C1=NC(O)=C2N=CNC2=N1
66 162.0410361681 C#[N+]C1=NC(O)=C2N=CNC2=N1
67 190.0723362961 C=CN1C(=O)C2=C(N=C1[NH+]=C)NC=N2
68 192.0879863601 CC=NC1=NC2=C(N=CN2)C(=[OH+])N1C Intermediate Fragment 
69 190.0723362961 C=C=[NH+]C1=NC2=C(N=CN2)C(=O)N1C
70 192.0879863601 CCC=NC1=NC([OH2+])=C2N=CNC2=N1 Intermediate Fragment 
71 192.0879863601 N=CCCN1C=NC2=C(N=CN2)C1=[OH+] Intermediate Fragment 
72 175.0614372641 C#CCN1C=NC2=C(N=CN2)C1=[OH+]
73 194.1036364241 [OH+]=C1C2=C(N=C3NCCCN13)NCN2
74 196.1192864881 [OH2+]C1C2=C(N=C3NCCCN31)NCN2
75 196.1192864881 N=C1NCCCN1C(=[OH+])C1=CNCN1 Intermediate Fragment 
76 198.1349365521 [OH2+]C1C2NCNC2N=C2NCCCN21
77 276.1091157281 OC1=COC(N2C=NC3=C2N=C2NCCCN2C3=[OH+])C1
78 276.1091157281 O=C=C(O)CCN1C=NC2=C1N=C1NCCCN1C2=[OH+] Intermediate Fragment 
79 278.1247657921 OC1COC(N2C=NC3=C2N=C2NCCCN2C3=[OH+])C1
80 260.1142011081 [OH+]=C1C2=C(N=C3NCCCN13)N(C1CC=CO1)C=N2
81 280.1404158561 OC1COC(N2CNC3=C2N=C2NCCCN2C3=[OH+])C1
82 290.1247657921 C=C1OC(N2C=NC3=C2N=C2NCCCN2C3=[OH+])CC1O
83 290.1247657921 CC(=O)C(O)=CCN1C=NC2=C1N=C1NCCCN1C2=[OH+] Intermediate Fragment 
84 290.1247657921 C=C(C=O)OC(C)N1C=NC2=C1N=C1NCCCN1C2=[OH+] Intermediate Fragment 
85 308.1353304761 N=C1NCCCN1C(=[OH+])C1=CN(C2CC(O)C(=CO)O2)C=N1 Intermediate Fragment 
86 291.1087813801 O=C=C1OC(N2C=NC(C(=[OH+])N3CCCNC3)=C2)C=C1O
87 209.0556831881 O=C=C1OC(N2C=NC(C=[OH+])=C2)CC1O
88 211.0713332521 OC=C1OC(N2C=NC(C=[OH+])=C2)CC1O
89 308.1353304761 OC=C1OC(N2C=NC=C2N=C2NCCCN2C=[OH+])CC1O Intermediate Fragment 
90 280.1404158561 OC=C1OC(N2CN=CC2=[NH+]C2=NCCCN2)CC1O
91 280.1404158561 O=C(CC(O)C=CO)N1CN=CC1=[NH+]C1=NCCCN1 Intermediate Fragment 
92 308.1353304761 OCC1OC(N2C=NC(=C=[OH+])C2=NC2=NCCCN2)CC1O Intermediate Fragment 
93 308.1353304761 N=C1C(=C([OH2+])N2CCCNC2)N=CN1C1CC(O)C(=C=O)O1 Intermediate Fragment 
94 198.0873176641 [NH2+]=C1C=NCN1C1CC(O)C(=CO)O1
95 224.0665822201 [NH2+]=C1C(=C=O)N=CN1C1CC(O)C(=CO)O1
96 308.1353304761 N=CN(C1=CC(=[OH+])N2CCCNC2=N1)C1CC(O)C(=CO)O1 Intermediate Fragment 
97 291.1087813801 C[NH+](C1=CC(=O)N2CCCNC2=N1)C1C=C(O)C(=C=O)O1
98 281.1244314441 O=C1C=C([NH+]=C2CC(O)C(CO)O2)N=C2NCCCN12
99 152.0818383601 [OH+]=C1C=CN=C2NCCCN12
100 134.0712736761 C1=C[NH+]2CC=CN=C2N=C1
101 159.0764186321 [NH+]#CNC1CC(O)C(CO)O1
102 142.0498695361 C=[NH+]C1CC(O)C(=C=O)O1
103 159.0764186321 [NH+]#CN=C(O)CC(O)CCO Intermediate Fragment 
104 161.0920686961 [NH2+]=CNC1CC(O)C(CO)O1
105 144.0655196001 C=[NH+]C1CC(O)C(=CO)O1
106 308.1353304761 OCC1OC(N=C=NC2=CN=C3NCCCN3C2=[OH+])CC1O Intermediate Fragment 
107 308.1353304761 C=NC1=C(N=C2CC(O)C(CO)O2)N=C2NCCCN2C1=[OH+] Intermediate Fragment 
108 183.1240375201 C[NH2+]C1=CN=C2NCCCN2C1O
109 308.1353304761 O=C(CO)C(O)CCN1C=NC2=C1N=C1NCCCN1C2=[OH+] Intermediate Fragment 
110 290.1247657921 OC#CC(O)CCN1C=NC2=C1N=C1NCCCN1C2=[OH+]
111 262.1298511721 C=C(O)CCN1C=NC2=C1N=C1NCCCN1C2=[OH+]
112 272.1142011081 C#CC(O)=CCN1C=NC2=C1N=C1NCCCN1C2=[OH+]
113 248.1142011081 OC=CCN1C=NC2=C1N=C1NCCCN1C2=[OH+]
114 246.0985510441 OC#CCN1C=NC2=C1N=C1NCCCN1C2=[OH+]
115 244.0829009801 OC#CCN1C=NC2=C1N=C1N=CCCN1C2=[OH+]
116 220.1192864881 CCN1C=NC2=C1N=C1NCCCN1C2=[OH+]
117 218.1036364241 CCN1C=NC2=C1N=C1N=CCCN1C2=[OH+]
118 216.0879863601 CCN1C=NC2=C1N=C1N=CC=CN1C2=[OH+]
119 272.1142011081 OC#CC=CCN1C=NC2=C1N=C1NCCCN1C2=[OH+]
120 252.1455012361 OCCCN1CNC2=C1N=C1NCCCN1C2=[OH+]
121 250.1298511721 OCCCN1C=NC2=C1N=C1NCCCN1C2=[OH+]
122 232.1192864881 C=CCN1C=NC2=C1N=C1NCCCN1C2=[OH+]
123 230.1036364241 C#CCN1C=NC2=C1N=C1NCCCN1C2=[OH+]
124 204.0879863601 CN1C=NC2=C1N=C1N=CCCN1C2=[OH+]
125 63.0440558841 OCC[OH2+]
126 45.0334912001 C=C[OH2+]
127 224.1505866161 CCN1CNC2=C1N=C1NCCCN1C2[OH2+]
128 222.1349365521 CCN1CNC2=C1N=C1NCCCN1C2=[OH+]
129 91.0389705041 OCC(=[OH+])CO
130 308.1353304761 CC(O)C(=CO)OCN1C=NC2=C1N=C1NCCCN1C2=[OH+] Intermediate Fragment 
131 308.1353304761 CC(OC(=CO)CO)N1C=NC2=C1N=C1NCCCN1C2=[OH+] Intermediate Fragment 
132 75.0440558841 OCC=C[OH2+]
133 232.0829009801 CC(=O)N1C=NC2=C1N=C1N=CCCN1C2=[OH+]
134 234.0985510441 CC(=O)N1C=NC2=C1N=C1NCCCN1C2=[OH+]
135 236.1142011081 CC(O)N1C=NC2=C1N=C1NCCCN1C2=[OH+]
136 238.1298511721 CC(O)N1CNC2=C1N=C1NCCCN1C2=[OH+]
137 276.1091157281 CC(OC#CO)N1C=NC2=C1N=C1NCCCN1C2=[OH+]
138 278.1247657921 CC(OC=CO)N1C=NC2=C1N=C1NCCCN1C2=[OH+]
139 280.1404158561 CC(OCCO)N1C=NC2=C1N=C1NCCCN1C2=[OH+]
140 308.1353304761 OC=COC(CCO)N1C=NC2=C1N=C1NCCCN1C2=[OH+] Intermediate Fragment 
141 47.0491412641 CC[OH2+]
142 29.0385765801 C=[CH3+]
143 262.0934656641 O=C(C=CO)N1C=NC2=C1N=C1NCCCN1C2=[OH+]
144 264.1091157281 O=C(CCO)N1C=NC2=C1N=C1NCCCN1C2=[OH+]
145 266.1247657921 OCCC(O)N1C=NC2=C1N=C1NCCCN1C2=[OH+]
146 264.1091157281 OC=COCN1C=NC2=C1N=C1NCCCN1C2=[OH+]
147 262.0934656641 OC#COCN1C=NC2=C1N=C1NCCCN1C2=[OH+]
148 308.1353304761 O=C(CC(O)CCO)N1C=NC2=C1N=C1NCCCN1C2=[OH+] Intermediate Fragment 
149 240.1455012361 CC(O)N1CNC2=C1N=C1NCCCN1C2[OH2+]
150 68.9971056921 [O+]#CC#CO
151 71.0127557561 O=CC#C[OH2+]
152 43.0178411361 C#C[OH2+]
153 73.0284058201 OCC#C[OH2+]
154 55.0178411361 C#CC=[OH+]
155 77.0597059481 OCCC[OH2+]
156 59.0491412641 C=CC[OH2+]
157 224.1142011081 OCN1CNC2=C1N=C1NCCCN1C2=[OH+]
158 222.0985510441 OCN1C=NC2=C1N=C1NCCCN1C2=[OH+]
159 220.0829009801 O=CN1C=NC2=C1N=C1NCCCN1C2=[OH+]
160 218.0672509161 O=CN1C=NC2=C1N=C1N=CCCN1C2=[OH+]
161 87.0440558841 CC(O)C#C[OH2+]
162 69.0334912001 C=CC#C[OH2+]
163 89.0597059481 CC(O)C=C[OH2+]
164 71.0491412641 C#CC(C)[OH2+]
165 71.0491412641 CCC#C[OH2+]
166 91.0753560121 CC(O)CC[OH2+]
167 73.0647913281 C=CC(C)[OH2+]
168 73.0647913281 CCC=C[OH2+]
169 306.1196804121 O=C(CC(O)C=CO)N1C=NC2=C1N=C1NCCCN1C2=[OH+]
170 308.1353304761 CCCN1C(=[OH+])C2=C(N=C1N)N(C1CC(O)C(=CO)O1)C=N2 Intermediate Fragment 
171 280.1040303481 CN1C(=O)C2=C(N=C1[NH3+])N(C1CC(O)C(=CO)O1)C=N2
172 278.0883802841 CN1C(=O)C2=C(N=C1[NH3+])N(C1CC(O)C(=C=O)O1)C=N2
173 268.1040303481 [NH3+]C1=NC(O)=C2N=CN(C3CC(O)C(CO)O3)C2=N1
174 266.0883802841 [NH3+]C1=NC(O)=C2N=CN(C3CC(O)C(=CO)O3)C2=N1
175 308.1353304761 CCN1C(=[OH+])C2=C(N=C1NC)N(C1CC(O)C(=CO)O1)C=N2 Intermediate Fragment 
176 280.1040303481 C[NH2+]C1=NC(O)=C2N=CN(C3CC(O)C(=CO)O3)C2=N1
177 308.1353304761 CCNC1=NC2=C(N=CN2C2CC(O)C(=CO)O2)C(=[OH+])N1C Intermediate Fragment 
178 282.1196804121 CN1C(=O)C2=C(N=C1[NH3+])N(C1CC(O)C(CO)O1)C=N2
179 282.1196804121 CN1C(=O)C2=C(N=C1[NH3+])N(C(=O)CC(O)CCO)C=N2 Intermediate Fragment 
180 308.1353304761 CCCNC1=NC([OH2+])=C2N=CN(C3CC(O)C(=CO)O3)C2=N1 Intermediate Fragment 
181 308.1353304761 NCCCN1C=NC2=C(N=CN2C2CC(O)C(=CO)O2)C1=[OH+] Intermediate Fragment 
182 291.1087813801 CCCN1C=NC2=C(N=CN2C2CC(O)C(=C=O)O2)C1=[OH+]
183 177.0770873281 C=CCN1C=NC2=C(N=CN2)C1=[OH+]
