#In-silico ESI-MS/MS [M+H]+ Spectra
#PREDICTED BY CFM-ID 4.0.8
#SMILES=n1cnc2c(c1NC)ncn2[C@@H]1O[C@H](CO)[C@@H](C1)O
#InChiKey=DYSDOYRQWBDGQQ-BWZBUEFSSA-N
energy0
150.07742 100.00 16 47 18 50 61 54 26 44 40 58 (63.882 0.28433 0.15092 0.14579 0.10247 0.054797 0.053703 0.046968 0.034159 0.012101)
266.12477 46.18 0 140 111 136 85 79 109 100 99 101 108 124 94 (28.689 0.98929 0.13526 0.040376 0.022379 0.00887 0.0086281 0.0073074 0.0063307 0.0011588 0.0010443 0.001001 0.00058301)
energy1
150.07742 100.00 16 44 50 26 40 58 54 18 47 61 (75.545 1.8247 0.82606 0.82207 0.748 0.56103 0.44811 0.42512 0.38505 0.29594)
energy2
57.04472 12.24 31 (1.9718)
69.04472 70.91 33 (11.422)
82.03997 12.38 32 36 (1.6744 0.32015)
94.03997 53.02 29 (8.5412)
107.03522 54.53 23 (8.7844)
108.05562 18.12 21 52 (2.331 0.58714)
109.05087 11.95 24 (1.9248)
121.05087 27.85 59 2 45 48 63 (2.2713 1.3699 0.46172 0.19515 0.18832)
123.06652 58.82 51 56 20 41 17 (6.0255 1.2698 1.1888 0.8272 0.1647)
133.05087 45.34 42 57 19 62 (2.6954 2.0214 1.634 0.95354)
134.04612 26.00 5 (4.1887)
148.06177 15.46 46 15 39 49 60 43 25 (0.76679 0.72248 0.40723 0.31708 0.19637 0.051189 0.029463)
150.07742 100.00 26 16 58 44 40 47 18 61 54 50 (5.6557 2.6091 2.4997 1.8337 1.0835 0.89163 0.72147 0.42222 0.22853 0.16343)

0 266.1247657921 C[NH2+]c1ncnc2c1ncn2C1CC(O)C(CO)O1
1 235.0825666321 OC1CC(N2C=NC3=CN=CN=C32)OC1=C[OH2+]
2 121.0508725801 C1=NC2=NC=[NH+]CC2=N1
3 237.0982166961 OC1CC(N2C=NC3=CN=CN=C32)OC1C[OH2+]
4 250.0934656641 [NH3+]C1=C2N=CN(C3CC(O)C(=CO)O3)C2=NC=N1
5 134.0461215481 [NH2+]=C1N=CN=C2N=CN=C12
6 136.0617716121 [NH2+]=C1N=CN=C2NCN=C12
7 119.0702706321 OC1CCOC1C[OH2+]
8 119.0702706321 O=CCC(O)CC[OH2+] Intermediate Fragment 
9 117.0546205681 OC1CCOC1=C[OH2+]
10 99.0440558841 C=C1OCC=C1[OH2+]
11 117.0546205681 CCC(O)C(=O)C=[OH+] Intermediate Fragment 
12 99.0440558841 CC=C(O)C#C[OH2+]
13 117.0546205681 O=CCC(O)C=C[OH2+] Intermediate Fragment 
14 115.0389705041 OC1CCOC1=C=[OH+]
15 148.0617716121 C=[NH+]C1=C2N=CNC2=NC=N1
16 150.0774216761 C=[NH+]C1=C2NCNC2=NC=N1
17 123.0665226441 C1=[NH+]CC2=NCNC2=N1
18 150.0774216761 C[NH+]=CC1=C(N=C=N)NC=N1 Intermediate Fragment 
19 133.0508725801 C=NC1=NC=NC1=C=[N+]=C
20 123.0665226441 CN=C=C1N=CNC1=[NH2+]
21 108.0556236121 C[NH+]=C=C1C=NC=N1
22 106.0399735481 C=[N+]=C=C1C=NC=N1
23 107.0352225161 [NH+]#CN=C1C=NC=N1
24 109.0508725801 [NH+]#CN=C1C=NCN1
25 148.0617716121 CN=C=C1N=CNC1=NC#[NH+]
26 150.0774216761 C[NH+]=CN=C=NC1=CN=CN1 Intermediate Fragment 
27 98.0712736761 C=[NH+]C1=CNCN1
28 96.0556236121 C=[NH+]C1=CN=CN1
29 94.0399735481 C#[N+]C1=CN=CN1
30 55.0290745161 C=NC#[NH+]
31 57.0447245801 C=NC=[NH2+]
32 82.0399735481 [NH2+]=C1C=NC=N1
33 69.0447245801 C#[N+]C=NC
34 71.0603746441 C1=C[NH2+]CN1
35 80.0243234841 C=[N+]=C=NC#N
36 82.0399735481 CN=C=[NH+]C#N
37 42.0338255481 C=[N+]=C
38 44.0494756121 C=[NH+]C
39 148.0617716121 C=[N+]=CN=C=NC1=CN=CN1
40 150.0774216761 C[NH+]=C(N=C=N)C1=CNC=N1 Intermediate Fragment 
41 123.0665226441 C=NC(=[NH2+])C1=CNC=N1
42 133.0508725801 C#[N+]C(N=C)=C1C=NC=N1
43 148.0617716121 C=[N+]=C(N=C=N)C1=CNC=N1
44 150.0774216761 C=NC([NH+]=C)=C1N=CNC1=N Intermediate Fragment 
45 121.0508725801 C=[N+]=C=C1N=CNC1=N
46 148.0617716121 C#[N+]C(N=C)=C1N=CNC1=N
47 150.0774216761 C=NC1=C(C(N)=[N+]=C)N=CN1 Intermediate Fragment 
48 121.0508725801 C#[N+]C(=N)C1=CNC=N1
49 148.0617716121 C#[N+]C(=N)C1=C(N=C)NC=N1
50 150.0774216761 C=[NH+]C1=CC(NC=N)=NC=N1 Intermediate Fragment 
51 123.0665226441 C=[NH+]C1=CC(N)=NC=N1
52 108.0556236121 C=[NH+]C1=CC=NC=N1
53 106.0399735481 C#[N+]C1=CC=NC=N1
54 150.0774216761 C=[NH+]C1=C(N=CN)C=NC=N1 Intermediate Fragment 
55 43.0290745161 [NH+]#CN
56 123.0665226441 C=[NH+]C1=C(N)C=NC=N1
57 133.0508725801 C#[N+]C1=C(N=C)C=NC=N1
58 150.0774216761 C=NC1=C([NH+]=C)N=CN=C1N Intermediate Fragment 
59 121.0508725801 C#[N+]C1=CC(N)=NC=N1
60 148.0617716121 C#[N+]C1=C(N=C)C(N)=NC=N1
61 150.0774216761 C=NC1=NC=NC([NH+]=C)=C1N Intermediate Fragment 
62 133.0508725801 C#[N+]C1=CC(N=C)=NC=N1
63 121.0508725801 C#[N+]C1=C(N)C=NC=N1
64 152.0930717401 C[NH2+]C1=C2NCNC2=NC=N1
65 152.0930717401 C[NH+]=CN=C=NC1=CNCN1 Intermediate Fragment 
66 152.0930717401 C[NH+]=C(N=C=N)C1=CNCN1 Intermediate Fragment 
67 152.0930717401 C=NC([NH+]=C)=C1NCNC1=N Intermediate Fragment 
68 152.0930717401 C=NC1=C(C(N)=[NH+]C)N=CN1 Intermediate Fragment 
69 135.0665226441 C=NC1=C(C=[N+]=C)N=CN1
70 154.1087218041 C[NH2+]C1N=CN=C2NCNC21
71 156.1243718681 C[NH2+]C1N=CNC2NCNC21
72 156.1243718681 C[NH2+]C(N=C=N)C1CNCN1 Intermediate Fragment 
73 156.1243718681 C=NC([NH2+]C)C1NCNC1=N Intermediate Fragment 
74 234.0985510441 C=[NH+]C1=C2N=CN(C3CC(O)CO3)C2=NC=N1
75 236.1142011081 C=[NH+]C1=C2NCN(C3CC(O)CO3)C2=NC=N1
76 238.1298511721 C[NH2+]C1=C2NCN(C3CC(O)CO3)C2=NC=N1
77 248.1142011081 C=[NH+]C1=C2N=CN(C3CC(O)C(C)O3)C2=NC=N1
78 248.1142011081 C=[NH+]C1=C2N=CN(C3CCC(CO)O3)C2=NC=N1
79 266.1247657921 C[NH+]=CC1=C(N=C=N)N(C2CC(O)C(CO)O2)C=N1 Intermediate Fragment 
80 249.0982166961 C=[NH+]C1=C(C=NC)N=CN1C1CC(O)C(=C=O)O1
81 239.1138667601 CN=C=C1N=CN(C2CC(O)C(CO)O2)C1=[NH2+]
82 223.0825666321 [NH+]#CN=C1C=NCN1C1CC(O)C(=CO)O1
83 225.0982166961 [NH+]#CN=C1C=NCN1C1CC(O)C(CO)O1
84 225.0982166961 [NH+]#CN=C1C=NCN1C(=O)CC(O)CCO Intermediate Fragment 
85 266.1247657921 C[NH+]=CN=C=NC1=CN=CN1C1CC(O)C(CO)O1 Intermediate Fragment 
86 212.1029677281 C=[NH+]C1=CN=CN1C1CC(O)C(CO)O1
87 210.0873176641 C=[NH+]C1=CN=CN1C1CC(O)C(=CO)O1
88 210.0873176641 C=[NH+]C1=CN=CN1C(=O)CC(O)C=CO Intermediate Fragment 
89 208.0716676001 C=[NH+]C1=CN=CN1C1CC(O)C(=C=O)O1
90 206.0560175361 C=[NH+]C1=CN=CN1C1C=C(O)C(=C=O)O1
91 198.0873176641 [NH2+]=C1C=NCN1C1CC(O)C(=CO)O1
92 183.0764186321 OC1CC(N2C=CN=C2)OC1=C[OH2+]
93 181.0607685681 OC1CC(N2C=CN=C2)OC1=C=[OH+]
94 266.1247657921 C[NH+]=C(N=C=N)C1=CN(C2CC(O)C(CO)O2)C=N1 Intermediate Fragment 
95 239.1138667601 CN=C([NH3+])C1=CN(C2CC(O)C(=CO)O2)C=N1
96 249.0982166961 C=[NH+]C(=NC)C1=CN(C2CC(O)C(=C=O)O2)C=N1
97 137.0821727081 C=NC([NH+]=C)=C1CNC=N1
98 224.1029677281 C[NH+]=CC1=CN(C2CC(O)C(=CO)O2)C=N1
99 266.1247657921 C=NC([NH+]=C)=C1N=CN(C2CC(O)C(CO)O2)C1=N Intermediate Fragment 
100 266.1247657921 C=NC1=C(C(N)=[NH+]C)N=CN1C1CC(O)C(=CO)O1 Intermediate Fragment 
101 266.1247657921 C=[NH+]C1=CC(N(C=N)C2CC(O)C(CO)O2)=NC=N1 Intermediate Fragment 
102 249.0982166961 C=[NH+]C1=CC(N(C)C2CC(O)C(=C=O)O2)=NC=N1
103 110.0712736761 C[NH2+]C1=CC=NC=N1
104 110.0712736761 C=CN=C=NC=[NH+]C Intermediate Fragment 
105 159.0764186321 [NH+]#CNC1CC(O)C(CO)O1
106 161.0920686961 [NH2+]=CNC1CC(O)C(CO)O1
107 144.0655196001 C=[NH+]C1CC(O)C(=CO)O1
108 266.1247657921 C=[NH+]C1=C(N=CNC2CC(O)C(CO)O2)C=NC=N1 Intermediate Fragment 
109 266.1247657921 C=NC1=C([NH+]=C)N=CN=C1NC1CC(O)C(CO)O1 Intermediate Fragment 
110 135.0665226441 C=NC1=C([NH+]=C)N=CN=C1
111 266.1247657921 C=[NH+]C1=C2N=CN(CCC(O)C(O)CO)C2=NC=N1 Intermediate Fragment 
112 248.1142011081 C=[NH+]C1=C2N=CN(CCC(O)C=CO)C2=NC=N1
113 230.1036364241 C#CC(O)CCN1C=NC2=C([NH+]=C)N=CN=C21
114 206.1036364241 C=[NH+]C1=C2N=CN(CCCO)C2=NC=N1
115 204.0879863601 C=[NH+]C1=C2N=CN(CC=CO)C2=NC=N1
116 230.1036364241 C=[NH+]C1=C2N=CN(CCCC#CO)C2=NC=N1
117 210.1349365521 C[NH2+]C1=C2NCN(CCCO)C2=NC=N1
118 208.1192864881 C=[NH+]C1=C2NCN(CCCO)C2=NC=N1
119 162.0774216761 C=[NH+]C1=C2N=CN(C)C2=NC=N1
120 176.0930717401 C=[NH+]C1=C2N=CN(CC)C2=NC=N1
121 178.1087218041 C=[NH+]C1=C2NCN(CC)C2=NC=N1
122 174.0774216761 C=CN1C=NC2=C([NH+]=C)N=CN=C21
123 91.0389705041 OCC(=[OH+])CO
124 266.1247657921 C=[NH+]C1=C2N=CN(C(C)OC(CO)CO)C2=NC=N1 Intermediate Fragment 
125 180.1243718681 CCN1CNC2=C([NH2+]C)N=CN=C21
126 77.0597059481 OCCC[OH2+]
127 75.0440558841 OCC=C[OH2+]
128 57.0334912001 C#CC[OH2+]
129 190.0723362961 C=[NH+]C1=C2N=CN(C(C)=O)C2=NC=N1
130 192.0879863601 C=[NH+]C1=C2N=CN(C(C)O)C2=NC=N1
131 194.1036364241 C=[NH+]C1=C2NCN(C(C)O)C2=NC=N1
132 196.1192864881 C[NH2+]C1=C2NCN(C(C)O)C2=NC=N1
133 198.1349365521 C[NH2+]C1N=CN=C2C1NCN2C(C)O
134 234.0985510441 C=[NH+]C1=C2N=CN(C(C)OC=CO)C2=NC=N1
135 236.1142011081 C=[NH+]C1=C2N=CN(C(C)OCCO)C2=NC=N1
136 266.1247657921 C=[NH+]C1=C2N=CN(C(CCO)OCCO)C2=NC=N1 Intermediate Fragment 
137 47.0491412641 CC[OH2+]
138 222.0985510441 C=[NH+]C1=C2N=CN(C(O)CCO)C2=NC=N1
139 224.1142011081 C=[NH+]C1=C2NCN(C(O)CCO)C2=NC=N1
140 266.1247657921 C=[NH+]C1=C2N=CN(C(O)CC(O)CCO)C2=NC=N1 Intermediate Fragment 
141 220.0829009801 C=[NH+]C1=C2N=CN(C(=O)CCO)C2=NC=N1
142 73.0284058201 OCC#C[OH2+]
143 182.1036364241 C[NH2+]C1=C2NCN(CO)C2=NC=N1
144 180.0879863601 C=[NH+]C1=C2NCN(CO)C2=NC=N1
145 178.0723362961 C=[NH+]C1=C2N=CN(CO)C2=NC=N1
146 89.0597059481 CC(O)C=C[OH2+]
147 71.0491412641 C#CC(C)[OH2+]
148 71.0491412641 CCC#C[OH2+]
149 91.0753560121 CC(O)CC[OH2+]
150 264.1091157281 C=[NH+]C1=C2N=CN(C3CC(O)C(CO)O3)C2=NC=N1
