#In-silico ESI-MS/MS [M+H]+ Spectra
#PREDICTED BY CFM-ID 4.0.8
#SMILES=C1(CC(OC1CO)n1ccc(nc1=O)NC/C=C/c1ccc(cc1)OC)O
#InChiKey=GPDRJNDHQJTYET-NSCUHMNNSA-N
energy0
147.08044 13.08 11 142 (8.3469 0.25454)
226.09749 4.01 45 (2.6398)
230.12879 3.75 58 46 (1.7689 0.69816)
242.09240 3.47 47 94 (2.2516 0.027746)
258.12370 100.00 3 60 48 89 87 91 66 103 76 84 (60.88 2.3199 1.1595 0.58978 0.31028 0.2212 0.16948 0.062031 0.040931 0.018773)
energy1
103.05423 9.37 143 (1.7683)
112.05054 10.45 25 (1.971)
115.05423 9.65 141 (1.8203)
121.06479 18.38 36 (3.4683)
124.05054 14.45 32 (2.7264)
126.06619 15.54 33 (2.9322)
147.08044 81.90 11 142 (13.055 2.399)
152.08184 9.36 44 (1.7662)
213.10224 16.97 55 62 (2.9507 0.25167)
214.09749 8.35 95 (1.5752)
215.11789 27.35 56 61 (4.5766 0.58501)
226.09749 22.38 45 (4.2227)
230.12879 6.80 58 46 (0.81064 0.47221)
241.09715 10.67 65 49 (1.6357 0.3772)
242.09240 36.00 47 94 (6.768 0.024709)
256.10805 16.61 4 59 75 108 107 88 83 (1.5957 1.191 0.19427 0.057638 0.046479 0.031874 0.016388)
258.12370 100.00 3 48 91 60 66 84 87 89 103 76 (14.162 2.0622 0.99766 0.6714 0.2527 0.19175 0.1772 0.17592 0.12107 0.057257)
284.13935 10.05 162 (1.8962)
energy2
75.04406 11.73 166 (1.033)
103.05423 64.32 143 (5.6637)
115.05423 20.85 141 (1.8359)
121.06479 63.89 36 (5.6263)
123.08044 12.38 35 (1.0904)
124.05054 17.10 32 (1.5059)
126.06619 13.40 33 (1.1799)
138.06619 16.10 39 (1.4178)
145.06479 11.66 24 (1.027)
147.08044 38.69 11 142 (1.9111 1.4961)
160.07569 42.36 14 (3.7303)
162.09134 11.72 8 (1.0321)
174.09134 11.04 73 (0.97192)
184.07569 10.30 71 (0.90721)
186.09134 29.97 70 (2.6395)
188.08184 44.61 100 (3.9278)
188.10699 15.79 69 (1.3902)
189.10224 13.81 80 (1.2163)
190.09749 16.30 99 (1.4352)
202.09749 23.74 90 (2.0909)
211.08659 12.34 54 63 (0.95699 0.12921)
213.10224 41.15 55 62 (3.4462 0.17739)
214.09749 41.33 95 (3.6396)
215.11789 25.50 56 61 (1.9266 0.31912)
226.09749 14.76 45 (1.2999)
230.12879 15.85 58 46 (1.1052 0.29075)
240.11314 33.95 20 (2.9899)
241.09715 16.95 65 49 (1.1542 0.3387)
242.09240 19.61 47 94 (1.7067 0.019818)
258.12370 100.00 66 91 76 3 48 84 60 89 87 103 (2.3625 1.8723 1.0131 0.99194 0.95823 0.82185 0.26909 0.19183 0.1915 0.13338)

0 374.1710472881 COc1ccc(C=CC[NH2+]c2ccn(C3CC(O)C(CO)O3)c(=O)n2)cc1
1 356.1604826041 C=C1OC(N2C=CC([NH+]=C=C=CC3CCC(OC)CC3)=NC2=O)C=C1O
2 260.1393532361 COC1CCC(C=C=C=[NH+]C2=CC=NC(O)=N2)CC1
3 258.1237031721 COC1CCC(=C=C=C=[NH+]C2=CC=NC(O)=N2)CC1
4 256.1080531081 COC1C=CC(=C=C=C=[NH+]C2=CC=NC(O)=N2)CC1
5 338.1499179201 C=C1C=CC(N2C=CC([NH+]=C=C=C=C3CCC(OC)CC3)=NC2=O)O1
6 264.1706533641 COC1CCC(CCC=[NH+]C2=CC=NC(O)=N2)CC1
7 164.1069904881 COC1CCC(C#CC#[NH+])CC1
8 162.0913404241 COC1CC=C(C#CC#[NH+])CC1
9 153.1273915841 C#CCC1CCC([OH+]C)CC1
10 149.0960914561 C#CC=C1C=CC([OH+]C)CC1
11 147.0804413921 C#CC=C1C=CC([OH+]C)=CC1
12 262.1550033001 COC1CCC(CC=C=[NH+]C2=CC=NC(O)=N2)CC1
13 242.1287885521 COC1CCC(=C=C=C=[NH+]C2=CC=NC=N2)CC1
14 160.0756903601 COC1=CC=C(C#CC#[NH+])CC1
15 228.1131384881 OC1=NC([NH+]=C=C=C=C2CCCCC2)=CC=N1
16 260.1393532361 COC1CCC(CC=C=[NH+]C(=C=C=N)N=C=O)CC1 Intermediate Fragment 
17 260.1393532361 COC1CCC(CC#C[NH+]=C=C=C=NC(=N)O)CC1 Intermediate Fragment 
18 260.1393532361 C=NC(O)=NC(=C)[NH+]=C=C=C=C1CCC(OC)CC1 Intermediate Fragment 
19 260.1393532361 CCC(=C=C=C=[NH+]C1=CC=NC(O)=N1)CCCOC Intermediate Fragment 
20 240.1131384881 COC1C=CC(=C=C=C=[NH+]C2=CC=NC=N2)CC1
21 158.0600402961 COC1=CC=C(C#CC#[NH+])C=C1
22 156.0443902321 C=[O+]C1=CC=C(C#CC#N)C=C1
23 101.0709393281 [OH2+]C1N=CCCN1
24 145.0647913281 C#CC=C1C=CC([O+]=C)=CC1
25 112.0505382321 [NH3+]C1=CC=NC(O)=N1
26 114.0661882961 [NH3+]C1=CC=NC(O)N1
27 137.0960914561 C#CC1=CCC([OH+]C)CC1
28 135.0804413921 C#CC1=CC=C([OH+]C)CC1
29 133.0647913281 C#CC1=CC=C([OH+]C)C=C1
30 131.0491412641 C#CC1=CC=C([O+]=C)C=C1
31 122.0348881681 C#[N+]C1=CC=NC(O)=N1
32 124.0505382321 C=[NH+]C1=CC=NC(O)=N1
33 126.0661882961 C[NH2+]C1=CC=NC(O)=N1
34 128.0818383601 C[NH2+]C1=CC=NC(O)N1
35 123.0804413921 C=C1C=CC([OH+]C)=CC1
36 121.0647913281 C=[O+]C1=CCC(=C)C=C1
37 134.0348881681 [CH+]=C=NC1=CC=NC(O)=N1
38 136.0505382321 C=C=[NH+]C1=CC=NC(O)=N1
39 138.0661882961 CC=[NH+]C1=CC=NC(O)=N1
40 111.0804413921 C[OH+]C1=CC=CCC1
41 146.0348881681 [CH+]=C=C=NC1=CC=NC(O)=N1
42 148.0505382321 C=C=C=[NH+]C1=CC=NC(O)=N1
43 150.0661882961 CC=C=[NH+]C1=CC=NC(O)=N1
44 152.0818383601 CCC=[NH+]C1=CC=NC(O)=N1
45 226.0974884241 OC1=NC([NH+]=C=C=C=C2C=CCCC2)=CC=N1
46 230.1287885521 OC1=NC([NH+]=C=C=CC2CCCCC2)=CC=N1
47 242.0924030441 OC1=NC([NH+]=C=C=C=C2C=CC(O)CC2)=CC=N1
48 258.1237031721 COC1CCC(C=C=C=[NH+]C(=C=C=N)N=C=O)CC1 Intermediate Fragment 
49 241.0971540761 C#CC(N=C=C=C=C1C=CC(OC)CC1)=[NH+]C=O
50 231.1128041401 C=C(N=C=C=C=C1CCC(OC)CC1)[NH+]=C=O
51 229.0971540761 C=C(N=C=C=C=C1C=CC(OC)CC1)[NH+]=C=O
52 217.0971540761 COC1C=CC(=CC#CN=C=[NH+]C=O)CC1
53 215.0815040121 COC1=CCC(=CC#CN=C=[NH+]C=O)C=C1
54 211.0865893921 COC1C=CC(=C=C=C=NC#CC#[NH+])CC1
55 213.1022394561 COC1CCC(=C=C=C=NC#CC#[NH+])CC1
56 215.1178895201 COC1CCC(C=C=C=NC#CC#[NH+])CC1
57 228.1131384881 COC1C=CC(=C=C=C=NC(N)=CC#[NH+])CC1
58 230.1287885521 COC1CCC(=C=C=C=NC(N)=CC#[NH+])CC1
59 256.1080531081 COC1CCC(=C=C=C=NC(=CC#[NH+])N=C=O)CC1
60 258.1237031721 COC1CCC(=C=C=C=[NH+]C(N)=C=C=NC=O)CC1 Intermediate Fragment 
61 215.1178895201 C#CC(=[NH2+])N=C=C=C=C1CCC(OC)CC1
62 213.1022394561 C#CC(=[NH2+])N=C=C=C=C1C=CC(OC)CC1
63 211.0865893921 C#CC(=[NH2+])N=C=C=C=C1C=CC(OC)=CC1
64 203.1178895201 C=C([NH3+])N=C=C=C=C1C=CC(OC)CC1
65 241.0971540761 COC1C=CC(=CC#CN=C=C=C=[NH+]C=O)CC1
66 258.1237031721 COC1CCC(=CC#C[NH+]=C=C=C=NC(=N)O)CC1 Intermediate Fragment 
67 198.0913404241 C#CC=[NH+]C#CC=C1C=CC(OC)=CC1
68 196.0756903601 C#CC=NC#CC=C1C=CC([O+]=C)=CC1
69 188.1069904881 C#C[NH+]=C=C=C=C1CCC(OC)CC1
70 186.0913404241 C#C[NH+]=C=C=C=C1C=CC(OC)CC1
71 184.0756903601 C#C[NH+]=C=C=C=C1C=CC(OC)=CC1
72 182.0600402961 C#CN=C=C=C=C1C=CC([O+]=C)=CC1
73 174.0913404241 C=[NH+]C#CC=C1C=CC(OC)=CC1
74 172.0756903601 C=NC#CC=C1C=CC([O+]=C)=CC1
75 256.1080531081 COC1C=CC(=CC#CN=C=C=C=[NH+]C(=N)O)CC1
76 258.1237031721 C=C=NC(=O)N=C=[NH+]C#CC=C1CCC(OC)CC1 Intermediate Fragment 
77 232.1080531081 COC1C=CC(=CC#CN=C=NC([NH3+])=O)CC1
78 185.0709393281 COC1=CCC(=C=C=C=NC#[NH+])C=C1
79 187.0865893921 COC1C=CC(=C=C=C=NC#[NH+])CC1
80 189.1022394561 COC1CCC(=C=C=C=NC#[NH+])CC1
81 191.1178895201 COC1CCC(C=C=C=NC#[NH+])CC1
82 213.0658539481 COC1=CCC(=CC#CN=C=[N+]=C=O)C=C1
83 256.1080531081 C=C=[NH+]C(=O)N=C=NC#CC=C1C=CC(OC)CC1
84 258.1237031721 C=NC(O)=NC(=C)[NH+]=C=C=C=C1C=CC(OC)CC1 Intermediate Fragment 
85 201.1022394561 C=C([NH3+])N=C=C=C=C1C=CC(OC)=CC1
86 227.0815040121 C=C(N=C=C=C=C1C=CC(OC)=CC1)[NH+]=C=O
87 258.1237031721 C=C=C(N=C(N)O)[NH+]=C=C=C=C1C=CC(OC)CC1 Intermediate Fragment 
88 256.1080531081 C#CC(N=C=C=C=C1C=CC(OC)CC1)=NC([NH3+])=O
89 258.1237031721 C=C(CCC(C)=C=C=C=[NH+]C1=CC=NC(O)=N1)OC Intermediate Fragment 
90 202.0974884241 CCC(C)=C=C=C=[NH+]C1=CC=NC(O)=N1
91 258.1237031721 C=CC(=C=C=C=[NH+]C1=CC=NC(O)=N1)CCCOC Intermediate Fragment 
92 228.0767529801 COC#CCC=C=C=C=[NH+]C1=CC=NC(O)=N1
93 230.0924030441 COC=CCC=C=C=C=[NH+]C1=CC=NC(O)=N1
94 242.0924030441 COC#CCC(C)=C=C=C=[NH+]C1=CC=NC(O)=N1
95 214.0974884241 C=CC(=C=C=C=[NH+]C1=CC=NC(O)=N1)CC
96 212.0818383601 C#CC(=C=C=C=[NH+]C1=CC=NC(O)=N1)CC
97 200.0818383601 C=CC(C)=C=C=C=[NH+]C1=CC=NC(O)=N1
98 198.0661882961 C#CC(C)=C=C=C=[NH+]C1=CC=NC(O)=N1
99 190.0974884241 CCCC=C=C=[NH+]C1=CC=NC(O)=N1
100 188.0818383601 CCC=C=C=C=[NH+]C1=CC=NC(O)=N1
101 186.0661882961 CC=C=C=C=C=[NH+]C1=CC=NC(O)=N1
102 184.0505382321 C=C=C=C=C=C=[NH+]C1=CC=NC(O)=N1
103 258.1237031721 CCC(CC=C=C=C=C=[NH+]C1=CC=NC(O)=N1)OC Intermediate Fragment 
104 238.0974884241 COC1=CCC(=C=C=C=[NH+]C2=CC=NC=N2)C=C1
105 224.0818383601 OC1=NC([NH+]=C=C=C=C2C=CC=CC2)=CC=N1
106 239.0815040121 COC1=CCC(=CC#CN=C=C=C=[NH+]C=O)C=C1
107 256.1080531081 C=NC(O)=NC(=C)[NH+]=C=C=C=C1C=CC(OC)=CC1 Intermediate Fragment 
108 256.1080531081 C=CC(=C=C=C=[NH+]C1=CC=NC(O)=N1)CC=COC Intermediate Fragment 
109 115.0389705041 OC1C=COC1=C[OH2+]
110 117.0546205681 OC1C=COC1C[OH2+]
111 99.0440558841 C=C1OCC=C1[OH2+]
112 99.0440558841 [OH2+]C=C1C=CCO1
113 117.0546205681 C=COC(=C[OH2+])CO Intermediate Fragment 
114 117.0546205681 C=C=C(O)C(O)C[OH2+] Intermediate Fragment 
115 99.0440558841 C=C=C(O)C=C[OH2+]
116 57.0334912001 CC#C[OH2+]
117 117.0546205681 OC=C=C(O)CC[OH2+] Intermediate Fragment 
118 117.0546205681 OC=C=COCC[OH2+] Intermediate Fragment 
119 119.0702706321 OC1CCOC1C[OH2+]
120 170.1539406801 COC1CCC(CCC=[NH2+])CC1
121 170.1539406801 CCC(CCC#[NH+])CCCOC Intermediate Fragment 
122 168.1382906161 COC1CCC(CCC#[NH+])CC1
123 168.1382906161 CCC(C=CC#[NH+])CCCOC Intermediate Fragment 
124 166.1226405521 COC1CCC(C=CC#[NH+])CC1
125 211.0713332521 OC1C=C(N2C=CCNC2O)OC1=C=[OH+]
126 97.0396392001 [OH2+]C1=NC=CC=N1
127 211.0713332521 O=C(C=[OH+])C(O)=C=CN1C=CCNC1O Intermediate Fragment 
128 213.0869833161 OC1C=C(N2CCCNC2O)OC1=C=[OH+]
129 213.0869833161 OC(=C=C(O)N1CCCNC1O)C#C[OH2+] Intermediate Fragment 
130 155.1430416481 C=CCC1CCC([OH+]C)CC1
131 43.0542266441 CC=[CH3+]
132 123.1168269001 [CH2+]#CCC1CCCCC1
133 155.1430416481 C#CCC(CC)CCC[OH+]C Intermediate Fragment 
134 41.0385765801 [CH2+]#CC
135 121.1011768361 [CH2+]#CC=C1CCCCC1
136 153.1273915841 C#CC=CCCC(CC)[OH+]C Intermediate Fragment 
137 153.1273915841 C#CC=C(CC)CCC[OH+]C Intermediate Fragment 
138 151.1117415201 C#CC=C1CCC([OH+]C)CC1
139 133.0647913281 C#CC=C1C=CC([OH2+])=CC1
140 149.0960914561 C#CC=C(C=C)CC=C[OH+]C Intermediate Fragment 
141 115.0542266441 [C+]#CC=C1C=CC=CC1
142 147.0804413921 C#CC=C(C=C)C=C=C[OH+]C Intermediate Fragment 
143 103.0542266441 C#CC(C=C)=CC#[CH2+]
144 226.0822322841 [NH3+]C1C=CN(C2=CC(O)C(=C=O)O2)C(O)N1
145 228.0978823481 [NH3+]C1CCN(C2=CC(O)C(=C=O)O2)C(O)N1
146 228.0978823481 [NH3+]C1CCN(C(O)=C=C(O)C#CO)C(O)N1 Intermediate Fragment 
147 238.0822322841 C[NH2+]C1=NC(O)N(C2C=C(O)C(=C=O)O2)C=C1
148 240.0978823481 C[NH2+]C1C=CN(C2C=C(O)C(=C=O)O2)C(O)N1
149 242.1135324121 C[NH2+]C1CCN(C2C=C(O)C(=C=O)O2)C(O)N1
150 242.1135324121 C[NH2+]C1CCN(C(O)=C=C(O)C#CO)C(O)N1 Intermediate Fragment 
151 244.1291824761 C[NH2+]C1CCN(C2C=C(O)C(=CO)O2)C(O)N1
152 250.0822322841 CC[NH2+]C1=NC(=O)N(C2C=C(O)C(=C=O)O2)C=C1
153 252.0978823481 CC[NH2+]C1=NC(O)N(C2C=C(O)C(=C=O)O2)C=C1
154 254.1135324121 CC[NH2+]C1C=CN(C2C=C(O)C(=C=O)O2)C(O)N1
155 254.1135324121 CC[NH2+]C1C=CN(C=C=C(O)C(=O)C=O)C(O)N1 Intermediate Fragment 
156 264.0978823481 CCC[NH2+]C1=NC(=O)N(C2C=C(O)C(=C=O)O2)C=C1
157 266.1135324121 CCC[NH2+]C1=NC(O)N(C2C=C(O)C(=C=O)O2)C=C1
158 342.1448325401 O=C=C1OC(N2C=CC([NH+]=C=CCC3CCCCC3)=NC2=O)C=C1O
159 344.1604826041 O=C=C1OC(N2C=CC([NH+]=CCCC3CCCCC3)=NC2=O)C=C1O
160 356.1604826041 COC1CCC(CC=C=[NH+]C2=NC(=O)N(C3C=CC(=C=O)O3)C=C2)CC1
161 374.1710472881 C=C(OC(=C=O)CO)N1C=CC([NH+]=C=CCC2CCC(OC)CC2)=NC1=O Intermediate Fragment 
162 284.1393532361 C#CN1C=CC([NH+]=C=C=CC2CCC(OC)CC2)=NC1=O
163 286.1550033001 C#CN1C=CC([NH+]=C=CCC2CCC(OC)CC2)=NC1=O
164 288.1706533641 C#CN1C=CC([NH+]=CCCC2CCC(OC)CC2)=NC1=O
165 290.1863034281 C#CN1C=CC([NH2+]CCCC2CCC(OC)CC2)=NC1=O
166 75.0440558841 OCC=C[OH2+]
167 298.1186177921 C=C(O)N1C=CC([NH+]=C=C=C=C2C=CC(OC)CC2)=NC1=O
168 300.1342678561 C=C(O)N1C=CC([NH+]=C=C=C=C2CCC(OC)CC2)=NC1=O
169 302.1499179201 C=C(O)N1C=CC([NH+]=C=C=CC2CCC(OC)CC2)=NC1=O
170 374.1710472881 C=C(O)C(=C=O)OCN1C=CC([NH+]=C=CCC2CCC(OC)CC2)=NC1=O Intermediate Fragment 
171 374.1710472881 COC1CCC(CCC=[NH+]C2=NC(=O)N(C=C=C(O)C(=O)C=O)C=C2)CC1 Intermediate Fragment 
172 84.9920203121 O=CC(=O)C#[O+]
173 87.0076703761 O=CC(=[OH+])C=O
174 89.0233204401 O=CC(=[OH+])CO
175 71.0127557561 CC(=O)C#[O+]
176 61.0284058201 OCC=[OH+]
177 91.0389705041 OCC(=[OH+])CO
178 73.0284058201 OCC#C[OH2+]
179 73.0284058201 CC(=[OH+])C=O
180 93.0546205681 OCC([OH2+])CO
181 276.1706533641 COC1CCC(CC=C=[NH+]C2=NC(=O)N(C)C=C2)CC1
182 274.1550033001 COC1CCC(C=C=C=[NH+]C2=NC(=O)N(C)C=C2)CC1
183 272.1393532361 COC1CCC(=C=C=C=[NH+]C2=NC(=O)N(C)C=C2)CC1
184 270.1237031721 COC1C=CC(=C=C=C=[NH+]C2=NC(=O)N(C)C=C2)CC1
185 270.1237031721 C=[O+]C1=CCC(=C=C=C=NC(=C)N=C(O)N(C)C)C=C1 Intermediate Fragment 
186 268.1080531081 COC1=CCC(=C=C=C=[NH+]C2=NC(=O)N(C)C=C2)C=C1
187 236.0818383601 [CH2+]N1C=CC(N=C=C=C=C2C=CC=CC2)=NC1=O
188 268.1080531081 C=NC=C=C(N=C=O)[NH+]=C=C=C=C1C=CC(OC)CC1 Intermediate Fragment 
189 268.1080531081 C=CN(C)C(=O)N=C=NC#CC=C1C=CC([O+]=C)=CC1 Intermediate Fragment 
190 268.1080531081 C=CC(=C=C=C=[NH+]C1=NC(=O)N(C)C=C1)C=C=COC Intermediate Fragment 
191 356.1604826041 COC1CCC(CC=C=[NH+]C2=NC(=O)N(C=C=C(O)C#CO)C=C2)CC1
192 338.1499179201 COC1CCC(C=C=C=[NH+]C2=NC(=O)N(CC#CC#CO)C=C2)CC1
193 314.1499179201 COC1CCC(C=C=C=[NH+]C2=NC(=O)N(CC#CO)C=C2)CC1
194 312.1342678561 COC1CCC(=C=C=C=[NH+]C2=NC(=O)N(CC#CO)C=C2)CC1
195 310.1186177921 COC1C=CC(=C=C=C=[NH+]C2=NC(=O)N(CC#CO)C=C2)CC1
196 356.1604826041 COC1CCC(CCC=[NH+]C(=C=CN=C=C=C(O)C#CO)N=C=O)CC1 Intermediate Fragment 
197 318.1812180481 COC1CCC(CCC=[NH+]C2=NC(=O)N(CC#CO)C=C2)CC1
198 316.1655679841 COC1CCC(CC=C=[NH+]C2=NC(=O)N(CC#CO)C=C2)CC1
199 314.1499179201 COC1CCC(CC=C=[NH+]C(=C=CN=CC#CO)N=C=O)CC1 Intermediate Fragment 
200 312.1342678561 COC1CCC(C=C=C=[NH+]C(=C=CN=CC#CO)N=C=O)CC1 Intermediate Fragment 
201 59.0127557561 O=C=C[OH2+]
202 41.0021910721 [CH+]=C=O
203 43.0178411361 C#C[OH2+]
204 63.0440558841 OCC[OH2+]
205 45.0334912001 C=C[OH2+]
206 374.1710472881 COC1CCC(CCC=[NH+]C2=NC(=O)N(C(O)=C=C(O)C#CO)C=C2)CC1 Intermediate Fragment 
207 77.0597059481 OCCC[OH2+]
208 59.0491412641 C=CC[OH2+]
209 288.1342678561 COC1CCC(C=C=C=[NH+]C2=NC(=O)N(C=O)C=C2)CC1
210 286.1186177921 COC1CCC(=C=C=C=[NH+]C2=NC(=O)N(C=O)C=C2)CC1
211 89.0597059481 C=C(O)CC[OH2+]
212 332.1604826041 COC1CCC(CCC=[NH+]C2=NC(=O)N(C(=O)C#CO)C=C2)CC1
213 314.1499179201 C#CC(=O)N1C=CC([NH+]=C=CCC2CCC(OC)CC2)=NC1=O
214 330.1448325401 COC1CCC(CC=C=[NH+]C2=NC(=O)N(C(=O)C#CO)C=C2)CC1
215 312.1342678561 C#CC(=O)N1C=CC([NH+]=C=C=CC2CCC(OC)CC2)=NC1=O
216 330.1448325401 COC1CCC(CCC=[NH+]C(=C=C=NC(=O)C#CO)N=C=O)CC1 Intermediate Fragment 
217 328.1291824761 COC1CCC(C=C=C=[NH+]C2=NC(=O)N(C(=O)C#CO)C=C2)CC1
218 374.1710472881 COC1CCC(CCC=[NH+]C2=NC(=O)N(C(=C=CO)OC#CO)C=C2)CC1 Intermediate Fragment 
219 374.1710472881 C=C(N=C(O)N(C)C1C=C(O)C(=C=O)O1)[NH+]=C=C=CC1CCC(OC)CC1 Intermediate Fragment 
220 172.0604342201 C[NH+](CO)C1C=C(O)C(=C=O)O1
221 146.0811696641 C[NH2+]C1C=C(O)C(CO)O1
222 233.1284542041 C=C(N=C=C=CC1CCC(OC)CC1)[NH+]=C=O
223 374.1710472881 C=CN(C(=O)N=C=[NH+]C=CCC1CCC(OC)CC1)C1C=C(O)C(=C=O)O1 Intermediate Fragment 
224 374.1710472881 COC1CCC(CC=C[NH+]=C=C=CN(C(=N)O)C2C=C(O)C(=C=O)O2)CC1 Intermediate Fragment 
225 357.1444981921 COC1CCC(CC#CN=CC#C[NH+](C=O)C2C=C(O)C(=C=O)O2)CC1
226 331.1652336361 COC1CCC(CCCN=CC#C[NH+]=C2C=C(O)C(=C=O)O2)CC1
227 374.1710472881 COC1CCC(CC=C=[NH+]C(N)=C=CN(C=O)C2C=C(O)C(=C=O)O2)CC1 Intermediate Fragment 
228 346.1761326681 COC1CCC(CCCNC(=N)C#C[NH+]=C2C=C(O)C(=C=O)O2)CC1
229 374.1710472881 COC1CCC(CCC[NH2+]C(=C=CN=C2C=C(O)C(=C=O)O2)N=C=O)CC1 Intermediate Fragment 
230 329.1495835721 COC1CCC(CC=CN=CC#C[NH+]=C2C=C(O)C(=C=O)O2)CC1
231 344.1604826041 COC1CCC(CCC=NC(=N)C#C[NH+]=C2C=C(O)C(=C=O)O2)CC1
232 374.1710472881 C=C=C(N=C(O)N=C1C=C(O)C(=C=O)O1)[NH+]=CCCC1CCC(OC)CC1 Intermediate Fragment 
233 374.1710472881 COC(C)CCC(C)CC=C=[NH+]C1=NC(=O)N(C2C=C(O)C(=C=O)O2)C=C1 Intermediate Fragment 
234 374.1710472881 CCC(CC=C=[NH+]C1=NC(=O)N(C2C=C(O)C(=C=O)O2)C=C1)CCCOC Intermediate Fragment 
235 344.1240970961 COCCCCC=C=C=[NH+]C1=NC(=O)N(C2C=C(O)C(=C=O)O2)C=C1
236 232.1080531081 COCCCC=C=C=C=[NH+]C1=CC=NC(O)=N1
237 346.1397471601 COCCCCCC=C=[NH+]C1=NC(=O)N(C2C=C(O)C(=C=O)O2)C=C1
238 348.1553972241 COCCCCCCC=[NH+]C1=NC(=O)N(C2C=C(O)C(=C=O)O2)C=C1
239 330.1448325401 CCC(CC)CC=C=[NH+]C1=NC(=O)N(C2C=C(O)C(=C=O)O2)C=C1
240 216.1131384881 CCC(=C=C=C=[NH+]C1=CC=NC(O)=N1)CC
241 328.1291824761 CCC(C=C=C=[NH+]C1=NC(=O)N(C2C=C(O)C(=C=O)O2)C=C1)CC
242 320.1604826041 CCC(C)CCC[NH2+]C1=NC(=O)N(C2C=C(O)C(=C=O)O2)C=C1
243 318.1448325401 CCC(C)CCC=[NH+]C1=NC(=O)N(C2C=C(O)C(=C=O)O2)C=C1
244 316.1291824761 CCC(C)CC=C=[NH+]C1=NC(=O)N(C2C=C(O)C(=C=O)O2)C=C1
245 314.1135324121 CCC(C)C=C=C=[NH+]C1=NC(=O)N(C2C=C(O)C(=C=O)O2)C=C1
246 304.1291824761 CCCCCC=[NH+]C1=NC(=O)N(C2C=C(O)C(=C=O)O2)C=C1
247 302.1135324121 CCCCC=C=[NH+]C1=NC(=O)N(C2C=C(O)C(=C=O)O2)C=C1
248 300.0978823481 CCCC=C=C=[NH+]C1=NC(=O)N(C2C=C(O)C(=C=O)O2)C=C1
249 374.1710472881 CCC(CCCCC=C=[NH+]C1=NC(=O)N(C2C=C(O)C(=C=O)O2)C=C1)OC Intermediate Fragment 
