#In-silico ESI-MS/MS [M+H]+ Spectra
#PREDICTED BY CFM-ID 4.0.8
#SMILES=[nH]1c(nc2c(c1=O)[n+](cn2[C@@H]1O[C@H](CO)[C@@H](C1)O)CCC)N
#InChiKey=DBCIHXUKKVVSDE-IWSPIJDZSA-O
energy0
194.10364 73.35 9 18 45 23 34 41 38 28 29 (24.602 0.021269 0.019625 0.013772 0.013405 0.011903 0.0024456 0.0022185 0.0021801)
196.11929 100.00 48 68 61 54 69 62 58 59 65 60 (32.4 0.29391 0.21068 0.20191 0.19513 0.14478 0.088157 0.064439 0.044491 0.013439)
310.15098 73.51 0 150 138 165 148 167 145 142 143 149 147 146 163 (22.096 1.8144 0.32081 0.29257 0.12477 0.030317 0.016276 0.014553 0.011109 0.010643 0.0066529 0.0016426 0.00034194)
energy1
137.04579 9.08 36 (4.1603)
152.05669 20.38 8 (9.335)
194.10364 100.00 9 18 23 34 41 45 29 28 38 (41.368 0.96298 0.94489 0.83656 0.73954 0.4865 0.35574 0.077573 0.027442)
196.11929 49.54 48 62 54 68 69 58 59 61 60 65 (17.672 1.8277 0.94597 0.71746 0.65274 0.23914 0.20893 0.19625 0.16252 0.067891)
energy2
75.04406 3.06 109 (1.4316)
137.04579 3.34 36 (1.5607)
139.06144 2.58 35 (1.2081)
152.05669 100.00 8 (46.777)
166.07234 4.68 14 (2.1894)
180.08799 3.51 95 52 (0.84458 0.79709)
194.06725 5.69 97 (2.663)
194.10364 8.76 9 45 38 41 29 34 23 18 28 (2.9762 0.44808 0.22461 0.10312 0.10011 0.090585 0.066101 0.062367 0.025453)
196.08290 6.33 98 (2.9592)
196.11929 4.75 48 69 65 68 60 54 59 62 58 61 (0.73225 0.61324 0.29961 0.11631 0.10596 0.089246 0.085875 0.079465 0.065457 0.034583)
208.08290 3.03 94 (1.4178)
224.07782 5.57 102 (2.6076)
250.09347 9.47 93 87 86 85 (2.6866 0.91597 0.41926 0.41004)
252.10912 7.44 112 78 82 127 (1.8375 0.67537 0.65833 0.30668)
268.10403 3.90 104 92 96 84 99 90 91 89 88 (0.9267 0.19659 0.17447 0.14716 0.14368 0.079541 0.067272 0.04464 0.043559)

0 310.1509805401 CCC[N+]1=CN(C2CC(O)C(CO)O2)C2=C1C(=O)NC(N)=N2
1 119.0702706321 OC1CCOC1C[OH2+]
2 119.0702706321 O=CCC(O)CC[OH2+] Intermediate Fragment 
3 117.0546205681 OC1CCOC1=C[OH2+]
4 99.0440558841 C=C1OCC=C1[OH2+]
5 117.0546205681 CCC(O)C(=O)C=[OH+] Intermediate Fragment 
6 117.0546205681 O=CCC(O)C=C[OH2+] Intermediate Fragment 
7 192.0879863601 CC=CN1C=NC2=NC([NH3+])=NC(O)=C21
8 152.0566862321 [NH3+]C1=NC(=O)C2=NCNC2=N1
9 194.1036364241 CCCN1C=NC2=NC([NH3+])=NC(O)=C21
10 43.0542266441 CC=[CH3+]
11 150.0410361681 [NH3+]C1=NC(=O)C2=NC=NC2=N1
12 154.0723362961 [NH3+]C1=NC(=O)C2NCNC2=N1
13 164.0566862321 [CH2+]N1C=NC2=NC(N)=NC(O)=C21
14 166.0723362961 CN1C=NC2=NC([NH3+])=NC(O)=C21
15 168.0879863601 CN1CNC2=NC([NH3+])=NC(O)=C21
16 178.0723362961 C=CN1C=NC2=NC([NH3+])=NC(O)=C21
17 177.0770873281 CC=CN1C=NC2=NC=NC([OH2+])=C21
18 194.1036364241 CCCN1C=NC(=NC(=N)[NH3+])C1=C=O Intermediate Fragment 
19 177.0770873281 CC#CN1C=NC([NH+]=CN)=C1C=O
20 152.0818383601 CCCN1C=NC(=[NH2+])C1=C=O
21 135.0552892641 CC#CN1C=NC=C1C=[OH+]
22 166.1087218041 CC=CN1C=NC(=NC(N)=[NH2+])C1
23 194.1036364241 CC=CN1C=NC(=NC([NH3+])=NC=O)C1 Intermediate Fragment 
24 151.0978227721 CC=CN1C=NC([NH+]=CN)=C1
25 149.0821727081 CC#CN1C=NC([NH+]=CN)=C1
26 124.0869237401 CC=CN1C=NC(=[NH2+])C1
27 107.0603746441 CC#[CH+]N1C=CN=C1
28 194.1036364241 CC=CN1C=NC=C1C(=O)N=C(N)[NH3+] Intermediate Fragment 
29 194.1036364241 CC=CN1C=NC(=N)C1=C(O)N=C[NH3+] Intermediate Fragment 
30 167.0927373921 CC=CN1C=NC(=N)C1=C([NH3+])O
31 122.0712736761 CC#CN1C=NC(=[NH2+])C1
32 126.1025738041 CCCN1C=NC(=[NH2+])C1
33 150.0661882961 CC=CN1C=NC(=[NH2+])C1=C=O
34 194.1036364241 CCCN=C=NC1=NC([NH3+])=NC(O)=C1 Intermediate Fragment 
35 139.0614372641 C=[NH+]C1=NC(N)=NC(O)=C1
36 137.0457872001 C#[N+]C1=NC(N)=NC(O)=C1
37 83.0603746441 CC=C[NH+]=C=N
38 194.1036364241 CC=CN(C=N)C1=C(O)N=C([NH3+])N=C1 Intermediate Fragment 
39 112.0505382321 [NH3+]C1=NC(O)=CC=N1
40 167.0927373921 CCC=[NH+]C1=C(O)N=C(N)N=C1
41 194.1036364241 CC#CN(C)C1=C(O)N=C([NH3+])N=C1N Intermediate Fragment 
42 127.0614372641 NC1=NC(O)=CC([NH3+])=N1
43 129.0770873281 NC1=NC(O)CC([NH3+])=N1
44 177.0770873281 C=[N+](C#CC)C1=C(O)N=C(N)N=C1
45 194.1036364241 C=NC1=NC([NH3+])=NC(O)=C1N=CCC Intermediate Fragment 
46 141.0770873281 C[NH2+]C1=NC(N)=NC(O)=C1
47 143.0927373921 C[NH2+]C1=NC(N)=NC(O)C1
48 196.1192864881 CCCN1CNC2=NC([NH3+])=NC(O)=C21
49 178.1087218041 CCCN1C=NC2=NC([NH3+])=NC=C21
50 156.0879863601 [NH3+]C1=NC(O)C2NCNC2=N1
51 170.1036364241 CN1CNC2=NC([NH3+])=NC(O)C21
52 180.0879863601 CCN1C=NC2=NC([NH3+])=NC(O)=C21
53 179.0927373921 CCCN1C=NC2=NC=NC([OH2+])=C21
54 196.1192864881 CCCN1CNC(=NC(=N)[NH3+])C1=C=O Intermediate Fragment 
55 179.0927373921 CC=CN1C=NC([NH+]=CN)=C1C=O
56 137.0709393281 CC=CN1C=NC=C1C=[OH+]
57 168.1243718681 CCCN1C=NC(=NC(N)=[NH2+])C1
58 196.1192864881 CCCN1C=NC(=NC([NH3+])=NC=O)C1 Intermediate Fragment 
59 196.1192864881 CCCN1C=NC=C1C(=O)N=C(N)[NH3+] Intermediate Fragment 
60 196.1192864881 CCCN1C=NC(=N)C1=C(O)N=C[NH3+] Intermediate Fragment 
61 196.1192864881 CCCN1C=NC(N=C[NH3+])=C1C(N)=O Intermediate Fragment 
62 196.1192864881 CCCN=CNC1=NC([NH3+])=NC(O)=C1 Intermediate Fragment 
63 70.0651256761 C=[NH+]C=CC
64 85.0760247081 CCC[NH+]=C=N
65 196.1192864881 CCCN(C=N)C1=C(O)N=C([NH3+])N=C1 Intermediate Fragment 
66 169.1083874561 CCC[NH2+]C1=C(O)N=C(N)N=C1
67 179.0927373921 CC#C[NH+](C)C1=C(O)N=C(N)N=C1
68 196.1192864881 CC=CN(C)C1=C(O)N=C([NH3+])N=C1N Intermediate Fragment 
69 196.1192864881 C=NC1=NC([NH3+])=NC(O)=C1NCCC Intermediate Fragment 
70 165.0770873281 CC=C=[NH+]C1=C(O)N=C(N)N=C1
71 198.1349365521 CCCN1CNC2=NC([NH3+])=NC(O)C21
72 200.1505866161 CCCN1CNC2NC([NH3+])=NC(O)C21
73 278.1247657921 CC=CN1CN(C2CC(O)=CO2)C2=NC([NH3+])=NC(O)=C21
74 280.1404158561 CCCN1CN(C2CC(O)=CO2)C2=NC([NH3+])=NC(O)=C21
75 282.1560659201 CCCN1CN(C2CC(O)CO2)C2=NC([NH3+])=NC(O)=C21
76 292.1404158561 C=C1OC(N2CN(CCC)C3=C(O)N=C([NH3+])N=C32)C=C1O
77 274.1298511721 C=C1C=CC(N2CN(C=CC)C3=C(O)N=C([NH3+])N=C32)O1
78 252.1091157281 CC1OC(N2C=NC3=C(O)N=C([NH3+])N=C32)CC1O
79 292.1404158561 C#COC(C=CO)N1CN(CCC)C2=C(O)N=C([NH3+])N=C21 Intermediate Fragment 
80 250.1298511721 CCCN1CN(CC#CO)C2=NC([NH3+])=NC(O)=C21
81 292.1404158561 CCCN1CN(C2CCC(=C=O)O2)C2=NC([NH3+])=NC(O)=C21
82 252.1091157281 [NH3+]C1=NC(O)=C2N=CN(C3CCC(CO)O3)C2=N1
83 266.0883802841 [NH3+]C1=NC(O)=C2N=CN(C3CC(O)C(=CO)O3)C2=N1
84 268.1040303481 [NH3+]C1=NC(O)=C2N=CN(C3CC(O)C(CO)O3)C2=N1
85 250.0934656641 [NH3+]C1=NC=C2N=CN(C3CC(O)C(=CO)O3)C2=N1
86 250.0934656641 C=C1OC(N2C=NC3=C(O)N=C([NH3+])N=C32)CC1O
87 250.0934656641 [NH3+]C1=NC(O)=C2N=CN(C3CCC(=CO)O3)C2=N1
88 268.1040303481 N=C([NH3+])N=C1C(=C=O)N=CN1C1CC(O)C(CO)O1 Intermediate Fragment 
89 268.1040303481 [NH3+]C(=NC=O)N=C1C=NCN1C1CC(O)C(=CO)O1 Intermediate Fragment 
90 268.1040303481 N=CN(C1=NC([NH3+])=NC(O)=C1)C1CC(O)C(=CO)O1 Intermediate Fragment 
91 268.1040303481 C=NC1=C(O)N=C([NH3+])N=C1N=C1CC(O)C(CO)O1 Intermediate Fragment 
92 268.1040303481 [NH3+]C1=NC(O)=C2N=CN(CCC(O)C(=O)CO)C2=N1 Intermediate Fragment 
93 250.0934656641 [NH3+]C1=NC(O)=C2N=CN(CCC(O)C#CO)C2=N1
94 208.0829009801 [NH3+]C1=NC(O)=C2N=CN(CC=CO)C2=N1
95 180.0879863601 CCN1C=NC2=C(O)N=C([NH3+])N=C21
96 268.1040303481 CC(OC(=CO)CO)N1C=NC2=C(O)N=C([NH3+])N=C21 Intermediate Fragment 
97 194.0672509161 CC(=O)N1C=NC2=C(O)N=C([NH3+])N=C21
98 196.0829009801 CC(O)N1C=NC2=C(O)N=C([NH3+])N=C21
99 268.1040303481 [NH3+]C1=NC(O)=C2N=CN(C(CCO)OC=CO)C2=N1 Intermediate Fragment 
100 206.0672509161 [NH3+]C1=NC(O)=C2N=CN(CC#CO)C2=N1
101 210.0985510441 [NH3+]C1=NC(O)=C2N=CN(CCCO)C2=N1
102 224.0778156001 [NH3+]C1=NC(O)=C2N=CN(C(=O)CCO)C2=N1
103 226.0934656641 [NH3+]C1=NC(O)=C2N=CN(C(O)CCO)C2=N1
104 268.1040303481 [NH3+]C1=NC(O)=C2N=CN(C(=O)CC(O)CCO)C2=N1 Intermediate Fragment 
105 222.0621655361 [NH3+]C1=NC(O)=C2N=CN(C(=O)C=CO)C2=N1
106 200.1142011081 CC(O)N1CNC2C1=NC([NH3+])=NC2O
107 198.0985510441 CC(O)N1CNC2=C(O)N=C([NH3+])N=C21
108 73.0284058201 OCC#C[OH2+]
109 75.0440558841 OCC=C[OH2+]
110 266.0883802841 [NH3+]C1=NC(O)=C2N=CN(C(=O)CC(O)C=CO)C2=N1
111 270.1196804121 [NH3+]C1=NC(O)=C2NCN(C3CC(O)C(CO)O3)C2=N1
112 252.1091157281 [NH3+]C1=NC=C2N=CN(C3CC(O)C(CO)O3)C2=N1
113 160.1192864881 [NH3+]C1NC(O)C2NCNC2N1
114 253.0931313161 OCC1OC(N2C=NC3=C([OH2+])N=CN=C32)CC1O
115 270.1196804121 N=C([NH3+])N=C1C(=C=O)NCN1C1CC(O)C(CO)O1 Intermediate Fragment 
116 253.0931313161 NC=[NH+]C1=C(C=O)N=CN1C1CC(O)C(=CO)O1
117 270.1196804121 [NH3+]C(=NC=O)N=C1C=NCN1C1CC(O)C(CO)O1 Intermediate Fragment 
118 225.0982166961 NC=[NH+]C1=CN=CN1C1CC(O)C(=CO)O1
119 270.1196804121 NC([NH3+])=NC(=O)C1=CN(C2CC(O)C(CO)O2)C=N1 Intermediate Fragment 
120 253.0931313161 NC=[NH+]C(=O)C1=CN(C2CC(O)C(=CO)O2)C=N1
121 211.0713332521 OC=C1OC(N2C=NC(C=[OH+])=C2)CC1O
122 270.1196804121 N=C1C(=C(O)N=C[NH3+])N=CN1C1CC(O)C(CO)O1 Intermediate Fragment 
123 270.1196804121 N=CN(C1=NC([NH3+])=NC(O)=C1)C1CC(O)C(CO)O1 Intermediate Fragment 
124 253.0931313161 C[NH+](C1=NC(N)=NC(O)=C1)C1CC(O)C(=C=O)O1
125 270.1196804121 C=NC1=C(O)N=C([NH3+])N=C1NC1CC(O)C(CO)O1 Intermediate Fragment 
126 270.1196804121 [NH3+]C1=NC(O)=C2N=CN(CCC(O)C(O)CO)C2=N1 Intermediate Fragment 
127 252.1091157281 [NH3+]C1=NC(O)=C2N=CN(CCC(O)C=CO)C2=N1
128 270.1196804121 CC(OC(CO)CO)N1C=NC2=C(O)N=C([NH3+])N=C21 Intermediate Fragment 
129 270.1196804121 [NH3+]C1=NC(O)=C2N=CN(C(CCO)OCCO)C2=N1 Intermediate Fragment 
130 270.1196804121 [NH3+]C1=NC(O)=C2N=CN(C(O)CC(O)CCO)C2=N1 Intermediate Fragment 
131 280.1040303481 CN1CN(C2CC(O)C(=C=O)O2)C2=NC([NH3+])=NC(O)=C21
132 282.1196804121 CN1CN(C2CC(O)C(=CO)O2)C2=NC([NH3+])=NC(O)=C21
133 282.1196804121 CN1CN(C(=O)CC(O)C=CO)C2=NC([NH3+])=NC(O)=C21 Intermediate Fragment 
134 284.1353304761 CN1CN(C2CC(O)C(CO)O2)C2=NC([NH3+])=NC(O)=C21
135 284.1353304761 CN1CN(C(=O)CC(O)CCO)C2=NC([NH3+])=NC(O)=C21 Intermediate Fragment 
136 294.1196804121 CCN1CN(C2CC(O)C(=C=O)O2)C2=NC([NH3+])=NC(O)=C21
137 293.1244314441 CCCN1CN(C2CC(O)C(=C=O)O2)C2=NC=NC([OH2+])=C21
138 310.1509805401 CCCN1CN(C2CC(O)C(=CO)O2)C(=NC(=N)[NH3+])C1=C=O Intermediate Fragment 
139 268.1291824761 CCCN1CN(C2CC(O)C(=CO)O2)C(=[NH2+])C1=C=O
140 268.1291824761 CCCN1CN(C(=O)CC(O)C=CO)C(=[NH2+])C1=C=O Intermediate Fragment 
141 251.1026333801 CCCN1CN(C2C=C(O)C(=C=O)O2)C=C1C=[OH+]
142 310.1509805401 CCCN1CC(=NC([NH3+])=NC=O)N(C2CC(O)C(=C=O)O2)C1 Intermediate Fragment 
143 310.1509805401 CCCN1CN(C2CC(O)C(=C=O)O2)C=C1C(=O)N=C(N)[NH3+] Intermediate Fragment 
144 225.1233688241 CCCN1C=CN(C2CC(O)C(=C=[OH+])O2)C1
145 310.1509805401 CCCN1CN(C2CC(O)C(=C=O)O2)C(=N)C1=C(O)N=C[NH3+] Intermediate Fragment 
146 310.1509805401 CCCN=CN(C1=NC([NH3+])=NC(O)=C1)C1CC(O)C(=CO)O1 Intermediate Fragment 
147 310.1509805401 CCCN(C=NC1CC(O)C(=CO)O1)C1=C(O)N=C([NH3+])N=C1 Intermediate Fragment 
148 310.1509805401 CCCN(C)C1=C(O)N=C([NH3+])N=C1N=C1CC(O)C(=CO)O1 Intermediate Fragment 
149 310.1509805401 CCCNC1=C(O)N=C([NH3+])N=C1N(C)C1CC(O)C(=C=O)O1 Intermediate Fragment 
150 310.1509805401 CCCN1CN(CCC(O)C(=O)C=O)C2=NC([NH3+])=NC(O)=C21 Intermediate Fragment 
151 292.1404158561 CCCN1CN(CC=C(O)C#CO)C2=NC([NH3+])=NC(O)=C21
152 274.1298511721 C#CC(O)=CCN1CN(C=CC)C2=C(O)N=C([NH3+])N=C21
153 274.1298511721 CCCN1CN(CC#CC#CO)C2=NC([NH3+])=NC(O)=C21
154 254.1611513001 CCCN1CN(CCCO)C2=NC([NH3+])=NC(O)=C21
155 252.1455012361 CCCN1CN(CC=CO)C2=NC([NH3+])=NC(O)=C21
156 248.1142011081 CC=CN1CN(CC#CO)C2=NC([NH3+])=NC(O)=C21
157 226.1662366801 CCCN1CN(CC)C2=NC([NH3+])=NC(O)C21
158 224.1505866161 CCCN1CN(CC)C2=NC([NH3+])=NC(O)=C21
159 222.1349365521 CC=CN1CN(CC)C2=NC([NH3+])=NC(O)=C21
160 220.1192864881 CC#CN1CN(CC)C2=NC([NH3+])=NC(O)=C21
161 218.1036364241 C=CN1CN(C#CC)C2=C(O)N=C([NH3+])N=C21
162 178.0723362961 C=CN1C=NC2=C(O)N=C([NH3+])N=C21
163 310.1509805401 CCCN1CN(C(C)OC(=C=O)CO)C2=NC([NH3+])=NC(O)=C21 Intermediate Fragment 
164 238.1298511721 CCCN1CN(C(C)=O)C2=NC([NH3+])=NC(O)=C21
165 310.1509805401 CCCN1CN(C(CCO)OC#CO)C2=NC([NH3+])=NC(O)=C21 Intermediate Fragment 
166 268.1404158561 CCCN1CN(C(=O)CCO)C2=NC([NH3+])=NC(O)=C21
167 310.1509805401 CCCN1CN(C(=O)CC(O)C=CO)C2=NC([NH3+])=NC(O)=C21 Intermediate Fragment 
168 266.1247657921 CCCN1CN(C(=O)C=CO)C2=NC([NH3+])=NC(O)=C21
169 264.1091157281 CCCN1CN(C(=O)C#CO)C2=NC([NH3+])=NC(O)=C21
170 57.0334912001 C#CC[OH2+]
171 77.0597059481 OCCC[OH2+]
172 224.1142011081 CCCN1CN(C=O)C2=NC([NH3+])=NC(O)=C21
173 222.0985510441 CC=CN1CN(C=O)C2=NC([NH3+])=NC(O)=C21
