#In-silico ESI-MS/MS [M+H]+ Spectra
#PREDICTED BY CFM-ID 4.0.8
#SMILES=n1cnc2c(c1NC1c3c(C(C(C1O)O)O)cc1c4c3ccc3c4c(cc1)ccc3)ncn2[C@@H]1O[C@H](CO)[C@@H](C1)O
#InChiKey=CTZMKJGEZSMRHR-YZFWHSBHSA-N
energy0
420.14550 100.00 42 35 32 (29.473 6.807 0.90063)
438.15607 50.55 61 108 98 90 119 87 130 106 73 68 107 122 118 85 111 82 109 115 110 114 124 116 113 112 (17.985 0.45582 0.15913 0.080988 0.021156 0.021121 0.012659 0.011356 0.0079922 0.0066453 0.0065282 0.0058526 0.0036244 0.0026102 0.0024376 0.0022028 0.0019872 0.0019725 0.0017507 0.0013016 0.0012271 0.00040024 0.00039854 0.00030093)
536.19285 30.31 39 34 140 31 47 49 139 38 185 48 (4.6186 3.2003 1.7459 0.60444 0.32304 0.26265 0.21958 0.19572 0.061714 0.037586)
554.20341 53.42 0 202 172 158 184 148 200 168 182 141 171 147 144 179 174 180 176 177 181 173 194 145 178 175 (18.651 0.64886 0.21843 0.11754 0.10933 0.068433 0.020515 0.008564 0.0044082 0.0034435 0.0026133 0.0020327 0.0014716 0.0011422 0.00076328 0.00067124 0.00041354 0.00041115 0.00039477 0.00037892 0.00031275 0.0002371 0.00014319 8.2742e-05)
energy1
136.06177 7.95 19 (5.9278)
420.14550 100.00 42 32 35 (68.583 4.0007 1.9782)
energy2
75.04406 4.10 27 (1.0685)
134.04612 33.74 16 (8.79)
136.06177 100.00 19 (26.053)
138.07742 3.21 66 (0.8352)
234.09855 6.07 23 26 22 (0.72365 0.61314 0.24481)
287.10666 12.14 7 8 (1.8219 1.3419)
301.08592 3.28 14 (0.85461)
303.10157 4.80 10 13 12 (0.65414 0.31655 0.2797)
305.11722 8.34 6 9 (1.1461 1.027)
376.11929 3.32 97 100 (0.43859 0.42628)
378.13494 23.15 96 101 (3.2806 2.7503)
408.14550 14.84 104 95 (2.3116 1.5551)
409.12952 4.58 126 86 88 (0.7644 0.24688 0.18266)
411.14517 13.14 127 83 123 70 (1.8133 0.5949 0.56684 0.44841)
420.14550 36.76 42 35 32 (4.866 4.2009 0.5114)
421.12952 12.78 128 69 84 131 (1.1416 0.83002 0.79109 0.56699)
436.14042 5.24 89 81 129 60 (0.7399 0.42385 0.14743 0.054584)
438.15607 17.76 61 124 73 98 90 87 108 85 130 82 106 68 110 122 119 107 115 112 114 116 109 118 111 113 (0.96016 0.81333 0.50311 0.38822 0.35718 0.2885 0.14984 0.14817 0.13807 0.11821 0.10923 0.10793 0.063005 0.061941 0.061339 0.059145 0.052347 0.050055 0.043616 0.043606 0.034919 0.029233 0.029007 0.01759)

0 554.2034100361 OCC1OC(n2cnc3c([NH2+]C4c5c(cc6ccc7cccc8ccc5c6c78)C(O)C(O)C4O)ncnc32)CC1O
1 237.0982166961 OC1CC(N2C=NC3=CN=CN=C32)OC1C[OH2+]
2 311.1641710161 O=C1C(=[OH+])C=C2C(=C1O)C=C1CCC3CCCC4CCC2C1C34
3 309.1485209521 O=C1C(=[OH+])C=C2C(=C1O)C=C1CCC3CCCC4CCC2=C1C34
4 307.1328708881 O=C1C(=[OH+])C=C2C(=C1O)C=C1CCC3CCCC4C=CC2=C1C43
5 289.1223062041 OC1=C([OH2+])C=C2C(=C1)C=C1CC=C3CCCC4=C3C1=C2C=C4
6 305.1172208241 OC1=C([OH2+])C=C2C(=C1O)C=C1CC=C3CCCC4=C3C1=C2C=C4
7 287.1066561401 OC1=C2C=C3CC=C4C=CCC5=C4C3=C(C=C5)C2=CC=C1[OH2+]
8 287.1066561401 OC1=C([OH2+])C=C2C(=C1)C=C1CC=C3C=CCC4=C3C1=C2C=C4
9 305.1172208241 O=C=C([OH2+])C=C1C(=C=O)C=C2CCC3CCCC4=C3C2=C1C=C4 Intermediate Fragment 
10 303.1015707601 O=C1C(=[OH+])C=C2C(=C1O)C=C1C=CC3CCCC4=C3C1=C2C=C4
11 285.0910060761 O=C1C=C2C=C3CC=C4C=CCC5=C4C3=C(C=C5)C2=CC1=[OH+]
12 303.1015707601 O=CC(O)=C1C=C2CC=C3C=CCC4=C3C2=C(C=C4)C1=CC=[OH+] Intermediate Fragment 
13 303.1015707601 O=C=C([OH2+])C=C1C(=C=O)C=C2CC=C3CCCC4=C3C2=C1C=C4 Intermediate Fragment 
14 301.0859206961 O=C1C(=[OH+])C=C2C(=C1O)C=C1C=CC3=CCCC4=C3C1=C2C=C4
15 244.0465154721 [NH3+]C1=C2N=CN(C3=CC(=O)C(=C=O)O3)C2=NC=N1
16 134.0461215481 [NH2+]=C1N=CN=C2N=CN=C12
17 246.0621655361 [NH3+]C1=C2N=CN(C3CC(=O)C(=C=O)O3)C2=NC=N1
18 248.0778156001 [NH3+]C1=C2N=CN(C3CC(O)C(=C=O)O3)C2=NC=N1
19 136.0617716121 [NH2+]=C1N=CN=C2NCN=C12
20 250.0934656641 [NH3+]C1=C2N=CN(C3CC(O)C(=CO)O3)C2=NC=N1
21 252.1091157281 [NH3+]C1=C2N=CN(C3CC(O)C(CO)O3)C2=NC=N1
22 234.0985510441 C=C1OC(N2C=NC3=C([NH3+])N=CN=C32)CC1O
23 234.0985510441 [NH3+]C1=C2N=CN(C3CCC(=CO)O3)C2=NC=N1
24 252.1091157281 CC(OC(=CO)CO)N1C=NC2=C([NH3+])N=CN=C21 Intermediate Fragment 
25 252.1091157281 [NH3+]C1=C2N=CN(C(=O)CC(O)CCO)C2=NC=N1 Intermediate Fragment 
26 234.0985510441 [NH3+]C1=C2N=CN(CCC(O)C#CO)C2=NC=N1
27 75.0440558841 OCC=C[OH2+]
28 89.0597059481 CC(O)C=C[OH2+]
29 254.1247657921 [NH3+]C1=C2NCN(C3CC(O)C(CO)O3)C2=NC=N1
30 256.1404158561 [NH3+]C1N=CN=C2C1NCN2C1CC(O)C(CO)O1
31 536.1928453521 OCC1OC(N2C=NC3=C([NH+]=C4CC(O)=C(O)C5=C4C4=C6C(=C5)CC=C5C=CCC(=C56)C=C4)N=CN=C32)CC1O
32 420.1455012361 O=C1C(O)=CC(=[NH+]C2=C3NCNC3=NC=N2)C2=C1C=C1CC=C3C=CCC4=C3C1=C2C=C4
33 422.1611513001 O=C1C(O)=CC(=[NH+]C2=C3NCNC3=NC=N2)C2=C1C=C1CC=C3CCCC4=C3C1=C2C=C4
34 536.1928453521 O=C1C=C(O)C2=C(C1=[NH+]C1=C3NCN(C4CC(O)C(CO)O4)C3=NC=N1)C1=C3C(=C2)CC=C2C=CCC(=C23)C=C1
35 420.1455012361 O=C1C=C(O)C2=C(C1=[NH+]C1=C3NCNC3=NC=N1)C1=C3C(=C2)CC=C2C=CCC(=C23)C=C1
36 422.1611513001 O=C1C=C(O)C2=C(C1=[NH+]C1=C3NCNC3=NC=N1)C1=C3C(=C2)CC=C2CCCC(=C23)C=C1
37 518.1822806681 O=C1C=C(O)C2=C(C1=[NH+]C1=C3N=CN(C4CCC(CO)O4)C3=NC=N1)C1=C3C(=C2)CC=C2C=CCC(=C23)C=C1
38 536.1928453521 O=C1C=C(O)C2=C(C1=[NH+]C1=C3N=CN(CCC(O)C(O)CO)C3=NC=N1)C1=C3C(=C2)CC=C2C=CCC(=C23)C=C1 Intermediate Fragment 
39 536.1928453521 O=C1C(O)=CC2=C(C1=[NH+]C1=C3NCN(C4CC(O)C(CO)O4)C3=NC=N1)C1=C3C(=C2)CC=C2C=CCC(=C23)C=C1
40 518.1822806681 O=C1C=CC2=C(C1=[NH+]C1=C3N=CN(C4CC(O)C(CO)O4)C3=NC=N1)C1=C3C(=C2)CC=C2C=CCC(=C23)C=C1
41 418.1298511721 O=C1C(O)=CC2=C(C1=[NH+]C1=C3N=CNC3=NC=N1)C1=C3C(=C2)CC=C2C=CCC(=C23)C=C1
42 420.1455012361 O=C1C(O)=CC2=C(C1=[NH+]C1=C3NCNC3=NC=N1)C1=C3C(=C2)CC=C2C=CCC(=C23)C=C1
43 422.1611513001 O=C1C(O)=CC2=C(C1=[NH+]C1=C3NCNC3=NC=N1)C1=C3C(=C2)CC=C2CCCC(=C23)C=C1
44 426.1924514281 O=C1C(O)=CC2=C(C1=[NH+]C1=C3NCNC3=NC=N1)C1=C3C(=C2)CCC2CCCC(C=C1)C32
45 518.1822806681 CC1OC(N2C=NC3=C([NH+]=C4C(=O)C(O)=CC5=C4C4=C6C(=C5)CC=C5C=CCC(=C56)C=C4)N=CN=C32)CC1O
46 518.1822806681 O=C1C(O)=CC2=C(C1=[NH+]C1=C3N=CN(C4CCC(CO)O4)C3=NC=N1)C1=C3C(=C2)CC=C2C=CCC(=C23)C=C1
47 536.1928453521 O=C=CC1=C(C(C=O)=[NH+]C2=C3NCN(C4CC(O)C(CO)O4)C3=NC=N2)C2=C3C(=C1)CC=C1C=CCC(=C13)C=C2 Intermediate Fragment 
48 536.1928453521 C=C(O)C(=O)C(=[NH+]C1=C2N=CN(C3CC(O)C(CO)O3)C2=NC=N1)C1=CC=C2CC=C3C=CCC4=C3C2=C1C=C4 Intermediate Fragment 
49 536.1928453521 O=C1C(O)=CC2=C(C1=[NH+]C1=C3N=CN(CCC(O)C(O)CO)C3=NC=N1)C1=C3C(=C2)CC=C2C=CCC(=C23)C=C1 Intermediate Fragment 
50 518.1822806681 O=C1C(O)=CC2=C(C1=[NH+]C1=C3N=CN(CCC(O)C=CO)C3=NC=N1)C1=C3C(=C2)CC=C2C=CCC(=C23)C=C1
51 119.0702706321 OC1CCOC1C[OH2+]
52 119.0702706321 O=CCC(O)CC[OH2+] Intermediate Fragment 
53 117.0546205681 OC1CCOC1=C[OH2+]
54 99.0440558841 C=C1OCC=C1[OH2+]
55 117.0546205681 CCC(O)C(=O)C=[OH+] Intermediate Fragment 
56 99.0440558841 CC=C(O)C#C[OH2+]
57 117.0546205681 O=CCC(O)C=C[OH2+] Intermediate Fragment 
58 115.0389705041 OC1CCOC1=C=[OH+]
59 111.0076703761 O=C1C=COC1=C=[OH+]
60 436.1404158561 O=C1C(=[NH+]C2=C3NCNC3=NC=N2)C2=C(C=C3CC=C4C=CCC5=C4C3=C2C=C5)C(O)=C1O
61 438.1560659201 O=C1C(=[NH+]C2=C3NCNC3=NC=N2)C2=C(C=C3CC=C4CCCC5=C4C3=C2C=C5)C(O)=C1O
62 318.1124697921 [NH2+]=C1C(=O)C(=O)C(=O)C2=C1C1=C3C(=C2)CCC2CCCC(=C32)C=C1
63 316.0968197281 [NH2+]=C1C(=O)C(=O)C(=O)C2=C1C1=C3C(=C2)C=CC2CCCC(=C32)C=C1
64 121.0508725801 C1=NC2=NC=[NH+]CC2=N1
65 299.0702706321 O=C1C(=[OH+])C=C2C(=C1O)C=C1C=CC3=CC=CC4=C3C1=C2C=C4
66 138.0774216761 [NH2+]=C1N=CN=C2NCNC12
67 140.0930717401 [NH3+]C1N=CN=C2NCNC21
68 438.1560659201 N=C=NC1=C(C=[NH+]C2=C3C(=C(O)C(O)=C2O)C=C2CC=C4C=CCC5=C4C2=C3C=C5)NCN1 Intermediate Fragment 
69 421.1295168241 C#[N+]C1=C(C=NC2=C3C(=C(O)C(O)=C2O)C=C2CC=C4C=CCC5=C4C2=C3C=C5)N=CN1
70 411.1451668881 [NH2+]=C1NCNC1=C=NC1=C2C(=C(O)C(=O)C1=O)C=C1CC=C3CCCC4=C3C1=C2C=C4
71 396.1342678561 O=C1C(=O)C([NH+]=CC2=CNCN2)=C2C(=C1O)C=C1CC=C3C=CCC4=C3C1=C2C=C4
72 394.1186177921 O=C1C(=O)C([NH+]=CC2=CNC=N2)=C2C(=C1O)C=C1CC=C3C=CCC4=C3C1=C2C=C4
73 438.1560659201 OC1=C(O)C([NH+]=CN=C=NC2=CNCN2)=C2C(=C1O)C=C1CC=C3C=CCC4=C3C1=C2C=C4 Intermediate Fragment 
74 345.1233688241 [NH3+]C=NC1=C2C(=C(O)C(=O)C1=O)C=C1C=CC3CCCC4=C3C1=C2C=C4
75 357.1233688241 C=[NH+]C=NC1=C2C(=C(O)C(=O)C1=O)C=C1CC=C3CCCC4=C3C1=C2C=C4
76 368.1029677281 N=C=[NH+]C=NC1=C2C(=C(O)C(=O)C1=O)C=C1CC=C3C=CCC4=C3C1=C2C=C4
77 370.1186177921 N=C=[NH+]C=NC1=C2C(=C(O)C(=O)C1=O)C=C1CC=C3CCCC4=C3C1=C2C=C4
78 328.0968197281 C=[NH+]C1=C2C(=C(O)C(=O)C1=O)C=C1CC=C3C=CCC4=C3C1=C2C=C4
79 330.1124697921 C=[NH+]C1=C2C(=C(O)C(=O)C1=O)C=C1CC=C3CCCC4=C3C1=C2C=C4
80 332.1281198561 C=[NH+]C1=C2C(=C(O)C(=O)C1=O)C=C1CCC3CCCC4=C3C1=C2C=C4
81 436.1404158561 OC1=C(O)C(N=C[NH+]=C=NC2=CN=CN2)=C2C(=C1O)C=C1CC=C3C=CCC4=C3C1=C2C=C4
82 438.1560659201 N=C=NC(=[NH+]C1=C2C(=C(O)C(O)=C1O)C=C1CC=C3C=CCC4=C3C1=C2C=C4)C1=CNCN1 Intermediate Fragment 
83 411.1451668881 [NH3+]C(=NC1=C2C(=C(O)C(=O)C1=O)C=C1C=CC3=CCCC4=C3C1=C2C=C4)C1=CNCN1
84 421.1295168241 C#[N+]C(=NC1=C2C(=C(O)C(O)=C1O)C=C1CC=C3C=CCC4=C3C1=C2C=C4)C1=CNC=N1
85 438.1560659201 C=NC([NH+]=C1C(=O)C(O)=C(O)C2=C1C1=C3C(=C2)CC=C2C=CCC(=C23)C=C1)=C1NCNC1=N Intermediate Fragment 
86 409.1295168241 [NH2+]=C1NCNC1=C=NC1=C2C(=C(O)C(=O)C1=O)C=C1CC=C3C=CCC4=C3C1=C2C=C4
87 438.1560659201 C=NC1=C(C(N)=[NH+]C2=C3C(=C(O)C(O)=C2O)C=C2CC=C4C=CCC5=C4C2=C3C=C5)N=CN1 Intermediate Fragment 
88 409.1295168241 [NH3+]C(=NC1=C2C(=C(O)C(=O)C1=O)C=C1C=CC3=CC=CC4=C3C1=C2C=C4)C1=CNCN1
89 436.1404158561 C#[N+]C1=C(C(N)=NC2=C3C(=C(O)C(O)=C2O)C=C2CC=C4C=CCC5=C4C2=C3C=C5)N=CN1
90 438.1560659201 O=C=C(O)C(=[NH+]C1=C2NCNC2=NC=N1)C1=C(C=O)C=C2CC=C3CCCC4=C3C2=C1C=C4 Intermediate Fragment 
91 231.0804413921 [OH+]=CC1=CC2=C3C(=C1)C=CC1=CC=CC(=C13)C=C2
92 229.0647913281 [O+]#CC1=CC2=C3C(=C1)C=CC1=CC=CC(=C13)C=C2
93 208.0829009801 OC=C(O)C=[NH+]C1=C2NCNC2=NC=N1
94 406.1298511721 O=C=C(O)C(=[NH+]C1=C2N=CNC2=NC=N1)C1=CC=C2CC=C3C=CCC4=C3C2=C1C=C4
95 408.1455012361 O=CC(=[NH+]C1=C2NCNC2=NC=N1)C1=C(C=O)C=C2CC=C3C=CCC4=C3C2=C1C=C4
96 378.1349365521 O=C=C1C=C2CC=C3C=CCC4=C3C2=C(C=C4)C1=C=[NH+]C1=C2NCNC2=NC=N1
97 376.1192864881 O=C=C1C=C2CC=C3C=CCC4=C3C2=C(C=C4)C1=C=[NH+]C1=C2N=CNC2=NC=N1
98 438.1560659201 O=C=C(O)C1=C(C(C=O)=[NH+]C2=C3NCNC3=NC=N2)C2=C3C(=C1)CC=C1CCCC(=C13)C=C2 Intermediate Fragment 
99 261.0910060761 O=C(C=[OH+])C1=CC2=C3C(=C1)C=CC1=CCCC(=C13)C=C2
100 376.1192864881 [O+]#CC(=NC1=C2N=CNC2=NC=N1)C1=CC=C2CC=C3C=CCC4=C3C2=C1C=C4
101 378.1349365521 O=CC(=[NH+]C1=C2N=CNC2=NC=N1)C1=CC=C2CC=C3C=CCC4=C3C2=C1C=C4
102 380.1505866161 O=CC(=[NH+]C1=C2NCNC2=NC=N1)C1=CC=C2CC=C3C=CCC4=C3C2=C1C=C4
103 382.1662366801 O=CC(=[NH+]C1=C2NCNC2=NC=N1)C1=CC=C2CC=C3CCCC4=C3C2=C1C=C4
104 408.1455012361 O=CC(O)=C1C=C2CC=C3C=CCC4=C3C2=C(C=C4)C1=C=[NH+]C1=C2NCNC2=NC=N1
105 406.1298511721 O=CC(O)=C1C=C2CC=C3C=CCC4=C3C2=C(C=C4)C1=C=[NH+]C1=C2N=CNC2=NC=N1
106 438.1560659201 O=C=C(O)C(O)=C1C=C2CC=C3CCCC4=C3C2=C(C=C4)C1=C=[NH+]C1=C2NCNC2=NC=N1 Intermediate Fragment 
107 438.1560659201 O=C(C=[NH+]C1=C2NCNC2=NC=N1)C(O)=C(O)C1=CC2=C3C(=C1)CC=C1C=CCC(=C13)C=C2 Intermediate Fragment 
108 438.1560659201 O=C=C(O)C(=O)C(=[NH+]C1=C2NCNC2=NC=N1)C1=CC=C2CC=C3CCCC4=C3C2=C1C=C4 Intermediate Fragment 
109 438.1560659201 C=C1CC=C2C=CCC3=C2C1=C(C1=CC(O)=C(O)C(=O)C1=[NH+]C1=C2NCNC2=NC=N1)C=C3 Intermediate Fragment 
110 438.1560659201 C=C1CC=CC2=C1C1=C(C)C3=C(C=C1C=C2)C(O)=C(O)C(=O)C3=[NH+]C1=C2NCNC2=NC=N1 Intermediate Fragment 
111 438.1560659201 C=C=C1CCCC2=C1C1=CC3=C(C=C1C=C2)C(O)=C(O)C(=O)C3=[NH+]C1=C2NCNC2=NC=N1 Intermediate Fragment 
112 438.1560659201 C=C=C1CCCC2=C1C1=C(C=C2)C2=C(C=C1)C(O)=C(O)C(=O)C2=[NH+]C1=C2NCNC2=NC=N1 Intermediate Fragment 
113 438.1560659201 C=CC1=CC2=C(C(=[NH+]C3=C4NCNC4=NC=N3)C(=O)C(O)=C2O)C2=C1C1=C(C=C2)CCC=C1 Intermediate Fragment 
114 438.1560659201 C=CC1=C2C(C)=CCC3=CC4=C(C(=[NH+]C5=C6NCNC6=NC=N5)C(=O)C(O)=C4O)C(=C32)C=C1 Intermediate Fragment 
115 438.1560659201 C=CC1=CCC2=CC3=C(C(=[NH+]C4=C5NCNC5=NC=N4)C(=O)C(O)=C3O)C3=C2C1=C(C)C=C3 Intermediate Fragment 
116 438.1560659201 CC=CC1=CCC2=CC3=C(C(=[NH+]C4=C5NCNC5=NC=N4)C(=O)C(O)=C3O)C3=C2C1=CC=C3 Intermediate Fragment 
117 398.1247657921 O=C1C(=O)C(=[NH+]C2=C3NCNC3=NC=N2)C2=C(C=C3CCCC4=CC=CC2=C43)C1=O
118 438.1560659201 C=CCC1=C2C=CCC3=CC4=C(C(=[NH+]C5=C6NCNC6=NC=N5)C(=O)C(O)=C4O)C(=C32)C=C1 Intermediate Fragment 
119 438.1560659201 NCNC1=NC=NC([NH+]=C2C(=O)C(O)=C(O)C3=C2C2=C4C(=C3)CC=C3C=CCC(=C34)C=C2)=C1 Intermediate Fragment 
120 396.1342678561 O=C1C(=O)C(=[NH+]C2=CC=NC=N2)C2=C(C=C3CCC4CCCC5=C4C3=C2C=C5)C1=O
121 394.1186177921 O=C1C(=O)C(=[NH+]C2=CC=NC=N2)C2=C(C=C3CC=C4CCCC5=C4C3=C2C=C5)C1=O
122 438.1560659201 NCNC1=C([NH+]=C2C(=O)C(O)=C(O)C3=C2C2=C4C(=C3)CC=C3C=CCC(=C34)C=C2)N=CN=C1 Intermediate Fragment 
123 411.1451668881 NC1=C([NH+]=C2C(=O)C(=O)C(=O)C3=C2C2=C4C(=C3)CCC3CCCC(=C43)C=C2)N=CN=C1
124 438.1560659201 CNC1=C([NH+]=C2C(=O)C(O)=C(O)C3=C2C2=C4C(=C3)CC=C3C=CCC(=C34)C=C2)N=CN=C1N Intermediate Fragment 
125 407.1138667601 NC1=NC=NC([NH+]=C2C(=O)C(=O)C(=O)C3=C2C2=C4C(=C3)CC=C3C=CCC(=C34)C=C2)=C1
126 409.1295168241 NC1=NC=NC([NH+]=C2C(=O)C(=O)C(=O)C3=C2C2=C4C(=C3)CC=C3CCCC(=C34)C=C2)=C1
127 411.1451668881 NC1=NC=NC([NH+]=C2C(=O)C(=O)C(=O)C3=C2C2=C4C(=C3)CCC3CCCC(=C43)C=C2)=C1
128 421.1295168241 C=NC1=C([NH+]=C2C(=O)C(O)=C(O)C3=C2C2=C4C(=C3)CC=C3C=CCC(=C34)C=C2)N=CN=C1
129 436.1404158561 C=NC1=C([NH+]=C2C(=O)C(O)=C(O)C3=C2C2=C4C(=C3)CC=C3C=CCC(=C34)C=C2)N=CN=C1N
130 438.1560659201 CNC1=NC=NC([NH+]=C2C(=O)C(O)=C(O)C3=C2C2=C4C(=C3)CC=C3C=CCC(=C34)C=C2)=C1N Intermediate Fragment 
131 421.1295168241 C=NC1=NC=NC([NH+]=C2C(=O)C(O)=C(O)C3=C2C2=C4C(=C3)CC=C3C=CCC(=C34)C=C2)=C1
132 440.1717159841 O=C1C(=[NH+]C2=C3NCNC3=NC=N2)C2=C(C=C3CCC4CCCC5=C4C3=C2C=C5)C(O)=C1O
133 442.1873660481 O=C1C(=[NH+]C2=C3NCNC3=NC=N2)C2=C(C=C3CCC4CCCC5C=CC2=C3C54)C(O)=C1O
134 444.2030161121 O=C1C(=[NH+]C2=C3NCNC3=NC=N2)C2=C(C=C3CCC4CCCC5CCC2=C3C45)C(O)=C1O
135 426.1924514281 O=C1C=C(O)C2=C(C1=[NH+]C1=C3NCNC3=NC=N1)C1=C3C(=C2)CCC2CCCC(C=C1)C32
136 522.1771952881 O=C1C(=[NH+]C2=C3NCN(C4CC(O)CO4)C3=NC=N2)C2=C(C=C3CC=C4C=CCC5=C4C3=C2C=C5)C(O)=C1O
137 524.1928453521 O=C1C(=[NH+]C2=C3NCN(C4CC(O)CO4)C3=NC=N2)C2=C(C=C3CC=C4CCCC5=C4C3=C2C=C5)C(O)=C1O
138 526.2084954161 O=C1C(=[NH+]C2=C3NCN(C4CC(O)CO4)C3=NC=N2)C2=C(C=C3CCC4CCCC5=C4C3=C2C=C5)C(O)=C1O
139 536.1928453521 CC1OC(N2CNC3=C([NH+]=C4C(=O)C(O)=C(O)C5=C4C4=C6C(=C5)CC=C5C=CCC(=C56)C=C4)N=CN=C32)CC1O
140 536.1928453521 O=C1C(=[NH+]C2=C3NCN(C4CCC(CO)O4)C3=NC=N2)C2=C(C=C3CC=C4C=CCC5=C4C3=C2C=C5)C(O)=C1O
141 554.2034100361 N=C=NC1=C(C=[NH+]C2=C3C(=C(O)C(O)=C2O)C=C2CC=C4C=CCC5=C4C2=C3C=C5)NCN1C1CC(O)C(CO)O1 Intermediate Fragment 
142 537.1768609401 C=[NH+]C1=C(C=NC2=C3C(=C(O)C(O)=C2O)C=C2CC=C4C=CCC5=C4C2=C3C=C5)N=CN1C1CC(O)C(=CO)O1
143 527.1925110041 [NH2+]=C1C(=C=NC2=C3C(=C(O)C(O)=C2O)C=C2CC=C4C=CCC5=C4C2=C3C=C5)NCN1C1CC(O)C(CO)O1
144 554.2034100361 OCC1OC(N2CNC=C2N=C=NC=[NH+]C2=C3C(=C(O)C(O)=C2O)C=C2CC=C4C=CCC5=C4C2=C3C=C5)CC1O Intermediate Fragment 
145 554.2034100361 N=C=NC(=[NH+]C1=C2C(=C(O)C(O)=C1O)C=C1CC=C3C=CCC4=C3C1=C2C=C4)C1=CN(C2CC(O)C(CO)O2)CN1 Intermediate Fragment 
146 537.1768609401 C=[NH+]C(=NC1=C2C(=C(O)C(O)=C1O)C=C1CC=C3C=CCC4=C3C1=C2C=C4)C1=CN(C2CC(O)C(=CO)O2)C=N1
147 554.2034100361 C=NC1=C(C(N)=[NH+]C2=C3C(=C(O)C(O)=C2O)C=C2CC=C4C=CCC5=C4C2=C3C=C5)N=CN1C1CC(O)C(CO)O1 Intermediate Fragment 
148 554.2034100361 O=C=C(O)C(=[NH+]C1=C2NCN(C3CC(O)C(CO)O3)C2=NC=N1)C1=C(C=O)C=C2CC=C3CCCC4=C3C2=C1C=C4 Intermediate Fragment 
149 324.1302450961 OC=C(O)C=[NH+]C1=C2NCN(C3CC(O)C(CO)O3)C2=NC=N1
150 524.1928453521 O=C=C(O)C(=[NH+]C1=C2NCN(C3CC(O)C(CO)O3)C2=NC=N1)C1=CC=C2CC=C3C=CCC4=C3C2=C1C=C4
151 526.2084954161 O=C=C(O)C(=[NH+]C1=C2NCN(C3CC(O)C(CO)O3)C2=NC=N1)C1=CC=C2CC=C3CCCC4=C3C2=C1C=C4
152 526.2084954161 O=CC(=[NH+]C1=C2NCN(C3CC(O)C(CO)O3)C2=NC=N1)C1=C(C=O)C=C2CC=C3CCCC4=C3C2=C1C=C4
153 524.1928453521 O=CC(=[NH+]C1=C2NCN(C3CC(O)C(CO)O3)C2=NC=N1)C1=C(C=O)C=C2CC=C3C=CCC4=C3C2=C1C=C4
154 496.1979307321 O=C=C1C=C2CC=C3CCCC4=C3C2=C(C=C4)C1=C=[NH+]C1=C2NCN(C3CC(O)C(CO)O3)C2=NC=N1
155 494.1822806681 O=C=C1C=C2CC=C3C=CCC4=C3C2=C(C=C4)C1=C=[NH+]C1=C2NCN(C3CC(O)C(CO)O3)C2=NC=N1
156 476.1717159841 C=C1C=C2CC=C3C=CCC4=C3C2=C(C=C4)C1=C=[NH+]C1=C2N=CN(C3CC(O)C(=CO)O3)C2=NC=N1
157 492.1666306041 O=C=C1C=C2CC=C3C=CCC4=C3C2=C(C=C4)C1=C=[NH+]C1=C2N=CN(C3CC(O)C(CO)O3)C2=NC=N1
158 554.2034100361 O=C=C(O)C1=C(C(C=O)=[NH+]C2=C3NCN(C4CC(O)C(CO)O4)C3=NC=N2)C2=C3C(=C1)CC=C1CCCC(=C13)C=C2 Intermediate Fragment 
159 492.1666306041 O=CC(=[NH+]C1=C2N=CN(C3CC(O)C(=CO)O3)C2=NC=N1)C1=CC=C2CC=C3C=CCC4=C3C2=C1C=C4
160 464.1717159841 OCC1OC(N2C=NC3=C([NH+]=C=C4C=CC5=CC=C6C=CCC7=C6C5=C4C=C7)N=CN=C32)CC1O
161 494.1822806681 O=CC(=[NH+]C1=C2N=CN(C3CC(O)C(CO)O3)C2=NC=N1)C1=CC=C2CC=C3C=CCC4=C3C2=C1C=C4
162 494.1822806681 O=CC(=[NH+]C1=C2N=CN(C(=O)CC(O)CCO)C2=NC=N1)C1=CC=C2CC=C3C=CCC4=C3C2=C1C=C4 Intermediate Fragment 
163 496.1979307321 O=CC(=[NH+]C1=C2NCN(C3CC(O)C(CO)O3)C2=NC=N1)C1=CC=C2CC=C3C=CCC4=C3C2=C1C=C4
164 498.2135807961 O=CC(=[NH+]C1=C2NCN(C3CC(O)C(CO)O3)C2=NC=N1)C1=CC=C2CC=C3CCCC4=C3C2=C1C=C4
165 526.2084954161 O=CC(O)=C1C=C2CC=C3CCCC4=C3C2=C(C=C4)C1=C=[NH+]C1=C2NCN(C3CC(O)C(CO)O3)C2=NC=N1
166 524.1928453521 O=CC(O)=C1C=C2CC=C3C=CCC4=C3C2=C(C=C4)C1=C=[NH+]C1=C2NCN(C3CC(O)C(CO)O3)C2=NC=N1
167 522.1771952881 O=CC(O)=C1C=C2CC=C3C=CCC4=C3C2=C(C=C4)C1=C=[NH+]C1=C2N=CN(C3CC(O)C(CO)O3)C2=NC=N1
168 554.2034100361 O=C=C(O)C(O)=C1C=C2CC=C3CCCC4=C3C2=C(C=C4)C1=C=[NH+]C1=C2NCN(C3CC(O)C(CO)O3)C2=NC=N1 Intermediate Fragment 
169 462.1560659201 OC=C1OC(N2C=NC3=C([NH+]=C=C4C=CC5=CC=C6C=CCC7=C6C5=C4C=C7)N=CN=C32)CC1O
170 466.1873660481 OCC1OC(N2CNC3=C([NH+]=C=C4C=CC5=CC=C6C=CCC7=C6C5=C4C=C7)N=CN=C32)CC1O
171 554.2034100361 O=C(C=[NH+]C1=C2NCN(C3CC(O)C(CO)O3)C2=NC=N1)C(O)=C(O)C1=CC2=C3C(=C1)CC=C1C=CCC(=C13)C=C2 Intermediate Fragment 
172 554.2034100361 O=C=C(O)C(=O)C(=[NH+]C1=C2NCN(C3CC(O)C(CO)O3)C2=NC=N1)C1=CC=C2CC=C3CCCC4=C3C2=C1C=C4 Intermediate Fragment 
173 554.2034100361 C=C1CC=CC2=C1C1=C(C)C3=C(C=C1C=C2)C(O)=C(O)C(=O)C3=[NH+]C1=C2NCN(C3CC(O)C(CO)O3)C2=NC=N1 Intermediate Fragment 
174 554.2034100361 C=C=C1CCCC2=C1C1=CC3=C(C=C1C=C2)C(O)=C(O)C(=O)C3=[NH+]C1=C2NCN(C3CC(O)C(CO)O3)C2=NC=N1 Intermediate Fragment 
175 554.2034100361 C=C=C1CCCC2=C1C1=C(C=C2)C2=C(C=C1)C(O)=C(O)C(=O)C2=[NH+]C1=C2NCN(C3CC(O)C(CO)O3)C2=NC=N1 Intermediate Fragment 
176 554.2034100361 C=CC1=C2C(C)=CCC3=CC4=C(C(=[NH+]C5=C6NCN(C7CC(O)C(CO)O7)C6=NC=N5)C(=O)C(O)=C4O)C(=C32)C=C1 Intermediate Fragment 
177 554.2034100361 C=CC1=CCC2=CC3=C(C(=[NH+]C4=C5NCN(C6CC(O)C(CO)O6)C5=NC=N4)C(=O)C(O)=C3O)C3=C2C1=C(C)C=C3 Intermediate Fragment 
178 554.2034100361 CC=CC1=CCC2=CC3=C(C(=[NH+]C4=C5NCN(C6CC(O)C(CO)O6)C5=NC=N4)C(=O)C(O)=C3O)C3=C2C1=CC=C3 Intermediate Fragment 
179 554.2034100361 C=CCC1=C2C=CCC3=CC4=C(C(=[NH+]C5=C6NCN(C7CC(O)C(CO)O7)C6=NC=N5)C(=O)C(O)=C4O)C(=C32)C=C1 Intermediate Fragment 
180 554.2034100361 NCN(C1=NC=NC([NH+]=C2C(=O)C(O)=C(O)C3=C2C2=C4C(=C3)CC=C3C=CCC(=C34)C=C2)=C1)C1CC(O)C(CO)O1 Intermediate Fragment 
181 554.2034100361 O=C1C(=[NH+]C2=C(NCNC3CC(O)C(CO)O3)C=NC=N2)C2=C(C=C3CC=C4C=CCC5=C4C3=C2C=C5)C(O)=C1O Intermediate Fragment 
182 554.2034100361 CNC1=C([NH+]=C2C(=O)C(O)=C(O)C3=C2C2=C4C(=C3)CC=C3C=CCC(=C34)C=C2)N=CN=C1NC1CC(O)C(CO)O1 Intermediate Fragment 
183 423.1451668881 CNC1=C([NH+]=C2C(=O)C(O)=C(O)C3=C2C2=C4C(=C3)CC=C3C=CCC(=C34)C=C2)N=CN=C1
184 554.2034100361 O=C1C(=[NH+]C2=C3NCN(CCC(O)C(O)CO)C3=NC=N2)C2=C(C=C3CC=C4C=CCC5=C4C3=C2C=C5)C(O)=C1O Intermediate Fragment 
185 536.1928453521 O=C1C(=[NH+]C2=C3N=CN(CCC(O)CCO)C3=NC=N2)C2=C(C=C3CC=C4C=CCC5=C4C3=C2C=C5)C(O)=C1O
186 518.1822806681 C=CC(O)CCN1C=NC2=C([NH+]=C3C(=O)C(O)=C(O)C4=C3C3=C5C(=C4)CC=C4C=CCC(=C45)C=C3)N=CN=C21
187 498.2135807961 O=C1C(=[NH+]C2=C3NCN(CCCO)C3=NC=N2)C2=C(C=C3CCC4CCCC5=C4C3=C2C=C5)C(O)=C1O
188 496.1979307321 O=C1C(=[NH+]C2=C3NCN(CCCO)C3=NC=N2)C2=C(C=C3CC=C4CCCC5=C4C3=C2C=C5)C(O)=C1O
189 494.1822806681 O=C1C(=[NH+]C2=C3NCN(CCCO)C3=NC=N2)C2=C(C=C3CC=C4C=CCC5=C4C3=C2C=C5)C(O)=C1O
190 492.1666306041 O=C1C(=[NH+]C2=C3N=CN(CCCO)C3=NC=N2)C2=C(C=C3CC=C4C=CCC5=C4C3=C2C=C5)C(O)=C1O
191 474.1560659201 O=C1C(O)=CC2=C(C1=[NH+]C1=C3N=CN(CC=CO)C3=NC=N1)C1=C3C(=C2)CC=C2C=CCC(=C23)C=C1
192 466.1873660481 CCN1CNC2=C([NH+]=C3C(=O)C(O)=C(O)C4=C3C3=C5C(=C4)CC=C4CCCC(=C45)C=C3)N=CN=C21
193 462.1560659201 CCN1C=NC2=C([NH+]=C3C(=O)C(O)=C(O)C4=C3C3=C5C(=C4)CC=C4C=CCC(=C45)C=C3)N=CN=C21
194 554.2034100361 CC(OC(CO)CO)N1CNC2=C([NH+]=C3C(=O)C(O)=C(O)C4=C3C3=C5C(=C4)CC=C4C=CCC(=C45)C=C3)N=CN=C21 Intermediate Fragment 
195 464.1717159841 CCN1CNC2=C([NH+]=C3C(=O)C(O)=C(O)C4=C3C3=C5C(=C4)CC=C4C=CCC(=C45)C=C3)N=CN=C21
196 478.1509805401 CC(O)N1C=NC2=C([NH+]=C3C(=O)C(O)=C(O)C4=C3C3=C5C(=C4)CC=C4C=CCC(=C45)C=C3)N=CN=C21
197 480.1666306041 CC(O)N1CNC2=C([NH+]=C3C(=O)C(O)=C(O)C4=C3C3=C5C(=C4)CC=C4C=CCC(=C45)C=C3)N=CN=C21
198 482.1822806681 CC(O)N1CNC2=C([NH+]=C3C(=O)C(O)=C(O)C4=C3C3=C5C(=C4)CC=C4CCCC(=C45)C=C3)N=CN=C21
199 464.1717159841 CC(O)N1CNC2=C([NH+]=C3C(=O)C(O)=CC4=C3C3=C5C(=C4)CC=C4C=CCC(=C45)C=C3)N=CN=C21
200 554.2034100361 O=C1C(=[NH+]C2=C3NCN(C(CCO)OCCO)C3=NC=N2)C2=C(C=C3CC=C4C=CCC5=C4C3=C2C=C5)C(O)=C1O Intermediate Fragment 
201 512.1928453521 O=C1C(=[NH+]C2=C3NCN(C(O)CCO)C3=NC=N2)C2=C(C=C3CC=C4CCCC5=C4C3=C2C=C5)C(O)=C1O
202 554.2034100361 O=C1C(=[NH+]C2=C3NCN(C(O)CC(O)CCO)C3=NC=N2)C2=C(C=C3CC=C4C=CCC5=C4C3=C2C=C5)C(O)=C1O Intermediate Fragment 
203 510.1771952881 O=C1C(=[NH+]C2=C3NCN(C(O)CCO)C3=NC=N2)C2=C(C=C3CC=C4C=CCC5=C4C3=C2C=C5)C(O)=C1O
204 486.2135807961 CC(O)N1CNC2=C([NH+]=C3C(=O)C(O)=C(O)C4=C3C3=C5C(=C4)CCC4CCCC(C=C3)C54)N=CN=C21
205 484.1979307321 CC(O)N1CNC2=C([NH+]=C3C(=O)C(O)=C(O)C4=C3C3=C5C(=C4)CCC4CCCC(=C54)C=C3)N=CN=C21
206 77.0597059481 OCCC[OH2+]
207 466.1509805401 O=C1C(=[NH+]C2=C3NCN(CO)C3=NC=N2)C2=C(C=C3CC=C4C=CCC5=C4C3=C2C=C5)C(O)=C1O
