#In-silico ESI-MS/MS [M+H]+ Spectra
#PREDICTED BY CFM-ID 4.0.8
#SMILES=[nH]1c(nc2c(c1=O)nc(n2C1OC(CO)C(C1)O)[N+](=O)[O-])N
#InChiKey=BECVUBIJIDVYQQ-UHFFFAOYSA-N
energy0
197.04176 100.00 25 34 42 30 40 45 43 (50.53 0.060632 0.039194 0.019094 0.013779 0.01029 0.0040989)
313.08911 85.27 0 185 130 180 83 124 91 112 113 129 166 165 117 119 (42.515 0.3881 0.17653 0.072721 0.018052 0.01558 0.0080532 0.0057215 0.005378 0.0044615 0.0018268 0.00065555 0.00060073 0.00026086)
energy1
150.04104 12.26 27 (7.906)
181.04685 8.93 28 2 (5.594 0.16043)
197.04176 100.00 25 34 30 40 45 42 43 (62.825 0.87005 0.38888 0.1275 0.10989 0.075243 0.063612)
313.08911 6.54 0 185 130 166 112 91 113 180 83 124 129 165 117 119 (3.7507 0.28088 0.065668 0.031699 0.02791 0.015231 0.014897 0.012689 0.0078524 0.0064215 0.0010872 0.0010787 0.00092135 0.000725)
energy2
45.03349 6.34 8 (0.98007)
47.04914 7.89 181 (1.2196)
57.03349 26.19 16 (4.0458)
71.04914 7.20 203 204 (0.7704 0.34156)
73.02841 9.53 161 (1.4721)
99.04406 11.77 11 12 14 (1.3891 0.29902 0.13042)
101.05971 5.28 5 6 (0.46455 0.35081)
117.05462 6.06 10 13 19 18 (0.48276 0.26462 0.13946 0.049399)
125.04579 5.30 44 (0.81853)
150.04104 19.75 27 (3.0506)
152.05669 8.21 78 (1.268)
180.01522 9.96 29 31 (1.5277 0.011389)
181.04685 5.43 28 2 (0.66311 0.17627)
183.05127 5.55 145 (0.85784)
195.02611 11.91 24 39 (1.8213 0.018515)
196.04652 5.85 169 (0.90332)
197.04176 100.00 25 34 40 45 43 30 42 (10.501 1.9343 0.78723 0.74835 0.66728 0.62019 0.19158)
221.04176 22.63 158 159 (2.928 0.56773)
223.05741 78.38 157 72 170 173 (5.8494 5.7452 0.28263 0.23208)
225.03668 7.68 196 195 200 199 (0.52833 0.3161 0.20787 0.13344)
225.06183 5.39 103 64 101 (0.55126 0.18776 0.093677)
227.08871 6.89 155 (1.0648)
239.05233 30.44 167 168 (2.8901 1.8121)
241.09313 8.34 118 (1.289)
245.09928 7.78 186 188 (1.0644 0.13828)
251.05233 7.93 133 151 152 (0.61315 0.36345 0.24871)
253.06798 43.04 69 149 142 184 148 146 141 (1.9818 1.1102 0.98811 0.93602 0.76803 0.60191 0.26335)
267.04724 12.05 182 (1.8612)
269.06289 7.54 75 (1.1646)
277.06798 12.18 135 68 57 56 (1.0858 0.64226 0.11263 0.04147)

0 313.0891085561 [NH3+]c1nc2c(nc([N+](=O)[O-])n2C2CC(O)C(CO)O2)c(=O)[nH]1
1 295.0785438721 NC1=NC=C2N=C([NH+](O)O)N(C3CC(O)C(=C=O)O3)C2=N1
2 181.0468498201 N=C1N=CC2=NC([NH+](O)O)=NC2=N1
3 295.0785438721 NC1=NC=C2N=C([NH+](O)O)N(CC=C(O)C(=O)C=O)C2=N1 Intermediate Fragment 
4 119.0702706321 OC1CCOC1C[OH2+]
5 101.0597059481 C=C1OCCC1[OH2+]
6 101.0597059481 [OH2+]C=C1CCCO1
7 119.0702706321 O=CCC(O)CC[OH2+] Intermediate Fragment 
8 45.0334912001 C=C[OH2+]
9 89.0597059481 CC(O)C=C[OH2+]
10 117.0546205681 OC=CC(O)CC=[OH+]
11 99.0440558841 C=C1OCC=C1[OH2+]
12 99.0440558841 [OH+]=C=C1CCCO1
13 117.0546205681 CCC(O)C(=O)C=[OH+] Intermediate Fragment 
14 99.0440558841 CC=C(O)C#C[OH2+]
15 59.0491412641 CC=C[OH2+]
16 57.0334912001 CC#C[OH2+]
17 61.0284058201 OCC=[OH+]
18 117.0546205681 OCCCOC#C[OH2+] Intermediate Fragment 
19 117.0546205681 CCOC(=C=[OH+])CO Intermediate Fragment 
20 115.0389705041 OC1CCOC1=C=[OH+]
21 87.0440558841 [OH2+]C1=COCC1
22 115.0389705041 CC=C(O)C(=O)C=[OH+] Intermediate Fragment 
23 115.0389705041 O=CCC(O)C#C[OH2+] Intermediate Fragment 
24 195.0261143761 NC1=NC(=O)C2=NC([N+](=O)O)=NC2=N1
25 197.0417644401 NC1=NC(=O)C2=NC([NH+](O)O)=NC2=N1
26 179.0311997561 N=C1N=CC2=NC([N+](=O)O)=NC2=N1
27 150.0410361681 [NH3+]C1=NC(=O)C2=NC=NC2=N1
28 181.0468498201 NC1=NC(=O)C2=NC(=[NH+]O)NC2=N1
29 180.0152153441 O=C1N=CN=C2N=C([N+](=O)O)N=C12
30 197.0417644401 N=C(N)N=C1NC([N+](=O)O)=NC1=C=O Intermediate Fragment 
31 180.0152153441 N=C=NC1=NC([N+](=O)O)=NC1=C=O
32 155.0199663761 N=C1NC([N+](=O)O)=NC1=C=O
33 169.0468498201 N=C(N)N=C1C=NC([N+](=O)O)=N1
34 197.0417644401 NC(=NC=O)N=C1C=NC([N+](=O)O)=N1 Intermediate Fragment 
35 154.0359507881 N#C[NH+]=C1C=NC(N(O)O)=N1
36 152.0203007241 N#CN=C1C=NC([N+](=O)O)=N1
37 127.0250517561 N=C1C=NC([N+](=O)O)=N1
38 71.0239891361 N=C=[NH+]C=O
39 195.0261143761 N=C(N=C=O)N=C1C=NC([N+](=O)O)=N1
40 197.0417644401 N=C=NC(O)=C1N=C([N+](=O)O)NC1=N Intermediate Fragment 
41 170.0308654081 N=C1N=C([N+](=O)O)N=C1C(N)=O
42 197.0417644401 N=C=NC1=C(C(N)=O)N=C([N+](=O)O)N1 Intermediate Fragment 
43 197.0417644401 N=C(N=C1C=NC(N)=NC1=O)[N+](=O)O Intermediate Fragment 
44 125.0457872001 NC1=NC(=O)C(=[NH2+])C=N1
45 197.0417644401 N=C1C(=O)N=C(N)N=C1N=C[N+](=O)O Intermediate Fragment 
46 199.0574145041 NC1=NC(=O)C2=NC([NH+](O)O)NC2=N1
47 201.0730645681 NC1=NC(=O)C2NC([NH+](O)O)NC2=N1
48 203.0887146321 NC1=NC(O)C2NC([NH+](O)O)NC2=N1
49 203.0887146321 NC1=NC(O)=C(NC[NH+](O)O)C(N)=N1 Intermediate Fragment 
50 281.0628938081 NC1=NC(O)=C2N=C([NH+](O)O)N(C3=CC(O)=CO3)C2=N1
51 263.0523291241 NC1=NC(O)=C2N=C([N+](=O)O)N(C3=CC=CO3)C2=N1
52 283.0785438721 NC1=NC(O)=C2N=C([NH+](O)O)N(C3CC(O)=CO3)C2=N1
53 265.0679791881 NC1=NC(O)=C2N=C([NH+](O)O)N(C3=CC=CO3)C2=N1
54 285.0941939361 NC1=NC(O)=C2N=C([NH+](O)O)N(C3CC(O)CO3)C2=N1
55 295.0785438721 C=C1OC(N2C3=NC(N)=NC(O)=C3N=C2[NH+](O)O)C=C1O
56 277.0679791881 C=C1OC(N2C3=NC(N)=NC=C3N=C2[N+](=O)O)C=C1O
57 277.0679791881 C=C1C=CC(N2C3=NC(N)=NC(O)=C3N=C2[N+](=O)O)O1
58 246.0621655361 [CH+]=C1OC(N2C=NC3=C(O)N=C(N)N=C32)C=C1O
59 248.0778156001 C=C1OC(N2C=NC3=C(O)N=C([NH3+])N=C32)C=C1O
60 278.0519947761 C=C1OC(N2C3=NC=NC(O)=C3N=C2[N+](=O)O)C=C1O
61 295.0785438721 C=C1OC(N2C(=NC(=N)N)C(=C=O)N=C2[NH+](O)O)C=C1O Intermediate Fragment 
62 295.0785438721 C=C1OC(N2C(=NC(N)=NC=O)C=NC2[N+](=O)O)C=C1O Intermediate Fragment 
63 252.0727302201 C=C1OC(N2C([NH+]=C=N)=CN=C2N(O)O)CC1=O
64 225.0618311881 C=C1OC(N2C(=[NH2+])C=NC2N(O)O)=CC1=O
65 295.0785438721 C=C1OC(N(C(=N)[N+](=O)O)C2=NC(N)=NC(O)=C2)C=C1O Intermediate Fragment 
66 295.0785438721 C=C1OC(=NC2=NC(N)=NC(O)=C2N=C[NH+](O)O)C=C1O Intermediate Fragment 
67 295.0785438721 CC(=O)C(O)=C=CN1C2=NC(N)=NC(O)=C2N=C1[NH+](O)O Intermediate Fragment 
68 277.0679791881 C#CC(O)=C=CN1C2=NC(N)=NC(O)=C2N=C1[NH+](O)O
69 253.0679791881 NC1=NC(O)=C2N=C([NH+](O)O)N(CC=C=O)C2=N1
70 225.0730645681 C=CN1C2=NC(N)=NC(O)=C2N=C1[NH+](O)O
71 295.0785438721 C=C(C=O)OC(=C)N1C2=NC(N)=NC(O)=C2N=C1[NH+](O)O Intermediate Fragment 
72 223.0574145041 C#CN1C2=NC(N)=NC(O)=C2N=C1[NH+](O)O
73 241.0679791881 CC(=O)N1C2=NC(N)=NC(O)=C2N=C1[NH+](O)O
74 295.0785438721 C#COC(C=CO)N1C2=NC(N)=NC(O)=C2N=C1[NH+](O)O Intermediate Fragment 
75 269.0628938081 NC1=NC(O)=C2N=C([NH+](O)O)N(C(=O)C=CO)C2=N1
76 295.0785438721 C#CC(O)CC(=O)N1C2=NC(N)=NC(O)=C2N=C1[NH+](O)O Intermediate Fragment 
77 264.0727302201 [NH3+]C1=NC(O)=C2N=CN(C3CC(O)C(=C=O)O3)C2=N1
78 152.0566862321 [NH3+]C1=NC(=O)C2=NCNC2=N1
79 266.0883802841 [NH3+]C1=NC(O)=C2N=CN(C3CC(O)C(=CO)O3)C2=N1
80 295.0785438721 NC1=NC(O)=C2N=C([NH2+]O)N(C3CC(O)C(=C=O)O3)C2=N1
81 296.0625594601 O=C=C1OC(N2C3=NC=NC(O)=C3N=C2[NH+](O)O)CC1O
82 182.0308654081 O=C1N=CN=C2N=C([NH+](O)O)N=C12
83 313.0891085561 N=C(N)N=C1C(=C=O)N=C([NH+](O)O)N1C1CC(O)C(=CO)O1 Intermediate Fragment 
84 296.0625594601 NC=[NH+]C1=C(C=O)N=C(N(O)O)N1C1C=C(O)C(=C=O)O1
85 271.0673104921 [NH2+]=C1C(=C=O)N=C(N(O)O)N1C1CC(O)C(=CO)O1
86 271.0673104921 [NH2+]=C1C(=C=O)N=C(N(O)O)N1C(=O)CC(O)C=CO Intermediate Fragment 
87 254.0407613961 O=C=C1OC(N2C=C(C=O)N=C2[NH+](O)O)C=C1O
88 140.0090673441 O=C=C1C=NC([N+](=O)O)=N1
89 254.0407613961 O=CC(=O)C(O)=C=CN1C=C(C=O)N=C1[NH+](O)O Intermediate Fragment 
90 252.0251113321 O=C=C1OC(N2C=C(C=O)N=C2[N+](=O)O)C=C1O
91 313.0891085561 NC(=NC=O)N=C1C=NC([NH+](O)O)N1C1CC(O)C(=C=O)O1 Intermediate Fragment 
92 270.0832949041 NC=[NH+]C1=CN=C(N(O)O)N1C1CC(O)C(=C=O)O1
93 243.0723958721 [NH2+]=C1C=NC(N(O)O)N1C1CC(O)C(=C=O)O1
94 270.0832949041 NC=[NH+]C1=CN=C(N(O)O)N1CC=C(O)C(=O)C=O Intermediate Fragment 
95 270.0832949041 NC=[NH+]C1=CN=C(N(O)O)N1C(=O)CC(O)C#CO Intermediate Fragment 
96 268.0676448401 NC=[NH+]C1=CN=C(N(O)O)N1C1C=C(O)C(=C=O)O1
97 268.0676448401 N=C=[NH+]C1=CN=C(N(O)O)N1CC=C(O)C(=O)C=O Intermediate Fragment 
98 266.0519947761 N=C=[NH+]C1=CN=C(N(O)O)N1C1C=C(O)C(=C=O)O1
99 266.0519947761 N=C=[NH+]C1=CN=C(N(O)O)N1C=C=C(O)C(=O)C=O Intermediate Fragment 
100 245.0880459361 [NH2+]=C1C=NC(N(O)O)N1C1CC(O)C(=CO)O1
101 225.0618311881 [NH2+]=C1C=NC(N(O)O)N1C1C=CC(=C=O)O1
102 243.0723958721 [NH2+]=C1C=NC(N(O)O)N1C(=O)CC(O)C#CO Intermediate Fragment 
103 225.0618311881 [NH2+]=C1C=NC(N(O)O)N1C=C=C(O)C#CO
104 199.0461811241 [NH2+]=C1C=NC(N(O)O)N1C(=O)C#CO
105 228.0614968401 O=C=C1OC(N2C=CN=C2[NH+](O)O)CC1O
106 228.0614968401 O=CC(=O)C(O)=CCN1C=CN=C1[NH+](O)O Intermediate Fragment 
107 226.0458467761 O=C=C1OC(N2C=CN=C2[NH+](O)O)CC1=O
108 224.0301967121 O=C=C1OC(N2C=CN=C2[NH+](O)O)=CC1=O
109 285.0941939361 NC(=[NH2+])N=C1C=NC(N(O)O)N1C1CC(O)C(=C=O)O1
110 283.0785438721 NC(=[NH2+])N=C1C=NC(N(O)O)N1C1C=C(O)C(=C=O)O1
111 311.0734584921 NC(N=C1C=NC(N(O)O)N1C1C=C(O)C(=C=O)O1)=[NH+]C=O
112 313.0891085561 NC(N)=NC(=O)C1=CN(C2CC(O)C(=C=O)O2)C([NH+](O)O)=N1 Intermediate Fragment 
113 313.0891085561 N=C1C(=C(O)N=CN)N=C([NH+](O)O)N1C1CC(O)C(=C=O)O1 Intermediate Fragment 
114 286.0782095241 N=C1C(=C([NH3+])O)N=C(N(O)O)N1C1CC(O)C(=C=O)O1
115 269.0516604281 [NH2+]=C1C(=C=O)N=C(N(O)O)N1C1CC(O)C(=C=O)O1
116 269.0516604281 [NH2+]=C1C(=C=O)N=C(N(O)O)N1CC=C(O)C(=O)C=O Intermediate Fragment 
117 313.0891085561 N=C(N(C1=NC(N)=NC(O)=C1)C1CC(O)C(=C=O)O1)[NH+](O)O Intermediate Fragment 
118 241.0931313161 NC1=NC(O)=CC([NH+]=C2CC(O)C(CO)O2)=N1
119 313.0891085561 NC1=NC(O)=C(N=C(N=C2CC(O)C(=CO)O2)[NH+](O)O)C=N1 Intermediate Fragment 
120 127.0614372641 NC1=NC(=O)C([NH3+])C=N1
121 128.0342194721 [NH2+]=C1CC(O)C(=C=O)O1
122 184.0465154721 NC1=NC(O)=C([N+]#CN(O)O)C=N1
123 188.0778156001 NC1=NC(O)=C([NH2+]CN(O)O)C=N1
124 313.0891085561 NC1=NC(O)=C(N=C[NH+](O)O)C(N=C2CC(O)C(=CO)O2)=N1 Intermediate Fragment 
125 235.0461811241 NC1=NC(O)=CC([NH+]=C2C=C(O)C(=C=O)O2)=N1
126 237.0618311881 NC1=NC(O)=CC([NH+]=C2CC(O)C(=C=O)O2)=N1
127 239.0774812521 NC1=NC(O)=CC([NH+]=C2CC(O)C(=CO)O2)=N1
128 252.0727302201 NC1=NC(O)=C([NH3+])C(N=C2CC(O)C(=C=O)O2)=N1
129 313.0891085561 NC1=NC(O)=C(N)C(N(C[NH+](O)O)C2C=C(O)C(=C=O)O2)=N1 Intermediate Fragment 
130 313.0891085561 NC1=NC(O)=C2N=C([NH+](O)O)N(CCC(O)C(=O)C=O)C2=N1 Intermediate Fragment 
131 295.0785438721 NC1=NC(O)=C2N=C([NH+](O)O)N(CC=C(O)C#CO)C2=N1
132 267.0836292521 C=C(O)C=CN1C2=NC(N)=NC(O)=C2N=C1[NH+](O)O
133 251.0523291241 NC1=NC(O)=C2N=C([NH+](O)O)N(C=C=C=O)C2=N1
134 249.0366790601 NC1=NC(O)=C2N=C([N+](=O)O)N(C=C=C=O)C2=N1
135 277.0679791881 NC1=NC(O)=C2N=C([NH+](O)O)N(CC#CC#CO)C2=N1
136 257.0992793161 NC1=NC(O)=C2N=C([NH+](O)O)N(CCCO)C2=N1
137 255.0836292521 NC1=NC(O)=C2N=C([NH+](O)O)N(CC=CO)C2=N1
138 237.0730645681 C#CCN1C2=NC(N)=NC(O)=C2N=C1[NH+](O)O
139 235.0574145041 C#CCN1C2=NC(N)=NC(O)=C2N=C1[N+](=O)O
140 206.0672509161 [NH3+]C1=NC(O)=C2N=CN(CC#CO)C2=N1
141 253.0679791881 N=C(N)N=C1C(=C=O)N=C([NH+](O)O)N1CC#CO Intermediate Fragment 
142 253.0679791881 NC(=NC=O)N=C1C=NC([N+](=O)O)N1CC#CO Intermediate Fragment 
143 210.0621655361 N=C=[NH+]C1=CN=C(N(O)O)N1CC=C=O
144 208.0465154721 N=C=[NH+]C1=CN=C(N(O)O)N1C=C=C=O
145 183.0512665041 [NH2+]=C1C=NC(N(O)O)N1C=C=C=O
146 253.0679791881 N=C(N(CC#CO)C1=NC(N)=NC(O)=C1)[N+](=O)O Intermediate Fragment 
147 181.0720019481 NC1=NC(O)=CC([NH+]=CC=CO)=N1
148 253.0679791881 NC1=NC(O)=C(N=C(N=CC#CO)[NH+](O)O)C=N1 Intermediate Fragment 
149 253.0679791881 NC1=NC(O)=C(N=C[NH+](O)O)C(N=CC#CO)=N1 Intermediate Fragment 
150 179.0563518841 NC1=NC(O)=CC([NH+]=CC#CO)=N1
151 251.0523291241 NC(=NC=O)N=C1C=NC([N+](=O)O)N1C=C=C=O Intermediate Fragment 
152 251.0523291241 N=C(N(C=C=C=O)C1=NC(N)=NC(O)=C1)[N+](=O)O Intermediate Fragment 
153 63.0440558841 OCC[OH2+]
154 229.1043646961 CCN1C2=NC(N)=NC(O)=C2NC1[NH+](O)O
155 227.0887146321 CCN1C2=NC(N)=NC(O)=C2N=C1[NH+](O)O
156 207.0624998841 C=CN1C([NH+]=O)=NC2=C(O)N=C(N)N=C21
157 223.0574145041 C#CN1C(=NC(N)=NC=O)C=NC1[N+](=O)O Intermediate Fragment 
158 221.0417644401 C#CN1C2=NC(N)=NC(O)=C2N=C1[N+](=O)O
159 221.0417644401 C#CN1C(=NC(=N)N=C=O)C=NC1[N+](=O)O Intermediate Fragment 
160 91.0389705041 OCC(=[OH+])CO
161 73.0284058201 OCC#C[OH2+]
162 93.0546205681 OCC([OH2+])CO
163 211.0574145041 CN1C2=NC(N)=NC(O)=C2N=C1[N+](=O)O
164 311.0734584921 NC1=NC(O)=C2N=C([NH+](O)O)N(CC=C(O)C(=O)C=O)C2=N1
165 313.0891085561 CC(O)C(=C=O)OCN1C2=NC(N)=NC(O)=C2N=C1[NH+](O)O Intermediate Fragment 
166 313.0891085561 CC(OC(=C=O)CO)N1C2=NC(N)=NC(O)=C2N=C1[NH+](O)O Intermediate Fragment 
167 239.0523291241 CC(=O)N1C2=NC(N)=NC(O)=C2N=C1[N+](=O)O
168 239.0523291241 CC(=O)N1C(=NC(=N)N=C=O)C=NC1[N+](=O)O Intermediate Fragment 
169 196.0465154721 CC(=O)N1C(N=C=N)=CN=C1[N+](=O)O
170 223.0574145041 CC(=O)N1C2=NC(N)=NC=C2N=C1[N+](=O)O
171 192.0516008521 [CH2+]C(=O)N1C=NC2=C(O)N=C(N)N=C21
172 194.0672509161 CC(=O)N1C=NC2=C(O)N=C([NH3+])N=C21
173 223.0574145041 CC(=O)N1C([NH+]=O)=NC2=C(O)N=C(N)N=C21
174 241.0679791881 CC(=O)N1C(=NC(N)=NC=O)C=NC1[N+](=O)O Intermediate Fragment 
175 241.0679791881 CC(=O)N1C=C(C(=O)N=C(N)N)N=C1[N+](=O)O Intermediate Fragment 
176 156.0403674721 CC(=O)N1C=CN=C1[N+](=O)O
177 243.0836292521 CC(O)N1C2=NC(N)=NC(O)=C2N=C1[NH+](O)O
178 283.0785438721 CC(OC#CO)N1C2=NC(N)=NC(O)=C2N=C1[NH+](O)O
179 285.0941939361 CC(OC=CO)N1C2=NC(N)=NC(O)=C2N=C1[NH+](O)O
180 313.0891085561 NC1=NC(O)=C2N=C([NH+](O)O)N(C(CCO)OC#CO)C2=N1 Intermediate Fragment 
181 47.0491412641 CC[OH2+]
182 267.0472437441 NC1=NC(O)=C2N=C([NH+](O)O)N(C(=O)C#CO)C2=N1
183 271.0785438721 NC1=NC(O)=C2N=C([NH+](O)O)N(C(=O)CCO)C2=N1
184 253.0679791881 C=CC(=O)N1C2=NC(N)=NC(O)=C2N=C1[NH+](O)O
185 313.0891085561 NC1=NC(O)=C2N=C([NH+](O)O)N(C(=O)CC(O)C=CO)C2=N1 Intermediate Fragment 
186 245.0992793161 CC(O)N1C2=NC(N)=NC(O)=C2NC1[NH+](O)O
187 198.0985510441 CC(O)N1CNC2=C(O)N=C([NH3+])N=C21
188 245.0992793161 CC(O)N1C(=NC(N)=NC=O)C=NC1[NH+](O)O Intermediate Fragment 
189 71.0127557561 O=CC#C[OH2+]
190 43.0178411361 C#C[OH2+]
191 75.0440558841 OCC=C[OH2+]
192 229.0679791881 NC1=NC(O)=C2N=C([NH+](O)O)N(CO)C2=N1
193 227.0523291241 NC1=NC(O)=C2N=C([NH+](O)O)N(C=O)C2=N1
194 227.0523291241 N=C1C(=O)N=C(N)N=C1N(C=O)C[N+](=O)O Intermediate Fragment 
195 225.0366790601 NC1=NC(O)=C2N=C([N+](=O)O)N(C=O)C2=N1
196 225.0366790601 N=C(N=C=O)N=C1C=NC([N+](=O)O)N1C=O Intermediate Fragment 
197 182.0308654081 N=C=NC1=CN=C([N+](=O)O)N1C=O
198 157.0356164401 N=C1C=NC([N+](=O)O)N1C=O
199 225.0366790601 NC1=NC(O)=C(N=C(N=C=O)[N+](=O)O)C=N1 Intermediate Fragment 
200 225.0366790601 NC1=NC(O)=C(N=C[N+](=O)O)C(N=C=O)=N1 Intermediate Fragment 
201 153.0407018201 NC1=NC(O)=CC([NH+]=C=O)=N1
202 87.0440558841 CC(O)C#C[OH2+]
203 71.0491412641 C#CC(C)[OH2+]
204 71.0491412641 CCC#C[OH2+]
205 311.0734584921 NC1=NC(O)=C2N=C([NH+](O)O)N(C(=O)CC(O)C#CO)C2=N1
206 293.0628938081 NC1=NC(O)=C2N=C([NH+](O)O)N(C=C=C(O)C#CO)C2=N1
