#In-silico ESI-MS/MS [M+H]+ Spectra
#PREDICTED BY CFM-ID 4.0.8
#SMILES=O1C(CO)C(CC1n1ccc(nc1=O)N1C(C(C(C1O)/C=C/C(O)CCCCC)C/C=C/CCCC(=O)O)(C)O)O
#InChiKey=IYCWRWSAAUTDKW-SEYMNPNRSA-N
energy0
446.22856 5.68 161 302 223 10 222 (1.7194 0.29883 0.10472 0.075531 0.034845)
446.26495 31.58 31 48 23 49 (8.347 2.0723 1.1626 0.82442)
448.28060 9.69 275 81 22 (2.6188 0.86557 0.32429)
464.27551 4.59 7 51 52 55 50 (1.7496 0.036064 0.012389 0.0040292 0.0010012)
544.30173 100.00 168 279 169 281 83 300 82 15 9 280 175 287 (27.649 4.5565 1.8512 1.2342 1.149 0.87335 0.58183 0.54411 0.42551 0.3609 0.043226 0.019168)
562.31229 34.93 272 157 301 80 299 294 283 180 293 286 5 282 174 292 297 171 303 179 85 84 284 340 16 172 170 183 (6.6645 3.1402 0.67478 0.6516 0.41625 0.375 0.30939 0.28101 0.25759 0.15643 0.13357 0.12823 0.11561 0.077659 0.068367 0.065042 0.051924 0.038223 0.026432 0.026092 0.016154 0.014695 0.010286 0.009354 0.0091204 0.0070491)
580.32286 18.57 0 390 304 354 343 423 453 379 348 353 389 431 387 452 378 375 (6.8488 0.11527 0.09732 0.064183 0.056049 0.031436 0.025346 0.017284 0.010344 0.0095032 0.0080863 0.0065985 0.0037561 0.00041334 0.0001292 1.0679e-05)
energy1
57.03349 16.48 265 (1.5529)
67.05423 24.32 113 (2.2919)
95.04914 18.27 112 117 (1.708 0.013512)
336.19178 20.83 35 (1.9625)
348.19178 18.34 42 (1.7282)
350.17105 29.22 30 (2.7535)
350.20743 23.44 43 (2.2085)
352.22308 22.00 20 (2.0728)
364.22308 17.64 242 (1.6626)
416.25438 13.95 46 (1.3142)
434.22856 11.52 204 (1.0853)
436.24421 15.37 159 (1.4485)
446.19218 18.71 136 (1.7631)
446.22856 32.57 161 222 10 302 223 (1.4959 0.70835 0.59404 0.14808 0.12294)
446.26495 82.16 48 31 49 23 (3.0587 2.8527 1.3579 0.47217)
448.20783 10.59 140 200 (0.92748 0.070372)
448.24421 16.98 162 11 (1.4145 0.18535)
448.28060 25.06 275 22 81 (1.8986 0.24424 0.21805)
450.25986 32.56 163 228 231 229 230 (2.0641 0.38985 0.30136 0.18332 0.12981)
458.22856 23.41 244 245 (2.0842 0.12203)
464.27551 10.49 7 55 51 52 50 (0.94543 0.023699 0.013868 0.0028275 0.0024889)
488.27551 18.61 323 322 359 (1.1416 0.60736 0.004887)
490.29116 31.59 320 319 173 (1.5329 0.96829 0.47559)
492.30681 12.03 350 285 (0.74541 0.3877)
508.30173 8.78 318 267 (0.65226 0.17467)
516.30681 18.15 167 14 (1.2526 0.45786)
518.28608 26.83 312 311 310 346 (0.93114 0.61686 0.59721 0.38244)
520.30173 21.65 308 268 307 306 (1.3998 0.31052 0.27809 0.052005)
544.30173 100.00 168 15 9 279 82 300 175 83 281 169 280 287 (2.0352 1.7126 1.4007 0.94553 0.94543 0.57772 0.50609 0.40638 0.29798 0.27589 0.21011 0.10907)
562.31229 13.09 340 272 299 5 286 284 80 157 301 283 294 297 282 84 16 174 172 292 85 293 180 303 171 170 179 183 (0.39162 0.23913 0.12493 0.098656 0.061909 0.048687 0.045607 0.0358 0.031881 0.024801 0.022913 0.020274 0.016527 0.014606 0.011729 0.0099845 0.0079103 0.0075157 0.0058653 0.0032638 0.0030473 0.0029836 0.0010407 0.0010206 0.00095949 0.00061256)
energy2
41.03858 30.34 258 (1.4767)
43.01784 19.15 327 (0.93178)
43.05423 19.24 96 (0.93639)
45.03349 23.88 329 (1.162)
57.03349 76.02 265 (3.6997)
57.06988 31.36 93 (1.5262)
59.04914 24.10 91 (1.1727)
67.05423 80.81 113 (3.9325)
71.08553 38.94 90 (1.8949)
81.06988 32.34 154 (1.5739)
93.06988 25.19 133 (1.226)
95.08553 24.05 131 (1.1707)
105.06988 24.60 110 (1.1974)
107.08553 25.88 105 (1.2596)
146.08117 19.27 376 (0.93773)
153.12739 27.27 427 (1.3272)
165.09101 17.63 407 (0.85808)
256.09280 27.11 413 (1.3194)
280.16557 19.56 396 (0.95195)
307.22677 38.50 419 418 (1.016 0.85772)
446.26495 38.95 31 49 23 48 (1.1822 0.31176 0.2968 0.10478)
464.27551 39.77 52 55 7 50 51 (0.77828 0.53777 0.35027 0.15751 0.11156)
490.29116 33.93 320 173 319 (1.2983 0.29829 0.054777)
492.30681 60.57 350 285 (2.9462 0.0015609)
496.33811 28.35 352 (1.3799)
518.28608 17.36 346 312 310 311 (0.69151 0.11609 0.0334 0.0037572)
520.30173 55.77 308 307 268 306 (2.4034 0.23048 0.073055 0.0070715)
522.31738 35.59 347 (1.7322)
544.30173 100.00 175 300 169 9 15 168 281 82 287 83 280 279 (4.6083 0.14359 0.037851 0.034546 0.011798 0.010713 0.0072344 0.0053527 0.0041136 0.0021122 0.00084635 0.00017021)
552.32794 20.83 388 4 430 344 (0.40136 0.3542 0.25058 0.0076103)

0 580.3228564721 CCCCCC(O)C=CC1C(O)N(c2ccn(C3CC(O)C(C[OH2+])O3)c(=O)n2)C(C)(O)C1CC=CCCCC(=O)O
1 548.2966417241 CCCCCC(O)CCC1=C(CCCCCCC(O)O)C(C)(O)N(C2=NC(=[OH+])N(C3=CC(O)=CO3)C=C2)C1=O
2 550.3122917881 CCCCCC(O)CCC1=C(CCCCCCC(O)O)C(C)(O)N(C2=NC(=[OH+])N(C3=CC(O)=CO3)C=C2)C1O
3 532.3017271041 CCCCCCCCC1=C(CCCCCCC(O)O)C(C)(O)N(C2=NC(=[OH+])N(C3=CC(O)=CO3)C=C2)C1=O
4 552.3279418521 CCCCCC(O)CCC1C(O)N(C2=NC(=[OH+])N(C3=CC(O)=CO3)C=C2)C(C)(O)C1CCCCCCC(O)O
5 562.3122917881 C=C1OC(N2C=CC(N3C(=O)C(CCC(O)CCCCC)=C(CCCCCCC(O)O)C3(C)O)=NC2=[OH+])C=C1O
6 466.2911624201 CCCCCC(O)CCC1=C(CCCCCCC(O)O)C(C)(O)N(C2=CC=NC([OH2+])=N2)C1=O
7 464.2755123561 CCCCCC(O)C=CC1=C(CCCCCCC(O)O)C(C)(O)N(C2=CC=NC([OH2+])=N2)C1=O
8 195.0764186321 C=C1OC(N2C=CC=NC2[OH2+])=CC1O
9 544.3017271041 C=C1OC(N2C=CC(N3C(=O)C(C=CCCCCCC)=C(CCCCCCC(O)O)C3(C)O)=NC2=[OH+])C=C1O
10 446.2285621641 C=C1OC(N2C=CC(N3C(=O)C(CCC(O)CCCCC)=C(C)C3(C)O)=NC2=[OH+])C=C1O
11 448.2442122281 C=C1OC(N2C=CC(N3C(O)C(CCC(O)CCCCC)=C(C)C3(C)O)=NC2=[OH+])C=C1O
12 452.2755123561 C=C1OC(N2C=CC(N3C(O)C(CCC(O)CCCCC)C(C)C3(C)O)=NC2[OH2+])C=C1O
13 514.2911624201 C=C1OC(N2C=CC(N3C(=O)C(C=CC(O)CCCCC)=C(CCCCCC)C3(C)O)=NC2=[OH+])C=C1O
14 516.3068124841 C=C1OC(N2C=CC(N3C(=O)C(CCC(O)CCCCC)=C(CCCCCC)C3(C)O)=NC2=[OH+])C=C1O
15 544.3017271041 C=C1OC(N2C=CC(N3C(=O)C(C=CC(O)CCCCC)=C(CCCCCCCO)C3(C)O)=NC2=[OH+])C=C1O
16 562.3122917881 C=C1OC(N2C=CC(NC(C)(O)C(CCCCCCC(O)O)=C(C=O)C=CC(O)CCCCC)=NC2=[OH+])C=C1O Intermediate Fragment 
17 171.1379562681 CCCCCC(O)CCC#C[OH2+]
18 470.3224625481 CCCCCC(O)CCC1C(O)N(C2=CC=NC([OH2+])=N2)C(C)(O)C1CCCCCCC(O)O
19 452.3118978641 CCCCCCCCC1=C(CCCCCCC(O)O)C(C)(O)N(C2=CC=NC([OH2+])=N2)C1O
20 352.2230828601 CCCCCC(O)CCC1=C(C)C(C)(O)N(C2=CC=NC([OH2+])=N2)C1O
21 468.3068124841 CCCCCC(O)CCC1=C(CCCCCCC(O)O)C(C)(O)N(C2=CC=NC([OH2+])=N2)C1O
22 448.2805977361 CCCCCCC=CC1=C(CCCCCCC(O)O)C(C)(O)N(C2=CC=NC([OH2+])=N2)C1=O
23 446.2649476721 CCCCCC(=O)C#CC1=C(CCCCCCC(O)O)C(C)(O)N(C2=CC=NC([OH2+])=N2)C1
24 125.0960914561 C#CC(=[OH+])CCCCC
25 123.0804413921 C#CC(=[OH+])C=CCCC
26 121.0647913281 C#CC(=[OH+])C#CCCC
27 336.1553972241 CC1(O)C(C=CCCCCC(O)O)=CC(=O)N1C1=CC=NC([OH2+])=N1
28 338.1710472881 CC1(O)C(CCCCCCC(O)O)=CC(=O)N1C1=CC=NC([OH2+])=N1
29 348.1553972241 CC1=C(C#CCCCCC(O)O)C(C)(O)N(C2=CC=NC([OH2+])=N2)C1=O
30 350.1710472881 CC1=C(C=CCCCCC(O)O)C(C)(O)N(C2=CC=NC([OH2+])=N2)C1=O
31 446.2649476721 CCCCCCC#CC1=C(CCCCCCC(O)O)C(C)(O)N(C2=CC=NC([OH2+])=N2)C1=O
32 406.1972620361 CC(O)C#CC1=C(CCCCCCC(O)O)C(C)(O)N(C2=CC=NC([OH2+])=N2)C1=O
33 127.0753560121 C#CC=CCCC(O)[OH2+]
34 334.1761326681 CCCCCC(O)C=CC1=CC(C)(O)N(C2=CC=NC([OH2+])=N2)C1=O
35 336.1917827321 CCCCCC(O)CCC1=CC(C)(O)N(C2=CC=NC([OH2+])=N2)C1=O
36 338.2074327961 CCCCCC(O)CCC1=CC(C)(O)N(C2=CC=NC([OH2+])=N2)C1O
37 119.1066561401 CCCCCC(O)[OH2+]
38 117.0910060761 C=CCCCC(O)[OH2+]
39 115.0753560121 C#CCCCC(O)[OH2+]
40 113.0597059481 C#CC=CCC(O)[OH2+]
41 346.1761326681 CCCCCC(O)C#CC1=C(C)C(C)(O)N(C2=CC=NC([OH2+])=N2)C1=O
42 348.1917827321 CCCCCC(O)C=CC1=C(C)C(C)(O)N(C2=CC=NC([OH2+])=N2)C1=O
43 350.2074327961 CCCCCC(O)CCC1=C(C)C(C)(O)N(C2=CC=NC([OH2+])=N2)C1=O
44 362.2074327961 CCCCCC(O)C=CC1=C(CC)C(C)(O)N(C2=CC=NC([OH2+])=N2)C1=O
45 75.0440558841 C=CC(O)[OH2+]
46 416.2543829881 CCCCCCC1=C(C#CC(O)CCCCC)C(=O)N(C2=CC=NC([OH2+])=N2)C1(C)O
47 418.2700330521 CCCCCCC1=C(C=CC(O)CCCCC)C(=O)N(C2=CC=NC([OH2+])=N2)C1(C)O
48 446.2649476721 CCCCCC(O)C#CC1=C(CCCCCCCO)C(C)(O)N(C2=CC=NC([OH2+])=N2)C1=O
49 446.2649476721 CCCCCC(O)C#CC1=C(O)N(C2=CC=NC([OH2+])=N2)C(C)=C1CCCCCCC(O)O
50 464.2755123561 CCCCCC(O)C=CC1=C(CCCCCCC(O)O)C(C)(O)N(C=C=C=NC(=N)[OH2+])C1=O Intermediate Fragment 
51 464.2755123561 CCCCCC(O)C#CC(=C(O)NC1=CC=NC([OH2+])=N1)C(CCCCCCC(O)O)=C(C)O Intermediate Fragment 
52 464.2755123561 CCCCCC(O)C#CC(C=O)=C(CCCCCCC(O)O)C(C)(O)NC1=CC=NC([OH2+])=N1 Intermediate Fragment 
53 169.1223062041 CCCCCC(O)C=CC#C[OH2+]
54 294.1448325401 CC(O)(C#CC=CCCCC(O)O)[NH2+]C1=CC=NC(O)=N1
55 464.2755123561 CCCCCC(O)C=C=C=C(CCCCCCC(O)O)C(C)(O)N(C=O)C1=CC=NC([OH2+])=N1 Intermediate Fragment 
56 321.2060358281 CCCC#CC([OH2+])=CC#CC(CCCCCCC(O)O)=C(C)O
57 140.0454528521 O=C[NH2+]C1=CC=NC(O)=N1
58 462.2598622921 CCCCCC(O)C#CC1=C(CCCCCCC(O)O)C(C)(O)N(C2=CC=NC([OH2+])=N2)C1=O
59 117.0546205681 OC1CCOC1=C[OH2+]
60 99.0440558841 C=C1OCC=C1[OH2+]
61 117.0546205681 OCCC(O)C#C[OH2+] Intermediate Fragment 
62 117.0546205681 CCC(O)C(=O)C=[OH+] Intermediate Fragment 
63 99.0440558841 CC=C(O)C#C[OH2+]
64 119.0702706321 OC1CCOC1C[OH2+]
65 119.0702706321 OCCC(O)C=C[OH2+] Intermediate Fragment 
66 376.3057498641 CCCCCC(O)CCC1C([OH2+])NC(C)(O)C1CCCCCCC(O)O
67 374.2900998001 CCCCCC(O)CCC1=C(CCCCCCC(O)O)C(C)(O)NC1[OH2+]
68 370.2587996721 CCCCCC(O)C=CC1=C(CCCCCCC(O)O)C(C)(O)NC1=[OH+]
69 352.2482349881 CCCCCCC#CC1=C(CCCCCCC(O)O)C(C)(O)NC1=[OH+]
70 205.0243830601 O=C1C=C(N2C=CC=NC2=O)OC1=C=[OH+]
71 207.0400331241 O=C1N=CC=CN1C1=CC(O)C(=C=[OH+])O1
72 97.0396392001 [OH2+]C1=NC=CC=N1
73 209.0556831881 OC1C=C(N2C=CC=NC2O)OC1=C=[OH+]
74 209.0556831881 O=C(C=[OH+])C(O)=C=CN1C=CC=NC1O Intermediate Fragment 
75 211.0713332521 OC1C=C(N2C=CCNC2O)OC1=C=[OH+]
76 211.0713332521 O=C(C=[OH+])C(O)=C=CN1C=CCNC1O Intermediate Fragment 
77 213.0869833161 OC1C=C(N2CCCNC2O)OC1=C=[OH+]
78 213.0869833161 OC(=C=C(O)N1CCCNC1O)C#C[OH2+] Intermediate Fragment 
79 215.1026333801 OC1CC(N2CCCNC2O)OC1=C=[OH+]
80 562.3122917881 CCCCCC(O)CCC1=C(CCCCCCC(O)O)C(C)(O)N(C2=NC(=O)N(C3C=C(O)C(=C=[OH+])O3)C=C2)C1
81 448.2805977361 CCCCCC(O)C#CC1=C(CCCCCCC(O)O)C(C)(O)N(C2=CC=NC([OH2+])=N2)C1
82 544.3017271041 CCCCCCC=CC1=C(CCCCCCC(O)O)C(C)(O)N(C2=NC(=O)N(C3C=C(O)C(=C=[OH+])O3)C=C2)C1
83 544.3017271041 CCCCCC(O)C=CC1=C(CCCCCCCO)C(C)(O)N(C2=NC(=O)N(C3C=C(O)C(=C=[OH+])O3)C=C2)C1
84 562.3122917881 CCCCCC(O)CCC1=C(CCCCCCC(O)O)C(C)(O)N(C2=NC(=O)N(C=C=C(O)C(=O)C=[OH+])C=C2)C1 Intermediate Fragment 
85 562.3122917881 CCCCCC(O)C=CC(C)=C(CCCCCCC(O)O)C(C)(O)NC1=NC(=O)N(C2C=C(O)C(=C=[OH+])O2)C=C1 Intermediate Fragment 
86 131.1430416481 CCCCCC([OH2+])CC
87 101.0960914561 CCCCCC=[OH+]
88 113.1324769641 CCCCCCC=[CH3+]
89 73.1011768361 CCCC[CH4+]
90 71.0855267721 CCCC=[CH3+]
91 59.0491412641 C=CC[OH2+]
92 59.0855267721 CCC[CH4+]
93 57.0698767081 CCC=[CH3+]
94 73.0647913281 C=CC(C)[OH2+]
95 75.0804413921 CCC(C)[OH2+]
96 43.0542266441 CC=[CH3+]
97 89.0960914561 CCC([OH2+])CC
98 129.1273915841 C=CC([OH2+])CCCCC
99 111.1168269001 [CH2+]#CCCCCCC
100 85.0647913281 C#CC([OH2+])CC
101 127.1117415201 C#CC([OH2+])CCCCC
102 109.1011768361 [CH2+]#CC=CCCCC
103 69.0698767081 [CH2+]#CCCC
104 99.0804413921 CCCCC=C=[OH+]
105 107.0855267721 [CH2+]#CC#CCCCC
106 69.0334912001 C#CC(C)=[OH+]
107 83.0491412641 C#CC(=[OH+])CC
108 97.0647913281 C#CC(=[OH+])CCC
109 97.0647913281 CCCC=C=C=[OH+]
110 105.0698767081 [CH2+]#CC#CC=CCC
111 81.0334912001 C#CC(=[OH+])C=C
112 95.0491412641 CCC=C=C=C=[OH+]
113 67.0542266441 [CH2+]#CC=CC
114 65.0385765801 [CH2+]#CC#CC
115 55.0178411361 C#CC=[OH+]
116 93.0334912001 C#CC(=[OH+])C#CC
117 95.0491412641 C#CC(=[OH+])C=CC
118 450.1870912761 CC1(O)C(CCCCCCC(O)O)=CC(O)N1C1=NC(=O)N(C2C=C(O)C(=C=[OH+])O2)C=C1
119 452.2027413401 CC1(O)C(CCCCCCC(O)O)CC(O)N1C1=NC(=O)N(C2C=C(O)C(=C=[OH+])O2)C=C1
120 454.2183914041 CC1(O)C(CCCCCCC(O)O)CC(O)N1C1=NC(O)N(C2C=C(O)C(=C=[OH+])O2)C=C1
121 436.2078267201 CC1(O)C(CCCCCCCO)CC(O)N1C1=NC(=O)N(C2C=C(O)C(=C=[OH+])O2)C=C1
122 436.2078267201 CC1C(CCCCCCC(O)O)CC(O)N1C1=NC(=O)N(C2C=C(O)C(=C=[OH+])O2)C=C1
123 454.2183914041 CC1(O)C(CCCCCCC(O)O)CC(O)N1C1=NC(O)N(C(O)=C=C(O)C#C[OH2+])C=C1 Intermediate Fragment 
124 456.2340414681 CC1(O)C(CCCCCCC(O)O)CC(O)N1C1C=CN(C2C=C(O)C(=C=[OH+])O2)C(O)N1
125 458.2496915321 CC1(O)C(CCCCCCC(O)O)CC(O)N1C1CCN(C2C=C(O)C(=C=[OH+])O2)C(O)N1
126 460.2653415961 CC1(O)C(CCCCCCC(O)O)CC(O)N1C1CCN(C2CC(O)C(=C=[OH+])O2)C(O)N1
127 117.1273915841 CCCCCC(C)[OH2+]
128 115.1117415201 C=C([OH2+])CCCCC
129 97.1011768361 [CH2+]#CCCCCC
130 113.0960914561 C=C([OH2+])C=CCCC
131 95.0855267721 [CH2+]#CC=CCCC
132 111.0804413921 C=C([OH2+])C#CCCC
133 93.0698767081 [CH2+]#CC#CCCC
134 109.0647913281 C=C([OH2+])C#CC=CC
135 464.2027413401 CC1=C(CCCCCCC(O)O)C(C)(O)N(C2=NC(=O)N(C3C=C(O)C(=C=[OH+])O3)C=C2)C1O
136 446.1921766561 CC1=C(CCCCCCCO)C(C)(O)N(C2=NC(=O)N(C3C=C(O)C(=C=[OH+])O3)C=C2)C1=O
137 464.2027413401 CC1=C(CCCCCCC(O)O)C(C)(O)N(C2=NC(=O)N(C=C=C(O)C(=O)C=[OH+])C=C2)C1O Intermediate Fragment 
138 464.2027413401 CC(O)=C(CCCCCCC(O)O)C(C)=C(O)NC1=NC(=O)N(C2C=C(O)C(=C=[OH+])O2)C=C1 Intermediate Fragment 
139 466.2183914041 CC1C(O)N(C2=NC(=O)N(C3C=C(O)C(=C=[OH+])O3)C=C2)C(C)(O)C1CCCCCCC(O)O
140 448.2078267201 CC1=C(CCCCCCCO)C(C)(O)N(C2=NC(=O)N(C3C=C(O)C(=C=[OH+])O3)C=C2)C1O
141 466.2183914041 CC1C(O)N(C2=NC(=O)N(C(O)=C=C(O)C#C[OH2+])C=C2)C(C)(O)C1CCCCCCC(O)O Intermediate Fragment 
142 466.2183914041 CC1C(O)N(C2=NC(=O)N(C=C=C(O)C(=O)C=[OH+])C=C2)C(C)(O)C1CCCCCCC(O)O Intermediate Fragment 
143 466.2183914041 CC(O)=C(CCCCCCC(O)O)C(C)C(O)NC1=NC(=O)N(C2C=C(O)C(=C=[OH+])O2)C=C1 Intermediate Fragment 
144 468.2340414681 CC1C(O)N(C2=NC(O)N(C3C=C(O)C(=C=[OH+])O3)C=C2)C(C)(O)C1CCCCCCC(O)O
145 450.2234767841 CC1C(O)N(C2=NC(=O)N(C3C=C(O)C(=C=[OH+])O3)C=C2)C(C)(O)C1CCCCCCCO
146 468.2340414681 CC1C(O)N(C2=NC(O)N(C(O)=C=C(O)C#C[OH2+])C=C2)C(C)(O)C1CCCCCCC(O)O Intermediate Fragment 
147 468.2340414681 C=C(OC(=C=[OH+])CO)N1C=CC(N2C(O)C(C)C(CCCCCCC(O)O)C2(C)O)=NC1=O Intermediate Fragment 
148 468.2340414681 CC1C(O)N(C2=NC(O)N(C=C=C(O)C(=O)C=[OH+])C=C2)C(C)(O)C1CCCCCCC(O)O Intermediate Fragment 
149 470.2496915321 CC1C(O)N(C2C=CN(C3C=C(O)C(=C=[OH+])O3)C(O)N2)C(C)(O)C1CCCCCCC(O)O
150 472.2653415961 CC1C(O)N(C2CCN(C3C=C(O)C(=C=[OH+])O3)C(O)N2)C(C)(O)C1CCCCCCC(O)O
151 103.1117415201 CCCCCC[OH2+]
152 85.1011768361 CCCCC=[CH3+]
153 83.0855267721 [CH2+]#CCCCC
154 81.0698767081 [CH2+]#CC=CCC
155 478.2183914041 CCC1=C(CCCCCCC(O)O)C(C)(O)N(C2=NC(=O)N(C3C=C(O)C(=C=[OH+])O3)C=C2)C1O
156 480.2340414681 CCC1C(O)N(C2=NC(=O)N(C3C=C(O)C(=C=[OH+])O3)C=C2)C(C)(O)C1CCCCCCC(O)O
157 562.3122917881 CCCCCCCCC1=C(CCCCCCC(O)O)C(C)(O)N(C2=NC(=O)N(C3C=C(O)C(=C=[OH+])O3)C=C2)C1O
158 354.2638850521 CCCCCCC=CC1=C(CCCCCCC(O)O)C(C)(O)NC1=[OH+]
159 436.2442122281 CCCCCCCCC1CC(C)(O)N(C2=NC(O)N(C3C=C(O)C(=C=[OH+])O3)C=C2)C1O
160 438.2598622921 CCCCCCCCC1CC(C)(O)N(C2C=CN(C3C=C(O)C(=C=[OH+])O3)C(O)N2)C1O
161 446.2285621641 CCCCCCCCC1=C(C)C(C)(O)N(C2=NC(=O)N(C3C=C(O)C(=C=[OH+])O3)C=C2)C1O
162 448.2442122281 CCCCCCCCC1C(O)N(C2=NC(=O)N(C3C=C(O)C(=C=[OH+])O3)C=C2)C(C)(O)C1C
163 450.2598622921 CCCCCCCCC1C(O)N(C2=NC(O)N(C3C=C(O)C(=C=[OH+])O3)C=C2)C(C)(O)C1C
164 452.2755123561 CCCCCCCCC1C(O)N(C2C=CN(C3C=C(O)C(=C=[OH+])O3)C(O)N2)C(C)(O)C1C
165 486.2598622921 CCCCCCCCC1=C(CCCC)C(C)(O)N(C2=NC(=O)N(C3C=C(O)C(=C=[OH+])O3)C=C2)C1=O
166 514.2911624201 CCCCCCCCC1=C(CCCCCC)C(C)(O)N(C2=NC(=O)N(C3C=C(O)C(=C=[OH+])O3)C=C2)C1=O
167 516.3068124841 CCCCCCCCC1=C(CCCCCC)C(C)(O)N(C2=NC(=O)N(C3C=C(O)C(=C=[OH+])O3)C=C2)C1O
168 544.3017271041 CCCCCCCCC1=C(CCCCCCCO)C(C)(O)N(C2=NC(=O)N(C3C=C(O)C(=C=[OH+])O3)C=C2)C1=O
169 544.3017271041 CCCCCCCCC1=C(CCCCCCC(O)O)C(C)(O)N(C2=NC(=O)N(C3C=CC(=C=[OH+])O3)C=C2)C1=O
170 562.3122917881 CCCCCCCCC1=C(CCCCCCC(O)O)C(C)(O)N(C2=NC(=O)N(C(O)=C=C(O)C#C[OH2+])C=C2)C1O Intermediate Fragment 
171 562.3122917881 CCCCCCCCC1=C(CCCCCCC(O)O)C(C)(O)N(C2=NC(=O)N(C(=C=CO)OC#C[OH2+])C=C2)C1O Intermediate Fragment 
172 562.3122917881 C=C(OC(=C=[OH+])CO)N1C=CC(N2C(=O)C(CCCCCCCC)=C(CCCCCCC(O)O)C2(C)O)=NC1=O Intermediate Fragment 
173 490.2911624201 C=C([OH2+])N1C=CC(N2C(=O)C(C=CCCCCCC)=C(CCCCCCC(O)O)C2(C)O)=NC1=O
174 562.3122917881 CCCCCCCCC1=C(CCCCCCC(O)O)C(C)(O)N(C2=NC(=O)N(C=C=C(O)C(=O)C=[OH+])C=C2)C1O Intermediate Fragment 
175 544.3017271041 CCCCCCCCC1=C(CCCCCCC(O)O)C(C)(O)N(C2=NC(=O)N(C=C=C(O)C#C[OH2+])C=C2)C1=O
176 504.3068124841 CCCCCCCCC1=C(CCCCCCC(O)O)C(C)(O)N(C2=NC(=[OH+])N(CC#CO)C=C2)C1=O
177 502.2911624201 CCCCCCC=CC1=C(CCCCCCC(O)O)C(C)(O)N(C2=NC(=[OH+])N(CC#CO)C=C2)C1=O
178 474.2962478001 C#CN1C=CC(N2C(=O)C(CCCCCCCC)=C(CCCCCCC(O)O)C2(C)O)=NC1=[OH+]
179 562.3122917881 CCCCCCCCC1=C(CCCCCCC(O)O)C(C)(O)N(C=C=CN(C(=N)O)C2C=C(O)C(=C=[OH+])O2)C1=O Intermediate Fragment 
180 562.3122917881 CCCCCCCCC(C=O)=C(CCCCCCC(O)O)C(C)(O)NC1=NC(=O)N(C2C=C(O)C(=C=[OH+])O2)C=C1 Intermediate Fragment 
181 406.1608765281 CC(O)(C#CCCCCCC(O)O)[NH2+]C1=NC(=O)N(C2C=C(O)C(=C=O)O2)C=C1
182 408.1765265921 CC(O)(C=CCCCCCC(O)O)[NH2+]C1=NC(=O)N(C2C=C(O)C(=C=O)O2)C=C1
183 562.3122917881 CCCCCCCCC=C(CCCCCCC(O)O)C(C)(O)N(C=O)C1=NC(=O)N(C2C=C(O)C(=C=[OH+])O2)C=C1 Intermediate Fragment 
184 508.2289560881 CC1(O)C(CCCCCCC(O)O)=C(CCCO)C(O)N1C1=NC(=O)N(C2C=C(O)C(=C=[OH+])O2)C=C1
185 514.2759062801 CC1(O)C(CCCCCCC(O)O)C(CCCO)C(O)N1C1C=CN(C2C=C(O)C(=C=[OH+])O2)C(O)N1
186 516.2915563441 CC1(O)C(CCCCCCC(O)O)C(CCCO)C(O)N1C1CCN(C2C=C(O)C(=C=[OH+])O2)C(O)N1
187 522.2446061521 CC(O)CCC1=C(CCCCCCC(O)O)C(C)(O)N(C2=NC(=O)N(C3C=C(O)C(=C=[OH+])O3)C=C2)C1O
188 524.2602562161 CC(O)CCC1C(O)N(C2=NC(=O)N(C3C=C(O)C(=C=[OH+])O3)C=C2)C(C)(O)C1CCCCCCC(O)O
189 528.2915563441 CC(O)CCC1C(O)N(C2C=CN(C3C=C(O)C(=C=[OH+])O3)C(O)N2)C(C)(O)C1CCCCCCC(O)O
190 530.3072064081 CC(O)CCC1C(O)N(C2CCN(C3C=C(O)C(=C=[OH+])O3)C(O)N2)C(C)(O)C1CCCCCCC(O)O
191 45.0698767081 CC[CH4+]
192 133.1223062041 CCCCCCC(O)[OH2+]
193 131.1066561401 C=CCCCCC(O)[OH2+]
194 129.0910060761 C#CCCCCC(O)[OH2+]
195 79.0542266441 [CH2+]#CC#CCC
196 125.0597059481 C#CC#CCCC(O)[OH2+]
197 123.0440558841 C#CC#CC=CC(O)[OH2+]
198 121.0284058201 C#CC#CC#CC(O)[OH2+]
199 77.0385765801 C=CC#CC#[CH2+]
200 448.2078267201 CCCCCC(O)CCC1=CC(C)(O)N(C2=NC(=O)N(C3C=C(O)C(=C=[OH+])O3)C=C2)C1O
201 450.2234767841 CCCCCC(O)CCC1CC(C)(O)N(C2=NC(=O)N(C3C=C(O)C(=C=[OH+])O3)C=C2)C1O
202 432.2129121001 CCCCCCCCC1=CC(C)(O)N(C2=NC(=O)N(C3C=C(O)C(=C=[OH+])O3)C=C2)C1O
203 452.2391268481 CCCCCC(O)CCC1CC(C)(O)N(C2=NC(O)N(C3C=C(O)C(=C=[OH+])O3)C=C2)C1O
204 434.2285621641 CCCCCCCCC1CC(C)(O)N(C2=NC(=O)N(C3C=C(O)C(=C=[OH+])O3)C=C2)C1O
205 452.2391268481 CCCCCC(O)CCC1CC(C)(O)N(C2=NC(O)N(C=C=C(O)C(=O)C=[OH+])C=C2)C1O Intermediate Fragment 
206 454.2547769121 CCCCCC(O)CCC1CC(C)(O)N(C2C=CN(C3C=C(O)C(=C=[OH+])O3)C(O)N2)C1O
207 454.2547769121 CCCCCC(O)CCC1CC(C)(O)N(C2C=CN(C(O)=C=C(O)C#C[OH2+])C(O)N2)C1O Intermediate Fragment 
208 456.2704269761 CCCCCC(O)CCC1CC(C)(O)N(C2CCN(C3C=C(O)C(=C=[OH+])O3)C(O)N2)C1O
209 458.2860770401 CCCCCC(O)CCC1CC(C)(O)N(C2CCN(C3CC(O)C(=C=[OH+])O3)C(O)N2)C1O
210 460.3017271041 CCCCCC(O)CCC1CC(C)(O)N(C2CCN(C3CC(O)C(=C[OH2+])O3)C(O)N2)C1O
211 55.0542266441 [CH2+]#CCC
212 39.0229265161 [C+]#CC
213 53.0385765801 C=CC#[CH2+]
214 111.0440558841 C#CC#CCC(O)[OH2+]
215 109.0284058201 C#CC#CC=C(O)[OH2+]
216 107.0127557561 [C+]#CC#CC=C(O)O
217 63.0229265161 [C+]#CC#CC
218 462.2234767841 CCCCCC(O)CCC1=C(C)C(C)(O)N(C2=NC(=O)N(C3C=C(O)C(=C=[OH+])O3)C=C2)C1O
219 444.2129121001 CCCCCCCCC1=C(C)C(C)(O)N(C2=NC(=O)N(C3C=C(O)C(=C=[OH+])O3)C=C2)C1=O
220 464.2391268481 CCCCCC(O)CCC1C(O)N(C2=NC(=O)N(C3C=C(O)C(=C=[OH+])O3)C=C2)C(C)(O)C1C
221 258.2063701761 CCCCCC(O)CCC1=C(C)C(C)(O)NC1[OH2+]
222 446.2285621641 CCCCCC(O)CCC1=C(C)C(C)(O)N(C2=NC(=O)N(C3C=C(O)C(=C=[OH+])O3)C=C2)C1
223 446.2285621641 CCCCCC(O)CCC1C(C)=C(C)N(C2=NC(=O)N(C3C=C(O)C(=C=[OH+])O3)C=C2)C1O
224 464.2391268481 CCCCCC(O)CCC1C(O)N(C2=NC(=O)N(C=C=C(O)C(=O)C=[OH+])C=C2)C(C)(O)C1C Intermediate Fragment 
225 466.2547769121 CCCCCC(O)CCC1C(O)N(C2=NC(O)N(C3C=C(O)C(=C=[OH+])O3)C=C2)C(C)(O)C1C
226 466.2547769121 CCCCCC(O)CCC1C(O)N(C2=NC(O)N(C=C=C(O)C(=O)C=[OH+])C=C2)C(C)(O)C1C Intermediate Fragment 
227 468.2704269761 CCCCCC(O)CCC1C(O)N(C2C=CN(C3C=C(O)C(=C=[OH+])O3)C(O)N2)C(C)(O)C1C
228 450.2598622921 C=C1OC(N2C=CC(N3C(O)C(CCC(O)CCCCC)C(C)C3(C)O)=NC2=[OH+])C=C1O
229 450.2598622921 CCCCCC(O)CCC1CN(C2=NC(O)N(C3C=C(O)C(=C=[OH+])O3)C=C2)C(C)(O)C1C
230 450.2598622921 CCCCCC(O)CCC1C(C)C(C)N(C2=NC(O)N(C3C=C(O)C(=C=[OH+])O3)C=C2)C1O
231 450.2598622921 CCCCCC(O)CCC1C(O)N(C2=NC(O)N(C3C=CC(=C=[OH+])O3)C=C2)C(C)(O)C1C
232 468.2704269761 CCCCCC(O)CCC1C(O)N(C2C=CN(C(O)=C=C(O)C#C[OH2+])C(O)N2)C(C)(O)C1C Intermediate Fragment 
233 75.0440558841 OCC=C[OH2+]
234 468.2704269761 CCCCCC(O)CCC1C(O)N(C2C=CN(C=C=C(O)C(=O)C=[OH+])C(O)N2)C(C)(O)C1C Intermediate Fragment 
235 470.2860770401 CCCCCC(O)CCC1C(O)N(C2CCN(C3C=C(O)C(=C=[OH+])O3)C(O)N2)C(C)(O)C1C
236 472.3017271041 CCCCCC(O)CCC1C(O)N(C2CCN(C3CC(O)C(=C=[OH+])O3)C(O)N2)C(C)(O)C1C
237 103.0753560121 C=CCCC(O)[OH2+]
238 101.0597059481 C#CCCC(O)[OH2+]
239 99.0440558841 C#CC=CC(O)[OH2+]
240 476.2391268481 CCCCCC(O)CCC1=C(CC)C(C)(O)N(C2=NC(=O)N(C3C=C(O)C(=C=[OH+])O3)C=C2)C1O
241 366.2387329241 CCCCCC(O)CCC1=C(CC)C(C)(O)N(C2=CC=NC([OH2+])=N2)C1O
242 364.2230828601 CCCCCC(O)CCC1=C(CC)C(C)(O)N(C2=CC=NC([OH2+])=N2)C1=O
243 364.1503118441 CCC1C(C)C(O)N(C2=NC(=O)N(C3C=C(O)C(=C=[OH+])O3)C=C2)C1(C)O
244 458.2285621641 CCCCCCCCC1=C(CC)C(C)(O)N(C2=NC(=O)N(C3C=C(O)C(=C=[OH+])O3)C=C2)C1=O
245 458.2285621641 CCCCCC(O)CCC1=C(O)N(C2=NC(=O)N(C3C=C(O)C(=C=[OH+])O3)C=C2)C(C)=C1CC
246 476.2391268481 CCCCCC(O)CCC1=C(CC)C(C)(O)N(C2=NC(=O)N(C=C=C(O)C(=O)C=[OH+])C=C2)C1O Intermediate Fragment 
247 392.2543829881 C#CN1C=CC(N2C(O)C(CCC(O)CCCCC)C(CC)C2(C)O)=NC1=[OH+]
248 476.2391268481 CCCCCC(O)CCC=C(CC)C(C)(O)N(C=O)C1=NC(=O)N(C2C=C(O)C(=C=[OH+])O2)C=C1 Intermediate Fragment 
249 478.2547769121 CCCCCC(O)CCC1C(O)N(C2=NC(=O)N(C3C=C(O)C(=C=[OH+])O3)C=C2)C(C)(O)C1CC
250 460.2442122281 CCCCCCCCC1=C(CC)C(C)(O)N(C2=NC(=O)N(C3C=C(O)C(=C=[OH+])O3)C=C2)C1O
251 478.2547769121 CCCCCC(O)CCC1C(O)N(C2=NC(=O)N(C=C=C(O)C(=O)C=[OH+])C=C2)C(C)(O)C1CC Intermediate Fragment 
252 480.2704269761 CCCCCC(O)CCC1C(O)N(C2=NC(O)N(C3C=C(O)C(=C=[OH+])O3)C=C2)C(C)(O)C1CC
253 482.2860770401 CCCCCC(O)CCC1C(O)N(C2C=CN(C3C=C(O)C(=C=[OH+])O3)C(O)N2)C(C)(O)C1CC
254 484.3017271041 CCCCCC(O)CCC1C(O)N(C2CCN(C3C=C(O)C(=C=[OH+])O3)C(O)N2)C(C)(O)C1CC
255 486.3173771681 CCCCCC(O)CCC1C(O)N(C2CCN(C3CC(O)C(=C=[OH+])O3)C(O)N2)C(C)(O)C1CC
256 91.0753560121 CCCC(O)[OH2+]
257 89.0597059481 C=CCC(O)[OH2+]
258 41.0385765801 [CH2+]#CC
259 71.0491412641 C#CCC[OH2+]
260 87.0440558841 C#CCC(O)[OH2+]
261 490.2547769121 CCCCCC(O)CCC1=C(CCC)C(C)(O)N(C2=NC(=O)N(C3C=C(O)C(=C=[OH+])O3)C=C2)C1O
262 472.2442122281 CCCCCCCCC1=C(CCC)C(C)(O)N(C2=NC(=O)N(C3C=C(O)C(=C=[OH+])O3)C=C2)C1=O
263 492.2704269761 CCCCCC(O)CCC1C(O)N(C2=NC(=O)N(C3C=C(O)C(=C=[OH+])O3)C=C2)C(C)(O)C1CCC
264 496.3017271041 CCCCCC(O)CCC1C(O)N(C2C=CN(C3C=C(O)C(=C=[OH+])O3)C(O)N2)C(C)(O)C1CCC
265 57.0334912001 C#CC[OH2+]
266 73.0284058201 C#CC(O)[OH2+]
267 508.3017271041 CCCCCC(O)CCC1C(O)N(C2=NC(O)N(C3C=C(O)C(=C=[OH+])O3)C=C2)C(C)(O)C1CCCC
268 520.3017271041 CCCCCC(O)CCC1C(O)N(C2=NC(=O)N(C3C=C(O)C(=C=[OH+])O3)C=C2)C(C)(O)C1CCCCC
269 532.3017271041 CCCCCCC1=C(CCC(O)CCCCC)C(O)N(C2=NC(=O)N(C3C=C(O)C(=C=[OH+])O3)C=C2)C1(C)O
270 534.3173771681 CCCCCCC1C(CCC(O)CCCCC)C(O)N(C2=NC(=O)N(C3C=C(O)C(=C=[OH+])O3)C=C2)C1(C)O
271 534.3173771681 CCCCCCC1C(CCC(O)CCCCC)C(O)N(C2=NC(=O)N(C=C=C(O)C(=O)C=[OH+])C=C2)C1(C)O Intermediate Fragment 
272 562.3122917881 CCCCCC(O)CCC1=C(CCCCCCCO)C(C)(O)N(C2=NC(=O)N(C3C=C(O)C(=C=[OH+])O3)C=C2)C1O
273 452.3118978641 CCCCCC(O)CCC1=C(CCCCCCCO)C(C)(O)N(C2=CC=NC([OH2+])=N2)C1O
274 450.2962478001 CCCCCC(O)CCC1=C(CCCCCCCO)C(C)(O)N(C2=CC=NC([OH2+])=N2)C1=O
275 448.2805977361 CCCCCC(O)C=CC1=C(CCCCCCCO)C(C)(O)N(C2=CC=NC([OH2+])=N2)C1=O
276 452.2391268481 CC1C(O)N(C2=NC(O)N(C3C=C(O)C(=C=[OH+])O3)C=C2)C(C)(O)C1CCCCCCCO
277 111.0804413921 C#CC=CCCC[OH2+]
278 488.2391268481 CCCCCC(O)CCC1=C(CCC)C(C)(O)N(C2=NC(=O)N(C3C=C(O)C(=C=[OH+])O3)C=C2)C1=O
279 544.3017271041 CCCCCCCC1=C(CCC(O)CCCCC)C(=O)N(C2=NC(=O)N(C3C=C(O)C(=C=[OH+])O3)C=C2)C1(C)O
280 544.3017271041 CCCCCC(O)CCC1=C(O)N(C2=NC(=O)N(C3C=C(O)C(=C=[OH+])O3)C=C2)C(C)=C1CCCCCCCO
281 544.3017271041 CCCCCC(O)CCC1=C(CCCCCCCO)C(C)(O)N(C2=NC(=O)N(C3C=CC(=C=[OH+])O3)C=C2)C1=O
282 562.3122917881 CCCCCC(O)CCC1=C(CCCCCCCO)C(C)(O)N(C2=NC(=O)N(C(O)=C=C(O)C#C[OH2+])C=C2)C1O Intermediate Fragment 
283 562.3122917881 CCCCCC(O)CCC1=C(CCCCCCCO)C(C)(O)N(C2=NC(=O)N(C(=C=CO)OC#C[OH2+])C=C2)C1O Intermediate Fragment 
284 562.3122917881 C=C(OC(=C=[OH+])CO)N1C=CC(N2C(=O)C(CCC(O)CCCCC)=C(CCCCCCCO)C2(C)O)=NC1=O Intermediate Fragment 
285 492.3068124841 C=C([OH2+])N1C=CC(N2C(=O)C(CCC(O)CCCCC)=C(CCCCCCCO)C2(C)O)=NC1=O
286 562.3122917881 CCCCCC(O)CCC1=C(CCCCCCCO)C(C)(O)N(C2=NC(=O)N(C=C=C(O)C(=O)C=[OH+])C=C2)C1O Intermediate Fragment 
287 544.3017271041 CCCCCC(O)CCC1=C(CCCCCCCO)C(C)(O)N(C2=NC(=O)N(C=C=C(O)C#C[OH2+])C=C2)C1=O
288 504.3068124841 CCCCCC(O)CCC1=C(CCCCCCCO)C(C)(O)N(C2=NC(=[OH+])N(CC#CO)C=C2)C1=O
289 502.2911624201 CCCCCC(O)C=CC1=C(CCCCCCCO)C(C)(O)N(C2=NC(=[OH+])N(CC#CO)C=C2)C1=O
290 476.3118978641 C#CN1C=CC(N2C(O)C(CCC(O)CCCCC)=C(CCCCCCCO)C2(C)O)=NC1=[OH+]
291 474.2962478001 C#CN1C=CC(N2C(=O)C(CCC(O)CCCCC)=C(CCCCCCCO)C2(C)O)=NC1=[OH+]
292 562.3122917881 CCCCCC(O)CCC1=C(CCCCCCCO)C(C)(O)N(C=C=CN(C(=N)O)C2C=C(O)C(=C=[OH+])O2)C1=O Intermediate Fragment 
293 562.3122917881 CCCCCC(O)CCC(=C(O)NC1=NC(=O)N(C2C=C(O)C(=C=[OH+])O2)C=C1)C(CCCCCCCO)=C(C)O Intermediate Fragment 
294 562.3122917881 CCCCCC(O)CCC(C=O)=C(CCCCCCCO)C(C)(O)NC1=NC(=O)N(C2C=C(O)C(=C=[OH+])O2)C=C1 Intermediate Fragment 
295 268.0927969681 CC(O)[NH2+]C1=NC(O)N(C2C=C(O)C(=C=O)O2)C=C1
296 534.3173771681 CCCCCC(O)CCC=C(CCCCCCCO)C(C)(O)[NH2+]C1=NC(=O)N(C2C=C(O)C(=C=O)O2)C=C1
297 562.3122917881 CCCCCC(O)CCC=C(CCCCCCCO)C(C)(O)N(C=O)C1=NC(=O)N(C2C=C(O)C(=C=[OH+])O2)C=C1 Intermediate Fragment 
298 309.2424213361 CCCCCC([OH2+])=CC#CC(CCCCCCCO)=C(C)O
299 562.3122917881 CCCCCC(O)CCC1C(CCCCCCC(O)O)=C(C)N(C2=NC(=O)N(C3C=C(O)C(=C=[OH+])O3)C=C2)C1O
300 544.3017271041 CCCCCCCCC1=C(O)N(C2=NC(=O)N(C3C=C(O)C(=C=[OH+])O3)C=C2)C(C)=C1CCCCCCC(O)O
301 562.3122917881 CCCCCC(O)CCC1=C(CCCCCCC(O)O)C(C)(O)N(C2=NC(=O)N(C3C=CC(=C=[OH+])O3)C=C2)C1O
302 446.2285621641 CCCCCC(O)CCC1=C(C)C(C)(O)N(C2=NC(=O)N(C3C=CC(=C=[OH+])O3)C=C2)C1O
303 562.3122917881 CCCCCC(O)CCC(C=O)=C(CCCCCCC(O)O)C(C)(O)NC1=NC(=O)N(C2C=CC(=C=[OH+])O2)C=C1 Intermediate Fragment 
304 580.3228564721 CCCCCC(O)CCC1C(O)N(C2=NC(=O)N(C(O)=C=C(O)C#C[OH2+])C=C2)C(C)(O)C1CCCCCCC(O)O Intermediate Fragment 
305 538.3122917881 CCCCCC(O)CCC1=C(CCCCCCC(O)O)C(C)(O)N(C2=NC(=O)N(C([OH2+])C#CO)C=C2)C1O
306 520.3017271041 CCCCCC(O)CCC1=C(CCCCCCCO)C(C)(O)N(C2=NC(=O)N(C([OH2+])C#CO)C=C2)C1=O
307 520.3017271041 C#CC([OH2+])N1C=CC(N2C(=O)C(CCC(O)CCCCC)=C(CCCCCCC(O)O)C2(C)O)=NC1=O
308 520.3017271041 CCCCCC(O)CCC1=C(CCCCCCC(O)O)C(C)(O)N(C2=NC(=[OH+])N(CC#CO)C=C2)C1=O
309 536.2966417241 CCCCCC(O)CCC1=C(CCCCCCC(O)O)C(C)(O)N(C2=NC(=O)N(C([OH2+])C#CO)C=C2)C1=O
310 518.2860770401 CCCCCCC=CC1=C(CCCCCCC(O)O)C(C)(O)N(C2=NC(=O)N(C([OH2+])C#CO)C=C2)C1=O
311 518.2860770401 CCCCCC(O)C=CC1=C(CCCCCCCO)C(C)(O)N(C2=NC(=O)N(C([OH2+])C#CO)C=C2)C1=O
312 518.2860770401 C#CC([OH2+])N1C=CC(N2C(=O)C(C=CC(O)CCCCC)=C(CCCCCCC(O)O)C2(C)O)=NC1=O
313 536.2966417241 CCCCCC(O)C=CC(C=O)=C(CCCCCCC(O)O)C(C)(O)NC1=NC(=O)N(C([OH2+])C#CO)C=C1 Intermediate Fragment 
314 534.2809916601 CCCCCC(O)C=CC1=C(CCCCCCC(O)O)C(C)(O)N(C2=NC(=O)N(C([OH2+])C#CO)C=C2)C1=O
315 516.2704269761 CCCCCCC#CC1=C(CCCCCCC(O)O)C(C)(O)N(C2=NC(=O)N(C([OH2+])C#CO)C=C2)C1=O
316 512.3330272321 C=C([OH2+])N1C=CC(N2C(O)C(CCC(O)CCCCC)C(CCCCCCC(O)O)C2(C)O)=NC1=O
317 510.3173771681 C=C([OH2+])N1C=CC(N2C(O)C(CCC(O)CCCCC)=C(CCCCCCC(O)O)C2(C)O)=NC1=O
318 508.3017271041 C=C([OH2+])N1C=CC(N2C(=O)C(CCC(O)CCCCC)=C(CCCCCCC(O)O)C2(C)O)=NC1=O
319 490.2911624201 C=C([OH2+])N1C=CC(N2C(=O)C(C=CC(O)CCCCC)=C(CCCCCCCO)C2(C)O)=NC1=O
320 490.2911624201 C#CN1C=CC(N2C(=O)C(CCC(O)CCCCC)=C(CCCCCCC(O)O)C2(C)O)=NC1=[OH+]
321 506.2860770401 C=C([OH2+])N1C=CC(N2C(=O)C(C=CC(O)CCCCC)=C(CCCCCCC(O)O)C2(C)O)=NC1=O
322 488.2755123561 C=C([OH2+])N1C=CC(N2C(=O)C(C#CCCCCCC)=C(CCCCCCC(O)O)C2(C)O)=NC1=O
323 488.2755123561 C=C([OH2+])N1C=CC(N2C(=O)C(C#CC(O)CCCCC)=C(CCCCCCCO)C2(C)O)=NC1=O
324 506.2860770401 C=C([OH2+])N1C=CC(NC(C)(O)C(CCCCCCC(O)O)=C(C#CC(O)CCCCC)C=O)=NC1=O Intermediate Fragment 
325 68.9971056921 [O+]#CC#CO
326 71.0127557561 O=CC#C[OH2+]
327 43.0178411361 C#C[OH2+]
328 73.0284058201 OCC#C[OH2+]
329 45.0334912001 C=C[OH2+]
330 77.0597059481 OCCC[OH2+]
331 496.3017271041 CCCCCC(O)CCC1=C(CCCCCCC(O)O)C(C)(O)N(C2=NC(=O)N(C[OH2+])C=C2)C1=O
332 494.2860770401 CCCCCC(O)C=CC1=C(CCCCCCC(O)O)C(C)(O)N(C2=NC(=O)N(C[OH2+])C=C2)C1=O
333 492.2704269761 CCCCCC(O)C#CC1=C(CCCCCCC(O)O)C(C)(O)N(C2=NC(=O)N(C[OH2+])C=C2)C1=O
334 474.2598622921 CCCCC=CC#CC1=C(CCCCCCC(O)O)C(C)(O)N(C2=NC(=O)N(C[OH2+])C=C2)C1=O
335 474.2598622921 CCCCCC(=O)C#CC1=C(CCCCCCCO)C(C)(O)N(C2=NC(=O)N(C[OH2+])C=C2)C1=O
336 87.0440558841 CC(O)C#C[OH2+]
337 89.0597059481 CC(O)C=C[OH2+]
338 71.0491412641 C#CC(C)[OH2+]
339 91.0753560121 CC(O)CC[OH2+]
340 562.3122917881 CCCCCC(O)CCC1=C(CCCCCCC(O)O)C(C)(O)N(C2=NC(=O)N(C=C=C(O)C#C[OH2+])C=C2)C1O
341 578.3072064081 CCCCCC(O)CCC1=C(CCCCCCC(O)O)C(C)(O)N(C2=NC(=O)N(C([OH2+])=C=C(O)C#CO)C=C2)C1O
342 560.2966417241 CCCCCCCCC1=C(CCCCCCC(O)O)C(C)(O)N(C2=NC(=O)N(C([OH2+])=C=C(O)C#CO)C=C2)C1=O
343 580.3228564721 CCCCCC(O)CCC1C(O)N(C2=NC(=O)N(C(=C=CO)OC#C[OH2+])C=C2)C(C)(O)C1CCCCCCC(O)O Intermediate Fragment 
344 552.3279418521 C=C([OH+]C#CO)N1C=CC(N2C(O)C(CCC(O)CCCCC)C(CCCCCCC(O)O)C2(C)O)=NC1=O
345 63.0440558841 OCC[OH2+]
346 518.2860770401 CCCCCC(O)C=CC1=C(CCCCCCC(O)O)C(C)(O)N(C2=NC(=[OH+])N(CC#CO)C=C2)C1=O
347 522.3173771681 CCCCCC(O)CCC1=C(CCCCCCC(O)O)C(C)(O)N(C2=NC(=[OH+])N(CC#CO)C=C2)C1O
348 580.3228564721 C=C(OC(=C=[OH+])CO)N1C=CC(N2C(O)C(CCC(O)CCCCC)=C(CCCCCCC(O)O)C2(C)O)=NC1=O Intermediate Fragment 
349 504.2704269761 C=C([OH2+])N1C=CC(N2C(=O)C(C#CC(O)CCCCC)=C(CCCCCCC(O)O)C2(C)O)=NC1=O
350 492.3068124841 C#CN1C=CC(N2C(O)C(CCC(O)CCCCC)=C(CCCCCCC(O)O)C2(C)O)=NC1=[OH+]
351 494.3224625481 C#CN1C=CC(N2C(O)C(CCC(O)CCCCC)C(CCCCCCC(O)O)C2(C)O)=NC1=[OH+]
352 496.3381126121 C#CN1C=CC(N2C(O)C(CCC(O)CCCCC)C(CCCCCCC(O)O)C2(C)O)=NC1[OH2+]
353 580.3228564721 C=C(O)C(=C=[OH+])OCN1C=CC(N2C(O)C(CCC(O)CCCCC)=C(CCCCCCC(O)O)C2(C)O)=NC1=O Intermediate Fragment 
354 580.3228564721 CCCCCC(O)CCC1C(O)N(C2=NC(=O)N(C=C=C(O)C(=O)C=[OH+])C=C2)C(C)(O)C1CCCCCCC(O)O Intermediate Fragment 
355 524.3330272321 CCCCCC(O)CCC1C(O)N(C2=NC(=[OH+])N(CC#CO)C=C2)C(C)(O)C1CCCCCCC(O)O
356 59.0127557561 O=C=C[OH2+]
357 41.0021910721 [C+]#CO
358 61.0284058201 OC=C[OH2+]
359 488.2755123561 C#CN1C=CC(N2C(=O)C(C=CC(O)CCCCC)=C(CCCCCCC(O)O)C2(C)O)=NC1=[OH+]
360 87.0076703761 O=CC(=[OH+])C=O
361 89.0233204401 O=CC(=[OH+])CO
362 71.0127557561 CC(=O)C#[O+]
363 91.0389705041 OCC(=[OH+])CO
364 73.0284058201 CC(=[OH+])C=O
365 93.0546205681 OCC([OH2+])CO
366 482.3224625481 CCCCCC(O)CCC1=C(CCCCCCC(O)O)C(C)(O)N(C2=NC(=[OH+])N(C)C=C2)C1O
367 480.3068124841 CCCCCC(O)CCC1=C(CCCCCCC(O)O)C(C)(O)N(C2=NC(=[OH+])N(C)C=C2)C1=O
368 478.2911624201 CCCCCC(O)C=CC1=C(CCCCCCC(O)O)C(C)(O)N(C2=NC(=[OH+])N(C)C=C2)C1=O
369 476.2755123561 CCCCCC(O)C#CC1=C(CCCCCCC(O)O)C(C)(O)N(C2=NC(=[OH+])N(C)C=C2)C1=O
370 474.2598622921 CCCCCC(=O)C#CC1=C(CCCCCCC(O)O)C(C)(O)N(C2=NC(=[OH+])N(C)C=C2)C1=O
371 456.2492976081 CCCCC#CC#CC1=C(CCCCCCC(O)O)C(C)(O)N(C2=NC(=[OH+])N(C)C=C2)C1=O
372 456.2492976081 CCCC=CC(=O)C#CC1=C(CCCCCCCO)C(C)(O)N(C2=NC(=[OH+])N(C)C=C2)C1=O
373 474.2598622921 CCCC=CC(=O)C#CC(C=O)=C(CCCCCCC(O)O)C(C)(O)NC1=NC(=[OH+])N(C)C=C1 Intermediate Fragment 
374 578.3072064081 CCCCCC(O)CCC1=C(CCCCCCC(O)O)C(C)(O)N(C2=NC(=O)N(C=C=C(O)C(=[OH+])C=O)C=C2)C1O
375 580.3228564721 C=C(N=C(O)N(C)C1C=C(O)C(=C=[OH+])O1)N1C(=O)C(CCC(O)CCCCC)=C(CCCCCCC(O)O)C1(C)O Intermediate Fragment 
376 146.0811696641 C[NH2+]C1CC(O)C(=CO)O1
377 435.2489632601 C=C([NH+]=C=O)N1C(=O)C(C#CC(O)CCCCC)=C(CCCCCCC(O)O)C1(C)O
378 580.3228564721 C=CN(C(=O)N=CN1C(O)C(CCC(O)CCCCC)=C(CCCCCCC(O)O)C1(C)O)C1C=C(O)C(=C=[OH+])O1 Intermediate Fragment 
379 580.3228564721 CCCCCC(O)CCC1=C(CCCCCCC(O)O)C(C)(O)N(C=C=CN(C(=N)O)C2C=C(O)C(=C=[OH+])O2)C1O Intermediate Fragment 
380 406.2587996721 C#CCN1C(=[OH+])C(C#CC(O)CCCCC)=C(CCCCCCC(O)O)C1(C)O
381 392.2431496081 C#CN1C(=[OH+])C(C#CC(O)CCCCC)=C(CCCCCCC(O)O)C1(C)O
382 390.2274995441 C#CN1C(=[OH+])C(C#CC(=O)CCCCC)=C(CCCCCCC(O)O)C1(C)O
383 187.0713332521 C[NH+](C1=CC(O)C(=C=O)O1)C(N)O
384 563.2963073761 CCCCCC(O)CCC1=C(CCCCCCC(O)O)C(C)(O)N(CC#C[NH+](C=O)C2C=C(O)C(=C=O)O2)C1=O
385 537.3170428201 CCCCCC(O)CCC1C(O)N(CC#C[NH+]=C2C=C(O)C(=C=O)O2)C(C)(O)C1CCCCCCC(O)O
386 535.3013927561 CCCCCC(O)CCC1=C(CCCCCCC(O)O)C(C)(O)N(CC#C[NH+]=C2C=C(O)C(=C=O)O2)C1O
387 580.3228564721 CCCCCC(O)CCC1=C(CCCCCCC(O)O)C(C)(O)N(C(N)=C=CN(C=O)C2C=C(O)C(=C=[OH+])O2)C1O Intermediate Fragment 
388 552.3279418521 CCCCCC(O)CCC1C(O)N(C(N)C#C[NH+]=C2C=C(O)C(=C=O)O2)C(C)(O)C1CCCCCCC(O)O
389 580.3228564721 CCCCCC(O)CCC1C(O)N(C(=C=CN=C2C=C(O)C(=C=[OH+])O2)N=CO)C(C)(O)C1CCCCCCC(O)O Intermediate Fragment 
390 580.3228564721 CCCCCC(O)CCC(C(CCCCCCC(O)O)=C(C)O)C(O)NC1=NC(=O)N(C2C=C(O)C(=C=[OH+])O2)C=C1 Intermediate Fragment 
391 538.3122917881 CCCCCC(O)CCC(CCCCCCCC(O)O)C(O)[NH2+]C1=NC(=O)N(C2C=C(O)C(=C=O)O2)C=C1
392 536.2966417241 CCCCCC(O)CCC(=CCCCCCCC(O)O)C(O)[NH2+]C1=NC(=O)N(C2C=C(O)C(=C=O)O2)C=C1
393 534.2809916601 CCCCCC(O)CCC(=CCCCCCCC(O)O)C(=O)[NH2+]C1=NC(=O)N(C2C=C(O)C(=C=O)O2)C=C1
394 516.2704269761 CCCCCCC=CC(=CCCCCCCC(O)O)C(=O)[NH2+]C1=NC(=O)N(C2C=C(O)C(=C=O)O2)C=C1
395 398.2285621641 CCCCCC(O)CCCC(O)[NH2+]C1C=CN(C2C=C(O)C(=C=O)O2)C(O)N1
396 280.1655679841 CCCCCC(O)CC=C=C(O)[NH2+]C1=CC=NC(O)=N1
397 396.2129121001 CCCCCC(O)CCCC(O)[NH2+]C1=NC(O)N(C2C=C(O)C(=C=O)O2)C=C1
398 396.2129121001 CCCCCC(O)CCCC(O)[NH2+]C1=NC(O)N(C=C=C(O)C(=O)C=O)C=C1 Intermediate Fragment 
399 394.1972620361 CCCCCC(O)CCCC(O)[NH2+]C1=NC(=O)N(C2C=C(O)C(=C=O)O2)C=C1
400 376.1866973521 CCCCCCCCC=C(O)[NH2+]C1=NC(=O)N(C2C=C(O)C(=C=O)O2)C=C1
401 394.1972620361 CCCCCC(O)CCCC(O)[NH2+]C1=NC(=O)N(C=C=C(O)C(=O)C=O)C=C1 Intermediate Fragment 
402 392.1816119721 CCCCCC(O)CCC=C(O)[NH2+]C1=NC(=O)N(C2C=C(O)C(=C=O)O2)C=C1
403 179.0702706321 CC(O)=C=C=C=C=C=CCC(O)[OH2+]
404 181.0859206961 CC(O)=C=C=C=C=CCCC(O)[OH2+]
405 163.0753560121 CC#CC#CC#CCCC(O)[OH2+]
406 183.1015707601 CC(O)=C=C=C=CCCCC(O)[OH2+]
407 165.0910060761 CC#CC#CC=CCCC(O)[OH2+]
408 185.1172208241 CC(O)=C=C=CCCCCC(O)[OH2+]
409 139.0753560121 C#CC#CCCCC(O)[OH2+]
410 123.0804413921 CCC=C=C=C=C(C)[OH2+]
411 125.0960914561 CCCC=C=C=C(C)[OH2+]
412 187.1328708881 CC(O)=C=CCCCCCC(O)[OH2+]
413 256.0927969681 O=C=C1OC(N2C=CC([NH2+]CO)NC2O)C=C1O
414 254.0771469041 O=C=C1OC(N2C=CC([NH2+]CO)=NC2O)C=C1O
415 254.0771469041 O=CC(=O)C(O)=C=CN1C=CC([NH2+]CO)=NC1O Intermediate Fragment 
416 252.0614968401 O=C=C1OC(N2C=CC([NH2+]CO)=NC2=O)C=C1O
417 325.2373359561 CCCCCC([OH2+])=CC#CC(CCCCCCC(O)O)=C(C)O
418 307.2267712721 CCCCCC#CC#CC(CCCCCCC(O)[OH2+])=C(C)O
419 307.2267712721 CC=C(C#CC=C([OH2+])C=CCCC)CCCCCCC(O)O
420 327.2529860201 CCCCCC([OH2+])CC#CC(CCCCCCC(O)O)=C(C)O
421 353.2322505761 CCCCCC(O)C#CC(=C=[OH+])C(CCCCCCC(O)O)=C(C)O
422 355.2479006401 CCCCCC(O)C=CC(=C=[OH+])C(CCCCCCC(O)O)=C(C)O
423 580.3228564721 CCCCCC(O)CCC(CO)=C(CCCCCCC(O)O)C(C)(O)NC1=NC(=O)N(C2C=C(O)C(=C=[OH+])O2)C=C1 Intermediate Fragment 
424 154.0611029161 CC(O)=[NH+]C1=CC=NC(O)=N1
425 270.1084470321 CC(O)[NH2+]C1C=CN(C2C=C(O)C(=C=O)O2)C(O)N1
426 173.1536063321 CCCCCC(O)CCC=C[OH2+]
427 153.1273915841 CCCCCCC=CC#C[OH2+]
428 167.1066561401 CCCCCC(O)C#CC#C[OH2+]
429 410.1921766561 CC(O)(CCCCCCCC(O)O)[NH2+]C1=NC(=O)N(C2C=C(O)C(=C=O)O2)C=C1
430 552.3279418521 CCCCCC(O)CCCC(CCCCCCC(O)O)C(C)(O)[NH2+]C1=NC(=O)N(C2C=C(O)C(=C=O)O2)C=C1
431 580.3228564721 CCCCCC(O)CCC=C(CCCCCCC(O)O)C(C)(O)N(CO)C1=NC(=O)N(C2C=C(O)C(=C=[OH+])O2)C=C1 Intermediate Fragment 
432 323.2216858921 CCCC=CC([OH2+])=CC#CC(CCCCCCC(O)O)=C(C)O
433 258.1084470321 O=C=C1OC(N2CCC([NH2+]CO)NC2O)C=C1O
434 283.2267712721 CCCCCC([OH2+])C=CC#CCCCCCCC(O)O
435 281.2111212081 CCCCCC([OH2+])C#CC#CCCCCCCC(O)O
436 279.1954711441 CCCCCC(=[OH+])C#CC#CCCCCCCC(O)O
437 277.1798210801 CCCC=CC(=[OH+])C#CC#CCCCCCCC(O)O
438 300.1190117161 CC(O)[NH+](CO)C1C=CN(C2C=C(O)C(=C=O)O2)C(O)N1
439 300.1190117161 CC(O)[NH+](CO)C1C=CN(C=C=C(O)C(=O)C=O)C(O)N1 Intermediate Fragment 
440 302.1346617801 CC(O)[NH+](CO)C1CCN(C2C=C(O)C(=C=O)O2)C(O)N1
441 302.1346617801 CC(O)[NH+](CO)C1CCN(C(O)=C=C(O)C#CO)C(O)N1 Intermediate Fragment 
442 139.1117415201 C#CC=C([OH2+])CCCCC
443 121.1011768361 [CH2+]#CC#CCCCCC
444 137.0960914561 C#CC=C([OH2+])C=CCCC
445 119.0855267721 [CH2+]#CC#CC=CCCC
446 436.1714412121 CC(O)(C=CCCCCCC(O)O)[NH+](C=O)C1=NC(=O)N(C2C=C(O)C(=C=O)O2)C=C1
447 418.1608765281 C[NH+](C1=NC(=O)N(C2C=C(O)C(=C=O)O2)C=C1)C(C)(O)C#CC=CCCCC(O)O
448 438.1870912761 CC(O)(CCCCCCCC(O)O)[NH+](C=O)C1=NC(=O)N(C2C=C(O)C(=C=O)O2)C=C1
449 440.2027413401 CC(O)(CCCCCCCC(O)O)[NH+](CO)C1=NC(=O)N(C2C=C(O)C(=C=O)O2)C=C1
450 442.2183914041 CC(O)(CCCCCCCC(O)O)[NH+](CO)C1=NC(O)N(C2C=C(O)C(=C=O)O2)C=C1
451 550.3122917881 CCCCCC(O)CCC=C(CCCCCCC(O)O)C(C)(O)[NH2+]C1=NC(=O)N(C2C=C(O)C(=C=O)O2)C=C1
452 580.3228564721 CCCCCC(O)CCC=C(O)N(C1=NC(=O)N(C2C=C(O)C(=C=[OH+])O2)C=C1)C(C)(O)CCCCCCCC(O)O Intermediate Fragment 
453 580.3228564721 CCCCCC(O)CCC(=CCCCCCCC(O)O)C(O)N(C1=NC(=O)N(C2C=C(O)C(=C=[OH+])O2)C=C1)C(C)O Intermediate Fragment 
