#In-silico ESI-MS/MS [M+H]+ Spectra
#PREDICTED BY CFM-ID 4.0.8
#SMILES=O1[C@H](CO)[C@@H](C[C@@H]1n1cc(c(nc1=O)N)O)O
#InChiKey=CKZJTNZSBMVFSU-QPPQHZFASA-N
energy0
128.04545 100.00 2 42 62 28 54 66 (61.597 1.6543 1.4297 0.88807 0.60955 0.076118)
226.08223 6.43 110 5 111 163 112 109 9 167 (3.6227 0.36897 0.15945 0.076322 0.012895 0.012381 0.0050019 0.00073117)
244.09280 17.31 0 181 113 169 215 177 203 174 195 192 234 222 (10.824 0.41975 0.12793 0.035266 0.020896 0.016268 0.0081881 0.0037565 0.003228 0.0029602 0.0025497 0.0012303)
energy1
43.02907 8.25 49 (1.6769)
45.03349 10.28 83 (2.088)
56.01309 19.75 34 46 (3.9453 0.067884)
57.03349 10.70 92 157 (2.1725 0.0014315)
58.02874 17.91 19 47 (3.4181 0.22089)
71.02399 10.36 32 45 56 (2.0077 0.055128 0.042939)
73.03964 17.90 13 44 57 (3.3151 0.25037 0.072167)
83.02399 14.09 38 (2.8632)
84.00800 12.05 50 (2.4484)
85.03964 63.84 23 43 (12.702 0.2703)
99.01890 6.61 59 31 (0.9995 0.34437)
99.04406 32.89 87 7 80 (4.7333 1.4173 0.53313)
100.05054 29.01 40 65 (4.0682 1.8262)
101.03455 6.94 30 60 (1.0144 0.39634)
111.01890 10.46 27 52 29 (0.91471 0.88965 0.32149)
126.02980 23.69 41 61 70 53 69 (3.4773 0.7524 0.42395 0.11118 0.048602)
128.04545 100.00 2 28 62 42 54 66 (8.8371 7.0882 2.6643 1.068 0.58185 0.079646)
energy2
43.01784 4.57 82 (1.2361)
43.02907 11.60 49 (3.1398)
45.03349 16.91 83 (4.5772)
45.04472 7.69 48 (2.082)
56.01309 5.71 46 34 (0.92287 0.62403)
57.03349 14.34 92 157 (3.7335 0.14813)
58.02874 8.98 19 47 (1.5138 0.9162)
71.02399 8.70 32 56 45 (1.7518 0.5336 0.068505)
71.04914 24.99 158 159 (4.6862 2.0776)
73.03964 6.86 13 44 57 (1.1585 0.43448 0.26274)
73.06479 3.98 162 161 (0.54342 0.53325)
83.02399 7.48 38 (2.0255)
85.03964 9.14 23 43 (2.3256 0.14886)
99.04406 6.70 7 80 87 (1.3532 0.31086 0.14951)
100.05054 5.18 40 65 (1.2651 0.13588)
101.05971 3.39 104 105 (0.46792 0.45088)
110.03489 3.41 26 (0.92188)
111.01890 13.54 27 52 29 (3.0689 0.58121 0.014383)
112.05054 4.49 24 (1.2158)
126.02980 13.11 41 61 70 69 53 (1.9939 0.85621 0.33074 0.31099 0.057033)
128.04545 100.00 42 28 54 66 2 62 (9.1111 5.6953 4.439 2.7726 2.5291 2.523)
142.06110 7.66 143 129 (2.0573 0.017512)
156.07675 6.01 176 (1.6271)
172.06043 3.35 202 193 (0.51883 0.38712)

0 244.0927969681 [NH3+]c1nc(=O)n(C2CC(O)C(CO)O2)cc1O
1 212.0665822201 [NH3+]C1=NC(O)N(C2=CC(O)=CO2)C=C1O
2 128.0454528521 [NH3+]C1=NC(=O)N=CC1O
3 214.0822322841 [NH3+]C1NC(O)N(C2=CC(O)=CO2)C=C1O
4 216.0978823481 [NH3+]C1NC(O)N(C2=CC(O)=CO2)CC1O
5 226.0822322841 C=C1OC(N2C=C(O)C([NH3+])=NC2O)C=C1O
6 130.0611029161 [NH3+]C1=NC(O)N=CC1O
7 99.0440558841 C=C1OC=CC1[OH2+]
8 208.0716676001 C=C1C=CC(N2C=C(O)C([NH3+])=NC2=O)O1
9 226.0822322841 CC(=O)C(O)=C=CN1C=C(O)C([NH3+])=NC1O Intermediate Fragment 
10 134.0924030441 [NH3+]C1NC(O)NCC1O
11 116.0818383601 [NH3+]C1NCN=CC1O
12 134.0924030441 N=CC(O)C([NH3+])NCO Intermediate Fragment 
13 73.0396392001 NC=[NH+]C=O
14 87.0552892641 [NH+]#CC(O)CN
15 89.0709393281 NCC(O)C=[NH2+]
16 134.0924030441 NC(O)N=CC(O)C[NH3+] Intermediate Fragment 
17 72.0443902321 C=C(O)C=[NH2+]
18 134.0924030441 [NH3+]CNC(O)N=CCO Intermediate Fragment 
19 58.0287401681 [NH+]#CCO
20 134.0924030441 C=NC(O)NC([NH3+])CO Intermediate Fragment 
21 132.0767529801 [NH3+]C1NC(O)N=CC1O
22 132.0767529801 N=C=C(O)C([NH3+])NCO Intermediate Fragment 
23 85.0396392001 [NH+]#CC(O)=CN
24 112.0505382321 [NH3+]C1=C(O)C=NC=N1
25 130.0611029161 N=C=C(O)C([NH3+])=NCO Intermediate Fragment 
26 110.0348881681 [NH2+]=C1N=CN=CC1=O
27 111.0189037561 O=C1C=NC(=[OH+])N=C1
28 128.0454528521 N=C=C(O)C([NH3+])=NC=O Intermediate Fragment 
29 111.0189037561 [CH+]=C(O)C(=N)N=C=O
30 101.0345538201 N=C(CO)[NH+]=C=O
31 99.0189037561 N=C(C=O)[NH+]=C=O
32 71.0239891361 N=C=[NH+]C=O
33 69.0083390721 N=C=[N+]=C=O
34 56.0130901041 [NH+]#CC=O
35 60.0443902321 [NH2+]=CCO
36 44.0130901041 [NH+]#CO
37 81.0083390721 N#CC(=O)C#[NH+]
38 83.0239891361 N#CC(O)C#[NH+]
39 98.0348881681 N=C(N)C(=O)C#[NH+]
40 100.0505382321 N=C(N)C(O)C#[NH+]
41 126.0298027881 [NH+]#CC(O)=C(N)N=C=O
42 128.0454528521 N=C([NH3+])C(O)=C=NC=O Intermediate Fragment 
43 85.0396392001 [CH+]=C(O)C(=N)N
44 73.0396392001 NC(=[NH2+])C=O
45 71.0239891361 N=C(N)C#[O+]
46 56.0130901041 C#[N+]C=O
47 58.0287401681 C=[NH+]C=O
48 45.0447245801 NC=[NH2+]
49 43.0290745161 [NH+]#CN
50 84.0080047241 O=C=C=[NH+]C=O
51 86.0236547881 O=C[NH+]=C=CO
52 111.0189037561 N#CC(O)=C=[NH+]C=O
53 126.0298027881 N=C(N)C(O)=C=NC#[O+]
54 128.0454528521 N=C(O)N=C=C(O)C=[NH2+] Intermediate Fragment 
55 68.0130901041 [CH+]=C(O)C#N
56 71.0239891361 C#[N+]C(=N)O
57 73.0396392001 C=[NH+]C(=N)O
58 30.0338255481 C=[NH2+]
59 99.0189037561 NC(O)=[N+]=C=C=O
60 101.0345538201 NC(O)=[NH+]C=C=O
61 126.0298027881 N#CC(O)=C=[NH+]C(=N)O
62 128.0454528521 [NH3+]C=NC(=O)N=C=CO Intermediate Fragment 
63 86.0348881681 N=C=NC([NH3+])=O
64 98.0348881681 C=[NH+]C(=O)N=C=N
65 100.0505382321 C=[NH+]C(=O)N=CN
66 128.0454528521 C=NC(O)=NC([NH3+])=C=O Intermediate Fragment 
67 96.0192381041 C#[N+]C(=O)N=C=N
68 97.0032536921 N=C(C#[O+])N=C=O
69 126.0298027881 C#[N+]C(O)=NC(N)=C=O
70 126.0298027881 [NH2+]=C=NC(=O)N=C=CO Intermediate Fragment 
71 111.0076703761 O=C1C=COC1=C=[OH+]
72 113.0233204401 OC1C=COC1=C=[OH+]
73 115.0389705041 OC1CCOC1=C=[OH+]
74 87.0440558841 [OH2+]C1=COCC1
75 115.0389705041 OCC=C(O)C#C[OH2+] Intermediate Fragment 
76 115.0389705041 CC=C(O)C(=O)C=[OH+] Intermediate Fragment 
77 117.0546205681 OC1CCOC1=C[OH2+]
78 85.0284058201 [OH2+]C1=COC=C1
79 89.0597059481 [OH2+]C1CCOC1
80 99.0440558841 [OH+]=C=C1CCCO1
81 117.0546205681 OCCC(O)C#C[OH2+] Intermediate Fragment 
82 43.0178411361 C#C[OH2+]
83 45.0334912001 C=C[OH2+]
84 47.0491412641 CC[OH2+]
85 87.0440558841 CC(O)C#C[OH2+]
86 89.0597059481 CC(O)C=C[OH2+]
87 99.0440558841 CC=C(O)C#C[OH2+]
88 117.0546205681 OCCCOC#C[OH2+] Intermediate Fragment 
89 73.0284058201 OC#CC[OH2+]
90 75.0440558841 OC=CC[OH2+]
91 61.0284058201 OCC=[OH+]
92 57.0334912001 CC#C[OH2+]
93 59.0491412641 CC=C[OH2+]
94 117.0546205681 CCOC(=C=[OH+])CO Intermediate Fragment 
95 89.0597059481 CC[OH+]C=CO
96 91.0389705041 OCC(=[OH+])CO
97 117.0546205681 COC(=C=[OH+])C(C)O Intermediate Fragment 
98 117.0546205681 CCC(O)C(=O)C=[OH+] Intermediate Fragment 
99 61.0647913281 CCC[OH2+]
100 59.0127557561 OC=C=[OH+]
101 31.0542266441 C[CH4+]
102 29.0385765801 C=[CH3+]
103 119.0702706321 OC1CCOC1C[OH2+]
104 101.0597059481 C=C1OCCC1[OH2+]
105 101.0597059481 [OH2+]C=C1CCCO1
106 119.0702706321 OCCC(O)C=C[OH2+] Intermediate Fragment 
107 227.0662478721 OC1=CN(C2C=C(O)C(=C=[OH+])O2)C(O)NC1
108 227.0662478721 O=C(C=[OH+])C(O)=C=CN1C=C(O)CNC1O Intermediate Fragment 
109 226.0822322841 [NH3+]C1C=CN(C2C=C(O)C(=C=O)O2)C(O)N1
110 226.0822322841 [NH3+]C1NC(O)N(C2C=CC(=C=O)O2)C=C1O
111 226.0822322841 [NH3+]C1NC(O)N(C=C=CC(=O)C=O)C=C1O Intermediate Fragment 
112 226.0822322841 [NH3+]C(NCO)C(O)=CN=C1C=CC(=C=O)O1 Intermediate Fragment 
113 244.0927969681 [NH3+]C1NC(O)N(C(O)=C=C(O)C#CO)CC1O Intermediate Fragment 
114 202.0822322841 [NH3+]C1NC(O)N(C(O)C#CO)C=C1O
115 200.0665822201 [NH3+]C1=NC(O)N(C(O)C#CO)C=C1O
116 156.0403674721 [NH3+]C1=NC(=O)N(C=O)C=C1O
117 182.0560175361 C#CC(O)N1C=C(O)C([NH3+])=NC1=O
118 198.0509321561 [NH3+]C1=NC(=O)N(C(O)C#CO)C=C1O
119 170.0560175361 C=C(O)N1C=C(O)C([NH3+])=NC1=O
120 180.0403674721 C#CC(=O)N1C=C(O)C([NH3+])=NC1=O
121 176.1029677281 C=C(O)N1CC(O)C([NH3+])NC1O
122 174.0873176641 C=C(O)N1C=C(O)C([NH3+])NC1O
123 172.0716676001 C=C(O)N1C=C(O)C([NH3+])=NC1O
124 154.0611029161 C#CN1C=C(O)C([NH3+])=NC1O
125 172.0716676001 C=C(O)N=C=C(O)C([NH3+])=NCO Intermediate Fragment 
126 72.0443902321 C=[NH+]C(=C)O
127 127.0502038841 C=C(O)[NH+]=C=C(O)C=N
128 129.0658539481 C=C(O)[NH+]=C=C(O)CN
129 142.0611029161 C=C(O)[NH+]=C=C(O)C(=N)N
130 144.0767529801 C=C(O)[NH+]=C=C(O)C(N)N
131 172.0716676001 C=C(O)N(C=O)C=C(O)C(=N)[NH3+] Intermediate Fragment 
132 155.0451185041 C=C(O)[NH+](C=O)C=C(O)C#N
133 172.0716676001 C=C(O)N(C=C(O)C=[NH2+])C(=N)O Intermediate Fragment 
134 172.0716676001 C=C(O)N(C)C(O)=NC([NH3+])=C=O Intermediate Fragment 
135 152.0454528521 C#CN1C=C(O)C([NH3+])=NC1=O
136 170.0560175361 C=C(O)N=C=C(O)C([NH3+])=NC=O Intermediate Fragment 
137 170.0560175361 C=C(O)N(C#[O+])C=C(O)C(=N)N Intermediate Fragment 
138 170.0560175361 [CH+]=C(O)N(C)C(O)=NC(N)=C=O Intermediate Fragment 
139 168.0403674721 [CH+]=C(O)N1C=C(O)C(N)=NC1=O
140 71.0127557561 O=CC#C[OH2+]
141 55.0178411361 C#CC=[OH+]
142 160.0716676001 [NH3+]C1=NC(O)N(CO)C=C1O
143 142.0611029161 CN1C=C(O)C([NH3+])=NC1=O
144 158.0560175361 [NH3+]C1=NC(=O)N(CO)C=C1O
145 140.0454528521 [CH2+]N1C=C(O)C(N)=NC1=O
146 158.0560175361 [NH3+]C(=NC=O)C(O)=CN=CO Intermediate Fragment 
147 158.0560175361 N=C([NH3+])C(O)=CN(C=O)C=O Intermediate Fragment 
148 156.0403674721 [NH3+]C(=NC=O)C(O)=CN=C=O Intermediate Fragment 
149 113.0345538201 N#CC(O)=C[NH+]=CO
150 156.0403674721 N=C(N)C(O)=CN(C#[O+])C=O Intermediate Fragment 
151 156.0403674721 [NH2+]=C=NC(=O)N(C=C=O)CO Intermediate Fragment 
152 154.0247174081 NC1=NC(=O)N(C#[O+])C=C1O
153 154.0247174081 NC(=NC#[O+])C(O)=CN=C=O Intermediate Fragment 
154 59.0491412641 C=C(C)[OH2+]
155 69.0334912001 C#CC(=C)[OH2+]
156 69.0334912001 C=CC#C[OH2+]
157 57.0334912001 [CH+]=C(C)O
158 71.0491412641 C#CC(C)[OH2+]
159 71.0491412641 CCC#C[OH2+]
160 91.0753560121 CC(O)CC[OH2+]
161 73.0647913281 C=CC(C)[OH2+]
162 73.0647913281 CCC=C[OH2+]
163 226.0822322841 [NH3+]C1NC(O)N(C=C=C(O)C#CO)C=C1O
164 208.0716676001 C#CC(O)=C=CN1C=C(O)C([NH3+])=NC1O
165 182.0560175361 [NH3+]C1=NC(=O)N(CC#CO)C=C1O
166 180.0403674721 NC1=NC(=O)N([CH+]C#CO)C=C1O
167 226.0822322841 [NH3+]C(NCO)C(O)=CN=C=C=C(O)C#CO Intermediate Fragment 
168 242.0771469041 [NH3+]C1NC(O)N(C(O)=C=C(O)C#CO)C=C1O
169 244.0927969681 [NH3+]C1NC(O)N(C(=C=CO)OC#CO)CC1O Intermediate Fragment 
170 214.0822322841 C=C(OC#CO)N1C=C(O)C([NH3+])NC1O
171 63.0440558841 OCC[OH2+]
172 184.0716676001 [NH3+]C1=NC(O)N(CC#CO)C=C1O
173 186.0873176641 [NH3+]C1NC(O)N(CC#CO)C=C1O
174 244.0927969681 C=C(OC(=C=O)CO)N1C=C(O)C([NH3+])NC1O Intermediate Fragment 
175 152.0454528521 C#CN=C=C(O)C([NH3+])=NC=O Intermediate Fragment 
176 156.0767529801 C#CN1C=C(O)C([NH3+])NC1O
177 244.0927969681 C=C(O)C(=C=O)OCN1C=C(O)C([NH3+])NC1O Intermediate Fragment 
178 140.0454528521 C=NC=C(O)C(N)=NC#[O+] Intermediate Fragment 
179 140.0454528521 [CH2+]N(C=C(O)C#N)C(=N)O Intermediate Fragment 
180 144.0767529801 CN1C=C(O)C([NH3+])=NC1O
181 244.0927969681 [NH3+]C1NC(O)N(C=C=C(O)C(=O)C=O)CC1O Intermediate Fragment 
182 188.1029677281 [NH3+]C1NC(O)N(CC#CO)CC1O
183 160.1080531081 C=CN1CC(O)C([NH3+])NC1O
184 160.1080531081 C#CN(CC(O)C[NH3+])C(N)O Intermediate Fragment 
185 158.0924030441 C#CN1CC(O)C([NH3+])NC1O
186 89.0233204401 O=CC(=[OH+])CO
187 73.0284058201 CC(=[OH+])C=O
188 93.0546205681 OCC([OH2+])CO
189 75.0440558841 CC(=[OH+])CO
190 146.0924030441 CN1C=C(O)C([NH3+])NC1O
191 242.0771469041 [NH3+]C1NC(O)N(C=C=C(O)C(=O)C=O)C=C1O
192 244.0927969681 CN(C(O)NC([NH3+])=CO)C1C=C(O)C(=C=O)O1 Intermediate Fragment 
193 172.0604342201 C[NH+](CO)C1C=C(O)C(=C=O)O1
194 146.0811696641 C[NH2+]C1CC(O)C(=CO)O1
195 244.0927969681 [NH3+]CNC(O)N(C=CO)C1C=C(O)C(=C=O)O1 Intermediate Fragment 
196 217.0818979361 NC(O)[NH+](CCO)C1C=C(O)C(=C=O)O1
197 176.0917343481 OC=C1OC([NH2+]CCO)CC1O
198 158.0811696641 C=C1OC([NH2+]CCO)C=C1O
199 144.0655196001 C[NH2+]C1CC(O)C(=C=O)O1
200 174.0760842841 O=C=C1OC([NH2+]CCO)CC1O
201 174.0760842841 OC#CC(O)=CC(O)[NH2+]CCO Intermediate Fragment 
202 172.0604342201 O=C=C1OC([NH2+]CCO)C=C1O
203 244.0927969681 NC(O)N(C=C(O)C[NH3+])C1C=C(O)C(=C=O)O1 Intermediate Fragment 
204 183.0400331241 C=[N+](C(=N)O)C1C=C(O)C(=C=O)O1
205 140.0342194721 C[NH+]=C1C=C(O)C(=C=O)O1
206 183.0400331241 C=[N+](C=C=C(O)C(=O)C=O)C(=N)O Intermediate Fragment 
207 97.0396392001 C#C[N+](=C)C(=N)O
208 185.0556831881 C[NH+](C(=N)O)C1C=C(O)C(=C=O)O1
209 142.0498695361 C[NH2+]C1C=C(O)C(=C=O)O1
210 185.0556831881 C[NH+](C=C=C(O)C(=O)C=O)C(=N)O Intermediate Fragment 
211 187.0713332521 C[NH+](C(N)O)C1C=C(O)C(=C=O)O1
212 187.0713332521 C[NH+](C=C=C(O)C(=O)C=O)C(N)O Intermediate Fragment 
213 189.0869833161 C[NH+](C(N)O)C1CC(O)C(=C=O)O1
214 227.0662478721 NCC(O)=C[NH+](C=O)C1C=C(O)C(=C=O)O1
215 244.0927969681 NC([NH3+])C(O)=CN(CO)C1C=C(O)C(=C=O)O1 Intermediate Fragment 
216 158.0447841561 O=C=C1OC([NH2+]CO)C=C1O
217 200.0553488401 O=C=C1OC([NH+](C=CO)CO)C=C1O
218 202.0709989041 O=C=C1OC([NH+](CO)CCO)C=C1O
219 216.0978823481 NC(N)C(O)C[NH2+]C1C=C(O)C(=C=O)O1
220 216.0978823481 NC(N)C(O)C[NH2+]C(O)=C=C(O)C#CO Intermediate Fragment 
221 214.0822322841 NC(N)C(O)C[NH+]=C1C=C(O)C(=C=O)O1
222 244.0927969681 [NH3+]C(NCO)C(O)CN=C1C=C(O)C(=C=O)O1 Intermediate Fragment 
223 119.0815040121 C=C(O)C(N)[NH2+]CO
224 132.0655196001 [NH3+]C1CC(O)C(=CO)O1
225 132.0655196001 [NH3+]C(O)CC(O)C#CO Intermediate Fragment 
226 144.0655196001 C[NH2+]CC=C(O)C(=O)C=O Intermediate Fragment 
227 168.0291340921 O=C=C1OC(=[NH+]C=CO)C=C1O
228 170.0447841561 O=C=C1OC(=[NH+]CCO)C=C1O
229 197.0556831881 NCC(O)=C[NH+]=C1C=C(O)C(=C=O)O1
230 199.0713332521 NCC(O)C[NH+]=C1C=C(O)C(=C=O)O1
231 201.0869833161 NCC(O)C[NH2+]C1C=C(O)C(=C=O)O1
232 201.0869833161 NCC(O)C[NH2+]C=C=C(O)C(=O)C=O Intermediate Fragment 
233 212.0665822201 NC(N)C(O)=C[NH+]=C1C=C(O)C(=C=O)O1
234 244.0927969681 CC(O)C([NH3+])NC(O)N=C1C=C(O)C(=C=O)O1 Intermediate Fragment 
