#In-silico ESI-MS/MS [M+H]+ Spectra
#PREDICTED BY CFM-ID 4.0.8
#SMILES=[nH]1c(nc2c(c1=O)nc(n2[C@H]1O[C@@H](CO)[C@H](C1)O)c1c2c(c(c(c1)C(=O)N[C@H](C(=O)O)Cc1ccccc1)O)C(=O)O[C@H](C2)C)N
#InChiKey=IVJMXJUEMQSBGO-CYZGAOKHSA-N
energy0
120.08078 6.25 89 (3.0641)
470.13064 7.59 113 125 139 133 122 140 135 142 141 124 137 123 132 (3.5081 0.11624 0.032897 0.022236 0.012609 0.010173 0.0091004 0.0056129 0.0041839 0.0017636 0.00085937 0.00073172 0.00042282)
519.16227 19.27 26 44 (8.9184 0.53187)
589.20414 14.34 180 184 270 185 (6.672 0.23676 0.10485 0.018536)
617.19905 21.43 63 190 203 47 1 214 62 61 (3.7302 3.3076 1.8859 1.4379 0.041814 0.041789 0.036286 0.029547)
635.20962 100.00 0 268 231 213 228 266 265 276 205 209 259 206 274 260 211 210 225 275 212 252 251 250 (46.853 1.1412 0.67628 0.14468 0.06407 0.047495 0.02792 0.02703 0.012428 0.010652 0.009387 0.0066163 0.0062692 0.0057685 0.0046543 0.0030691 0.0025727 0.0019771 0.0017394 0.0015488 0.0006015 8.7056e-05)
energy1
57.03349 13.45 14 (1.208)
91.05423 10.16 95 (0.91222)
99.04406 34.79 12 9 10 (1.835 0.8911 0.3986)
103.05423 31.81 162 (2.8571)
105.06988 19.27 160 (1.7307)
117.05462 46.93 6 11 17 19 22 (2.3847 1.3987 0.32335 0.079822 0.027745)
120.08078 100.00 89 (8.9809)
131.04914 42.26 167 (3.7955)
133.06479 31.34 163 (2.8144)
326.08838 19.80 28 (1.778)
328.10403 20.56 29 (1.8466)
354.08329 20.67 34 (1.8567)
356.09894 30.57 35 (2.7454)
424.12516 27.86 49 77 (2.3071 0.19502)
426.14081 13.55 50 (1.2166)
440.12007 13.58 75 105 111 (0.68986 0.52963 0.00022296)
442.13572 24.55 76 116 138 79 82 80 81 (1.4607 0.35314 0.207 0.089464 0.043965 0.026417 0.023895)
452.12007 73.88 53 119 117 126 120 114 (5.113 0.69846 0.62206 0.11458 0.078831 0.008525)
469.14662 21.25 56 173 175 (1.3514 0.54933 0.008004)
470.13064 69.43 113 125 139 122 132 137 135 142 133 141 140 124 123 (5.3114 0.29423 0.1027 0.093874 0.086882 0.081484 0.078634 0.048219 0.037629 0.02991 0.027762 0.025055 0.017429)
473.15679 19.71 40 (1.7705)
475.17244 15.26 41 (1.37)
487.15719 10.53 172 174 (0.81827 0.12715)
501.15171 11.12 42 (0.99826)
519.16227 13.87 26 44 (1.2097 0.036285)
571.19357 30.11 59 181 (2.4617 0.24229)
589.20414 21.67 180 270 184 185 (1.4314 0.40589 0.08546 0.022938)
591.18340 45.39 229 (4.0764)
617.19905 34.50 214 47 190 63 203 1 62 61 (0.74574 0.73874 0.72132 0.44069 0.28146 0.13874 0.02515 0.0068008)
635.20962 14.51 0 231 213 268 276 266 206 225 265 209 274 228 205 210 259 252 275 250 260 212 251 211 (0.8632 0.31786 0.044194 0.01814 0.010869 0.0096567 0.0092452 0.0059242 0.0042805 0.0036103 0.0034138 0.0028623 0.0023771 0.0016781 0.001451 0.0013846 0.001056 0.00064614 0.00057923 0.00025131 0.00016775 6.4106e-05)
energy2
77.03858 24.42 197 (2.3005)
81.06988 14.51 156 (1.3666)
91.05423 73.36 95 (6.911)
99.04406 9.50 9 10 12 (0.67609 0.15397 0.065288)
103.05423 100.00 162 (9.4213)
105.06988 36.44 160 (3.4332)
107.08553 31.89 152 (3.0044)
120.08078 75.14 89 (7.0795)
131.04914 41.13 167 (3.8746)
133.06479 33.91 163 (3.1944)
157.12231 8.70 150 (0.8199)
205.04954 13.75 101 (1.2958)
354.08329 40.74 34 (3.8378)
356.09894 24.72 35 (2.3286)
382.07821 16.56 242 (1.5605)
426.10442 9.02 136 (0.84964)
436.08877 8.08 73 100 (0.46149 0.29961)
440.12007 14.11 111 75 105 (0.70589 0.41262 0.21093)
450.10442 22.82 106 64 52 (1.2595 0.56869 0.32126)
452.12007 29.95 126 119 117 53 114 120 (0.97283 0.73019 0.42902 0.36968 0.16187 0.15824)
454.13572 12.99 146 144 54 (0.67678 0.27757 0.2695)
511.15719 11.50 201 (1.0834)
561.17284 11.23 226 (1.0578)
563.18849 10.14 227 (0.95539)
573.20922 11.73 189 187 60 (0.74859 0.17869 0.17801)
591.18340 21.24 229 (2.0009)
593.19905 24.77 230 (2.3334)
605.16267 9.88 261 264 273 (0.64519 0.19616 0.089328)
609.19397 7.58 262 (0.71426)
617.19905 22.51 214 1 203 190 63 61 47 62 (1.9634 0.13436 0.022768 0.0002896 2.6742e-05 2.7393e-06 2.4555e-06 7.4926e-07)

0 635.2096176121 CC1Cc2c(-c3nc4c(=O)[nH]c(N)nc4n3C3CC(O)C(CO)O3)cc(C(=O)[NH2+]C(Cc3ccccc3)C(=O)O)c(O)c2C(=O)O1
1 617.1990529281 CC1CC2=C(C3=NC4=CN=C(N)N=C4N3C3C=C(O)C(=C=O)O3)C=C(C(=O)[NH+]=C(C=C3CCCCC3)C(=O)O)C(O)=C2C(O)O1
2 119.0702706321 OC1CCOC1C[OH2+]
3 101.0597059481 C=C1OCCC1[OH2+]
4 101.0597059481 [OH2+]C=C1CCCO1
5 119.0702706321 O=CCC(O)CC[OH2+] Intermediate Fragment 
6 117.0546205681 OC=CC(O)CC=[OH+]
7 87.0440558841 [OH2+]C1=COCC1
8 89.0597059481 [OH2+]C1CCOC1
9 99.0440558841 C=C1OCC=C1[OH2+]
10 99.0440558841 [OH+]=C=C1CCCO1
11 117.0546205681 CCC(O)C(=O)C=[OH+] Intermediate Fragment 
12 99.0440558841 CC=C(O)C#C[OH2+]
13 59.0491412641 CC=C[OH2+]
14 57.0334912001 CC#C[OH2+]
15 61.0284058201 OCC=[OH+]
16 29.0385765801 C=[CH3+]
17 117.0546205681 OCCCOC#C[OH2+] Intermediate Fragment 
18 45.0334912001 C=C[OH2+]
19 117.0546205681 CCOC(=C=[OH+])CO Intermediate Fragment 
20 91.0389705041 OCC(=[OH+])CO
21 75.0440558841 OCC=C[OH2+]
22 117.0546205681 COC(=C=[OH+])C(C)O Intermediate Fragment 
23 115.0389705041 OC1CCOC1=C=[OH+]
24 115.0389705041 CC=C(O)C(=O)C=[OH+] Intermediate Fragment 
25 115.0389705041 O=CCC(O)C#C[OH2+] Intermediate Fragment 
26 519.1622734961 CC1CC2=C(C3=NC4=C(O)N=C(N)N=C4N3)C=C(C(=O)[NH+]=C(C=C3C=CC=CC3)C(=O)O)C(O)=C2C(O)O1
27 324.0727302201 CC1=CC2=C(C3=NC4=NC([NH3+])=NC(=O)C4=N3)C=CC(O)=C2C(=O)O1
28 326.0883802841 CC1CC2=C(C3=NC4=NC([NH3+])=NC(=O)C4=N3)C=CC(O)=C2C(=O)O1
29 328.1040303481 CC1CC2=C(C3=NC4=NC([NH3+])=NC(=O)C4=N3)C=CC(O)=C2C(O)O1
30 166.0862550441 [NH2+]=C(C=C1C=CCCC1)C(=O)O
31 348.0363447121 [CH+]=C1C=C2C(C3=NC4=NC(N)=NC(=O)C4=N3)=CC(=C=O)C(O)=C2C(=O)O1
32 350.0519947761 C=C1C=C2C(C3=NC4=NC([NH3+])=NC(=O)C4=N3)=CC(=C=O)C(O)=C2C(=O)O1
33 352.0676448401 C=C1CC2C(C3=NC4=NC([NH3+])=NC(=O)C4=N3)=CC(=C=O)C(O)=C2C(=O)O1
34 354.0832949041 C=C1CC2C(=C(O)C(=C=O)CC2C2=NC3=NC([NH3+])=NC(=O)C3=N2)C(=O)O1
35 356.0989449681 CC1CC2C(=C(O)C(=C=O)CC2C2=NC3=NC([NH3+])=NC(=O)C3=N2)C(=O)O1
36 151.0753560121 OC(=[OH+])C#CC1C=CCCC1
37 149.0597059481 OC(=[OH+])C#CC1C=CC=CC1
38 147.0440558841 OC(=[OH+])C#CC1=CC=CC=C1
39 371.1098440001 CC1CC2=C(C3=NC4=NC(N)=NC(=O)C4=N3)C=C(C([NH3+])=O)C(O)=C2C(O)O1
40 473.1567941921 CC1CC2=C(C3=NC4=C(O)N=C(N)N=C4N3)C=C(C(=O)[NH+]=C=C=C3C=CC=CC3)C(O)=C2C(O)O1
41 475.1724442561 CC1CC2=C(C3=NC4=C(O)N=C(N)N=C4N3)C=C(C(=O)[NH+]=C=C=C3C=CCCC3)C(O)=C2C(O)O1
42 501.1517088121 CC1CC2=C(C3=NC4=C(O)N=C(N)N=C4N3)C=C(C(=O)[NH+]=C(C=O)C=C3C=CC=CC3)C(O)=C2C(=O)O1
43 441.1153233041 CC(=[NH+]C(=O)C1=CC(C2=NC3=NC(N)=NC(=O)C3=N2)=C2CC(C)OC(O)C2=C1O)C(=O)O
44 519.1622734961 CCCC1=C(C2=NC3=C(O)N=C(N)N=C3N2)C=C(C(=O)[NH+]=C(C=C2C=CC=CC2)C(=O)O)C(O)=C1C(=O)O Intermediate Fragment 
45 525.2092236881 CC1CC2=C(C3=NC4=C(O)N=C(N)N=C4N3)C=C(C(=O)[NH+]=C(CC3CCCCC3)C(=O)O)C(O)=C2C(O)O1
46 605.1990529281 CC1CC2=C(C3=NC4=C(O)N=C(N)N=C4N3C3CC(O)=CO3)C=C(C(=O)[NH+]=C(C=C3C=CCCC3)C(=O)O)C(O)=C2C(O)O1
47 617.1990529281 C=C1OC(N2C(C3=C4CC(C)OC(O)C4=C(O)C(C(=O)[NH+]=C(C=C4C=CCCC4)C(=O)O)=C3)=NC3=C(O)N=C(N)N=C32)C=C1O
48 599.1884882441 C=C1C=CC(N2C(C3=C4CC(C)OC(O)C4=C(O)C(C(=O)[NH+]=C(C=C4C=CC=CC4)C(=O)O)=C3)=NC3=C(O)N=C(N)N=C32)O1
49 424.1251597161 C=C1OC(N2C(C3=C4CC(C)OC(=O)C4=C(O)C=C3)=NC3=C(O)N=C([NH3+])N=C32)C=C1O
50 426.1408097801 C=C1OC(N2C(C3=C4CC(C)OC(O)C4=C(O)C=C3)=NC3=C(O)N=C([NH3+])N=C32)C=C1O
51 448.0887742081 C=C1OC(N2C(C3=C4C=C(C)OC(=O)C4=C(O)C(C#[O+])=C3)=NC3=C(O)N=C(N)N=C32)C=C1O
52 450.1044242721 C=C1OC(N2C(C3=C4C=C(C)OC(=O)C4=C(O)C(C=O)=C3)=NC3=C(O)N=C([NH3+])N=C32)C=C1O
53 452.1200743361 C=C1OC(N2C(C3=C4CC(C)OC(=O)C4=C(O)C(C=O)=C3)=NC3=C(O)N=C([NH3+])N=C32)C=C1O
54 454.1357244001 C=C1OC(N2C(C3=C4CC(C)OC(O)C4=C(O)C(C=O)=C3)=NC3=C(O)N=C([NH3+])N=C32)C=C1O
55 153.0910060761 OC(=[OH+])C#CC1CCCCC1
56 469.1466234321 C=C1OC(N2C(C3=C4CC(C)OC(O)C4=C(O)C(C([NH3+])=O)=C3)=NC3=C(O)N=C(N)N=C32)C=C1O
57 471.1622734961 C=C1OC(N2C(C3=C4CC(C)OC(O)C4=C(O)C(C([NH3+])O)=C3)=NC3=C(O)N=C(N)N=C32)C=C1O
58 569.1779235601 C=C1OC(N2C(C3=C4CC(C)OC(O)C4=C(O)C(C(=O)[NH+]=C=C=C4C=CC=CC4)=C3)=NC3=C(O)N=C(N)N=C32)C=C1O
59 571.1935736241 C=C1OC(N2C(C3=C4CC(C)OC(O)C4=C(O)C(C(=O)[NH+]=C=C=C4C=CCCC4)=C3)=NC3=C(O)N=C(N)N=C32)C=C1O
60 573.2092236881 C=C1OC(N2C(C3=C4CC(C)OC(O)C4=C(O)C(C(=O)[NH+]=C=C=C4CCCCC4)=C3)=NC3=C(O)N=C(N)N=C32)C=C1O
61 617.1990529281 CC(=O)C(O)=CCN1C(C2=C3CC(C)OC(O)C3=C(O)C(C(=O)[NH+]=C(C=C3C=CC=CC3)C(=O)O)=C2)=NC2=C(O)N=C(N)N=C21 Intermediate Fragment 
62 617.1990529281 C#COC(C=C=O)N1C(C2=C3CC(C)OC(O)C3=C(O)C(C(=O)[NH+]=C(C=C3CCCCC3)C(=O)O)=C2)=NC2=C(O)N=C(N)N=C21 Intermediate Fragment 
63 617.1990529281 CC1CC2=C(C3=NC4=C(O)N=C(N)N=C4N3C3C=CC(=C=O)O3)C=C(C(=O)[NH+]=C(C=C3CCCCC3)C(=O)O)C(O)=C2C(O)O1
64 450.1044242721 CC1CC2=C(C3=NC4=C(O)N=C([NH3+])N=C4N3C3C=CC(=C=O)O3)C=C(C=O)C(O)=C2C(=O)O1
65 370.1285137801 CC1CC2=CC=C(C(=O)[NH+]=C(C=C3C=CC=CC3)C(=O)O)C(O)=C2C(O)O1
66 368.1128637161 CC1CC2=CC=C(C(=O)[NH+]=C(C=C3C=CC=CC3)C(=O)O)C(O)=C2C(=O)O1
67 200.1281198561 O=C=[NH+]C(CC1CCCCC1)C(O)O
68 198.1124697921 O=C=[NH+]C(CC1CCCCC1)C(=O)O
69 196.0968197281 O=C=[NH+]C(=CC1CCCCC1)C(=O)O
70 194.0811696641 O=C=[NH+]C(=CC1C=CCCC1)C(=O)O
71 192.0655196001 O=C=[NH+]C(=CC1C=CC=CC1)C(=O)O
72 190.0498695361 O=C=[NH+]C(=CC1=CC=CC=C1)C(=O)O
73 436.0887742081 CC1=CC2=C(C3=NC4=C(O)N=C([NH3+])N=C4N3C3C=C(O)C(=C=O)O3)C=CC(O)=C2C(=O)O1
74 438.1044242721 CC1CC2=C(C3=NC4=C(O)N=C([NH3+])N=C4N3C3C=C(O)C(=C=O)O3)C=CC(O)=C2C(=O)O1
75 440.1200743361 CC1CC2=C(C3=NC4=C(O)N=C([NH3+])N=C4N3C3C=C(O)C(=C=O)O3)C=CC(O)=C2C(O)O1
76 442.1357244001 CC1CC2=C(C3=NC4=C(O)N=C([NH3+])N=C4N3C3C=C(O)C(=C=O)O3)CCC(O)=C2C(O)O1
77 424.1251597161 CC1CC2=C(C3=NC4=C(O)N=C([NH3+])N=C4N3C3C=CC(=C=O)O3)C=CC(O)=C2C(O)O1
78 179.0702706321 CC1CC2=CC=CC([OH2+])=C2C(=O)O1
79 442.1357244001 CC1CC2=C(C3=NC4=C(O)N=C([NH3+])N=C4N3CC=C(O)C(=O)C=O)C=CC(O)=C2C(O)O1 Intermediate Fragment 
80 442.1357244001 CC1CC2=C(C3=NC4=C(O)N=C([NH3+])N=C4N3C(C)OC(=C=O)C=O)C=CC(O)=C2C(O)O1 Intermediate Fragment 
81 442.1357244001 CC1CC2=C(C3=NC4=C(O)N=C([NH3+])N=C4N3C(=O)C=C(O)C#CO)CCC(O)=C2C(O)O1 Intermediate Fragment 
82 442.1357244001 CC(O)CC1=C(C2=NC3=C(O)N=C([NH3+])N=C3N2C2C=C(O)C(=C=O)O2)C=CC(O)=C1CO Intermediate Fragment 
83 444.1513744641 CC1CC2=C(C3=NC4=C(O)N=C([NH3+])N=C4N3C3C=C(O)C(=C=O)O3)CCC(O)C2C(O)O1
84 444.1513744641 CC1CC2=C(C3=NC4=C(O)N=C([NH3+])N=C4N3C(=O)C=C(O)C#CO)CCC(O)C2C(O)O1 Intermediate Fragment 
85 444.1513744641 CCCC1=C(C2=NC3=C(O)N=C([NH3+])N=C3N2C2C=C(O)C(=C=O)O2)CCC(O)=C1C(O)O Intermediate Fragment 
86 172.1332052361 [NH2+]=C(CC1CCCCC1)C(O)O
87 170.1175551721 [NH2+]=C(CC1CCCCC1)C(=O)O
88 168.1019051081 [NH2+]=C(C=C1CCCCC1)C(=O)O
89 120.0807757401 [NH+]#CC=C1C=CCCC1
90 118.0651256761 [NH+]#CC=C1C=CC=CC1
91 122.0964258041 [NH+]#CC=C1CCCCC1
92 148.0756903601 [NH2+]=C(C=O)C=C1C=CC=CC1
93 95.0855267721 [CH3+]=C1C=CCCC1
94 93.0698767081 [CH3+]=C1C=CC=CC1
95 91.0542266441 [CH+]=C1C=CC=CC1
96 74.0236547881 [NH+]#CC(O)O
97 79.0542266441 C1=CC=[CH2+]C=C1
98 164.0706049801 [NH2+]=C(C=C1C=CC=CC1)C(=O)O
99 464.0836888281 CC1=CC2=C(C3=NC4=C(O)N=C([NH3+])N=C4N3C3C=C(O)C(=C=O)O3)C=C(C=O)C(O)=C2C(=O)O1
100 436.0887742081 CC1=CC2=C(C3=NC4=C(O)N=C([NH3+])N=C4N3C3=CC(O)=CO3)C=C(C=O)C(O)=C2C(=O)O1
101 205.0495351881 C=C1CC2C=CC(=C=[OH+])C(O)=C2C(=O)O1
102 203.0338851241 C=C1C=C2C=CC(=C=[OH+])C(O)=C2C(=O)O1
103 466.0993388921 CC1CC2=C(C3=NC4=C(O)N=C([NH3+])N=C4N3C3C=C(O)C(=C=O)O3)C=C(C=O)C(O)=C2C(=O)O1
104 468.1149889561 CC1CC2=C(C3=NC4=C(O)N=C([NH3+])N=C4N3C3C=C(O)C(=C=O)O3)C=C(C=O)C(O)=C2C(O)O1
105 440.1200743361 CC1CC2=C(C3=NC4=C(O)N=C([NH3+])N=C4N3C3CC(O)=CO3)C=C(C=O)C(O)=C2C(=O)O1
106 450.1044242721 CC1=CC2=C(C3=NC4=C(O)N=C([NH3+])N=C4N3C3C=C(O)C(=C=O)O3)C=C(C)C(O)=C2C(=O)O1
107 452.0836888281 [NH3+]C1=NC(O)=C2N=C(C3=C4CCOC(=O)C4=C(O)C(C=O)=C3)N(C3C=C(O)C(=C=O)O3)C2=N1
108 468.1149889561 CC1CC2=C(C3=NC4=C(O)N=C([NH3+])N=C4N3CC=C(O)C(=O)C=O)C=C(C=O)C(O)=C2C(=O)O1 Intermediate Fragment 
109 468.1149889561 CC1CC2=C(C3=NC4=C(O)N=C([NH3+])N=C4N3C(=O)C=C(O)C#CO)C=C(C=O)C(O)=C2C(O)O1 Intermediate Fragment 
110 468.1149889561 CC1CC(=C(CC(=C=O)C=O)C2=NC3=C(O)N=C([NH3+])N=C3N2C2C=C(O)C(=C=O)O2)C=C(O)O1 Intermediate Fragment 
111 440.1200743361 CC1CC(=C(C#CC=O)C2=NC3=C(O)N=C([NH3+])N=C3N2C2C=C(O)C(=C=O)O2)CC(O)O1
112 468.1149889561 CC(CC1=C(C2=NC3=C(O)N=C([NH3+])N=C3N2C2C=C(O)C(=C=O)O2)C=C(C=O)C(O)=C1)OC=O Intermediate Fragment 
113 470.1306390201 CC1CC2=C(C3=NC4=C(O)N=C([NH3+])N=C4N3C3C=C(O)C(=C=O)O3)C=C(CO)C(O)=C2C(O)O1
114 452.1200743361 CC1CC2=C(C3=NC4=CN=C([NH3+])N=C4N3C3C=C(O)C(=C=O)O3)C=C(C=O)C(O)=C2C(O)O1
115 360.1302450961 CC1CC2=C(C3=NC4=C(O)N=C([NH3+])N=C4N3)C=C(CO)C(O)=C2C(O)O1
116 442.1357244001 CC1CC2=C(C3=NC4=C(O)N=C([NH3+])N=C4N3C3CC(O)=CO3)C=C(C=O)C(O)=C2C(O)O1
117 452.1200743361 CC1CC2=C(C3=NC4=C(O)N=C([NH3+])N=C4N3C3C=CC(=C=O)O3)C=C(C=O)C(O)=C2C(O)O1
118 207.0651852521 C=C1CC2CCC(=C=[OH+])C(O)=C2C(=O)O1
119 452.1200743361 CC1=CC(C2=NC3=C(O)N=C([NH3+])N=C3N2C2C=C(O)C(=C=O)O2)=C2CC(C)OC(=O)C2=C1O
120 452.1200743361 CC1CC2=C(C3=NC4=C(O)N=C([NH3+])N=C4N3C3C=C(O)C(=C=O)O3)C=C(C=O)C=C2C(O)O1
121 453.1040899241 CC1CC2=C(C3=NC4=C([OH2+])N=CN=C4N3C3C=C(O)C(=C=O)O3)C=C(C=O)C(O)=C2C(O)O1
122 470.1306390201 CC1CC2=C(C3=NC(=C=O)C(=NC(=N)[NH3+])N3C3C=C(O)C(=C=O)O3)C=C(CO)C(O)=C2C(O)O1 Intermediate Fragment 
123 470.1306390201 CC1CC2=C(C(O)=C(C=O)CC2=C2N=CC(=NC([NH3+])=NC=O)N2C2C=C(O)C(=C=O)O2)C(O)O1 Intermediate Fragment 
124 470.1306390201 CC1CC2=C(C3=NC(=C(O)N=C[NH3+])C(=N)N3C3C=C(O)C(=C=O)O3)C=C(C=O)C(O)=C2C(O)O1 Intermediate Fragment 
125 470.1306390201 CC1CC2=C(C3=NC4=C(O)N=C([NH3+])N=C4N3CC=C(O)C(=O)C=O)C=C(C=O)C(O)=C2C(O)O1 Intermediate Fragment 
126 452.1200743361 CC1CC2=C(C3=NC4=C(O)N=C([NH3+])N=C4N3CC=C(O)C#CO)C=C(C=O)C(O)=C2C(=O)O1
127 412.1251597161 CC1CC2=C(C3=NC4=C(O)N=C([NH3+])N=C4N3CC#CO)C=C(C=O)C(O)=C2C(O)O1
128 410.1095096521 CC1CC2=C(C3=NC4=C(O)N=C([NH3+])N=C4N3CC#CO)C=C(C=O)C(O)=C2C(=O)O1
129 386.1458951601 CCN1C(C2=C3CC(C)OC(O)C3=C(O)C(C=O)=C2)=NC2=C(O)N=C([NH3+])N=C21
130 384.1302450961 CCN1C(C2=C3CC(C)OC(=O)C3=C(O)C(C=O)=C2)=NC2=C(O)N=C([NH3+])N=C21
131 382.1145950321 CCN1C(C2=C3C=C(C)OC(=O)C3=C(O)C(C=O)=C2)=NC2=C(O)N=C([NH3+])N=C21
132 470.1306390201 CC1CC2=C(C3=NC4=C(O)N=C([NH3+])N=C4N3C(C)OC(=C=O)C=O)C=C(C=O)C(O)=C2C(O)O1 Intermediate Fragment 
133 470.1306390201 CC1CC2=C(C3=NC4=C(O)N=C([NH3+])N=C4N3C(C=C=O)OC#CO)C=C(CO)C(O)=C2C(O)O1 Intermediate Fragment 
134 428.1200743361 CC1CC2=C(C3=NC4=C(O)N=C([NH3+])N=C4N3C(=O)C#CO)C=C(CO)C(O)=C2C(O)O1
135 470.1306390201 CC1CC2=C(C3=NC4=C(O)N=C([NH3+])N=C4N3C(=O)C=C(O)C#CO)C=C(CO)C(O)=C2C(O)O1 Intermediate Fragment 
136 426.1044242721 CC1CC2=C(C3=NC4=C(O)N=C([NH3+])N=C4N3C(=O)C#CO)C=C(C=O)C(O)=C2C(O)O1
137 470.1306390201 CC1CC(=C(CC(=C=O)C=O)C2=NC3=C(O)N=C([NH3+])N=C3N2C2C=C(O)C(=C=O)O2)CC(O)O1 Intermediate Fragment 
138 442.1357244001 CC1CC(=C(C#CCO)C2=NC3=C(O)N=C([NH3+])N=C3N2C2C=C(O)C(=C=O)O2)CC(O)O1
139 470.1306390201 CC(O)CC1=C(C2=NC3=C(O)N=C([NH3+])N=C3N2C2C=C(O)C(=C=O)O2)C=C(C=O)C(O)=C1CO Intermediate Fragment 
140 470.1306390201 CCCC1=C(C2=NC3=C(O)N=C([NH3+])N=C3N2C2C=C(O)C(=C=O)O2)C=C(C=O)C(O)=C1C(O)O Intermediate Fragment 
141 470.1306390201 CCOC(O)C1=C(O)C(C=O)=CC(C2=NC3=C(O)N=C([NH3+])N=C3N2C2C=C(O)C(=C=O)O2)=C1C Intermediate Fragment 
142 470.1306390201 CC(CC1=C(C2=NC3=C(O)N=C([NH3+])N=C3N2C2C=C(O)C(=C=O)O2)C=C(C=O)C(O)=C1)OCO Intermediate Fragment 
143 472.1462890841 CC1CC2=C(C3=NC4=C(O)N=C([NH3+])N=C4N3C3C=C(O)C(=C=O)O3)CC(CO)C(O)=C2C(O)O1
144 454.1357244001 CC1CC2=C(C3=NC4=C(O)N=C([NH3+])N=C4N3C3C=CC(=C=O)O3)C=C(CO)C(O)=C2C(O)O1
145 472.1462890841 CC1CC2=C(C3=NC4=C(O)N=C([NH3+])N=C4N3C(=O)C=C(O)C#CO)CC(CO)C(O)=C2C(O)O1 Intermediate Fragment 
146 454.1357244001 CC1CC2=C(C3=NC4=C(O)N=C([NH3+])N=C4N3CC=C(O)C#CO)C=C(C=O)C(O)=C2C(O)O1
147 430.1357244001 CC1CC2=C(C3=NC4=C(O)N=C([NH3+])N=C4N3C(=O)C#CO)CC(CO)C(O)=C2C(O)O1
148 384.0938595881 CC1CC2=C(C3=NC4=C(O)N=C([NH3+])N=C4N3C=O)C=C(C=O)C(O)=C2C(=O)O1
149 472.1462890841 CCCC1=C(C2=NC3=C(O)N=C([NH3+])N=C3N2C2C=C(O)C(=C=O)O2)C=C(CO)C(O)=C1C(O)O Intermediate Fragment 
150 157.1223062041 OC(=[OH+])CCC1CCCCC1
151 155.1066561401 OC(=[OH+])C=CC1CCCCC1
152 107.0855267721 [CH2+]#CC1=CCCCC1
153 109.1011768361 [CH2+]#CC1CCCCC1
154 137.0960914561 [OH2+]C#CC=C1CCCCC1
155 83.0855267721 C1=[CH2+]CCCC1
156 81.0698767081 C1=CCC[CH2+]=C1
157 73.0284058201 C=C=C(O)[OH2+]
158 75.0440558841 CC=C(O)[OH2+]
159 77.0597059481 CCC(O)[OH2+]
160 105.0698767081 [CH2+]#CC1=CC=CCC1
161 135.0804413921 [OH2+]C#CC=C1C=CCCC1
162 103.0542266441 [CH2+]#CC1=CC=CC=C1
163 133.0647913281 [OH2+]C#CC=C1C=CC=CC1
164 151.0753560121 C=C=CC(=C=C=C(O)[OH2+])CC Intermediate Fragment 
165 151.0753560121 C=C=CCC(C)=C=C=C(O)[OH2+] Intermediate Fragment 
166 101.0385765801 [C+]#CC1=CC=CC=C1
167 131.0491412641 OC#C[C+]=C1C=CC=CC1
168 71.0127557561 C#CC(O)=[OH+]
169 149.0597059481 C=C=C=CC(C)=C=C=C(O)[OH2+] Intermediate Fragment 
170 129.0334912001 O=C=C=[C+]C1=CC=CC=C1
171 485.1415380521 CC1CC2=C(C3=NC4=C(O)N=C(N)N=C4N3C3C=C(O)C(=C=O)O3)C=C(C([NH3+])O)C(O)=C2C(O)O1
172 487.1571881161 CC1CC2=C(C3=NC4=C(O)N=C(N)N=C4N3C3C=C(O)C(=C=O)O3)CC(C([NH3+])O)C(O)=C2C(O)O1
173 469.1466234321 CC1CC2=C(C3=NC4=C(O)N=C(N)N=C4N3C3C=CC(=C=O)O3)C=C(C([NH3+])O)C(O)=C2C(O)O1
174 487.1571881161 CC1CC2=C(C3=NC4=C(O)N=C(N)N=C4N3C(=O)C=C(O)C#CO)CC(C([NH3+])O)C(O)=C2C(O)O1 Intermediate Fragment 
175 469.1466234321 CC1CC2=C(C3=NC4=C(O)N=C(N)N=C4N3CC=C(O)C#CO)C=C(C([NH3+])=O)C(O)=C2C(O)O1
176 485.1415380521 CC1CC2=C(C3=NC4=C(O)N=C(N)N=C4N3C(=O)C=C(O)C#CO)C=C(C([NH3+])O)C(O)=C2C(O)O1
177 489.1728381801 CC1CC2=C(C3=NC4=C(O)N=C(N)N=C4N3C3C=C(O)C(=C=O)O3)CC(C([NH3+])O)C(O)C2C(O)O1
178 49.0284058201 OC[OH2+]
179 587.1884882441 CC1CC2=C(C3=NC4=C(O)N=C(N)N=C4N3C3C=C(O)C(=C=O)O3)C=C(C(=O)[NH+]=C=C=C3CCCCC3)C(O)=C2C(O)O1
180 589.2041383081 CC1CC2=C(C3=NC4=C(O)N=C(N)N=C4N3C3C=C(O)C(=C=O)O3)C=C(C(=O)[NH+]=C=CC3CCCCC3)C(O)=C2C(O)O1
181 571.1935736241 CC1CC2=C(C3=NC4=C(O)N=C(N)N=C4N3C3C=CC(=C=O)O3)C=C(C(=O)[NH+]=C=C=C3CCCCC3)C(O)=C2C(O)O1
182 111.1168269001 [CH3+]=CC1CCCCC1
183 497.1415380521 C[NH2+]C(=O)C1=CC(C2=NC3=C(O)N=C(N)N=C3N2C2C=C(O)C(=C=O)O2)=C2CC(C)OC(O)C2=C1O
184 589.2041383081 CC1CC2=C(C3=NC4=C(O)N=C(N)N=C4N3CC=C(O)C(=O)C=O)C=C(C(=O)[NH+]=C=C=C3CCCCC3)C(O)=C2C(O)O1 Intermediate Fragment 
185 589.2041383081 CC1CC2=C(C3=NC4=C(O)N=C(N)N=C4N3C(=O)C=C(O)C#CO)C=C(C(=O)[NH+]=C=CC3CCCCC3)C(O)=C2C(O)O1 Intermediate Fragment 
186 591.2197883721 CC1CC2=C(C3=NC4=C(O)N=C(N)N=C4N3C3C=C(O)C(=C=O)O3)C=C(C(=O)[NH+]=CCC3CCCCC3)C(O)=C2C(O)O1
187 573.2092236881 CC1CC2=C(C3=NC4=C(O)N=C(N)N=C4N3C3C=CC(=C=O)O3)C=C(C(=O)[NH+]=C=CC3CCCCC3)C(O)=C2C(O)O1
188 591.2197883721 CC1CC2=C(C3=NC4=C(O)N=C(N)N=C4N3C(=O)C=C(O)C#CO)C=C(C(=O)[NH+]=CCC3CCCCC3)C(O)=C2C(O)O1 Intermediate Fragment 
189 573.2092236881 CC1CC2=C(C3=NC4=C(O)N=C(N)N=C4N3CC=C(O)C#CO)C=C(C(=O)[NH+]=C=C=C3CCCCC3)C(O)=C2C(O)O1
190 617.1990529281 CC1CC2=C(C3=NC4=C(O)N=C(N)N=C4N3C3C=C(O)C(=C=O)O3)C=C(C(=O)[NH+]=C(C=O)C=C3CCCCC3)C(O)=C2C(O)O1
191 99.1168269001 [CH4+]C1CCCCC1
192 97.1011768361 [CH3+]=C1CCCCC1
193 541.1313672921 CC1CC2=C(C3=NC4=C(O)N=C(N)N=C4N3C3C=C(O)C(=C=O)O3)C=C(C(=O)[NH+]=CC(O)O)C(O)=C2C(O)O1
194 543.1470173561 CC1CC2=C(C3=NC4=C(O)N=C(N)N=C4N3C3C=C(O)C(=C=O)O3)C=C(C(=O)[NH2+]CC(O)O)C(O)=C2C(O)O1
195 85.1011768361 C1CC[CH3+]CC1
196 79.0542266441 CC=C=C=C=[CH3+] Intermediate Fragment 
197 77.0385765801 C=CC#CC#[CH2+]
198 551.1157172281 CC(=[NH+]C(=O)C1=CC(C2=NC3=C(O)N=C(N)N=C3N2C2C=C(O)C(=C=O)O2)=C2CC(C)OC(=O)C2=C1O)C(=O)O
199 553.1313672921 CC(=[NH+]C(=O)C1=CC(C2=NC3=C(O)N=C(N)N=C3N2C2C=C(O)C(=C=O)O2)=C2CC(C)OC(O)C2=C1O)C(=O)O
200 555.1470173561 CC(=[NH+]C(=O)C1=CC(C2=NC3=C(O)N=C(N)N=C3N2C2C=C(O)C(=C=O)O2)=C2CC(C)OC(O)C2=C1O)C(O)O
201 511.1571881161 CC[NH2+]C(=O)C1=CC(C2=NC3=C(O)N=C(N)N=C3N2C2C=C(O)C(=C=O)O2)=C2CC(C)OC(O)C2=C1O
202 557.1626674201 CC1CC2=C(C3=NC4=C(O)N=C(N)N=C4N3C3C=C(O)C(=C=O)O3)C=C(C(=O)[NH2+]C(C)C(O)O)C(O)=C2C(O)O1
203 617.1990529281 CC1CC2=C(C3=NC4=C(O)N=C(N)N=C4N3C3C=C(O)C(=C=O)O3)C=C(C(=O)[NH+]=C(C=C3CCCCC3)C(=O)O)C(O)=C2CO1
204 618.1830685161 CC1CC2=C(C3=NC4=C(O)N=CN=C4N3C3C=C(O)C(=C=O)O3)C=C(C(=O)[NH+]=C(C=C3CCCCC3)C(=O)O)C(O)=C2C(O)O1
205 635.2096176121 CC1CC2=C(C3=NC(=C=O)C(=NC(=N)N)N3C3C=C(O)C(=C=O)O3)C=C(C(=O)[NH+]=C(CC3CCCCC3)C(=O)O)C(O)=C2C(O)O1 Intermediate Fragment 
206 635.2096176121 CC1CC2=C(C(O)=C(C(=O)[NH+]=C(C=C3CCCCC3)C(=O)O)CC2=C2N=CC(=NC(N)=NC=O)N2C2C=C(O)C(=C=O)O2)C(O)O1 Intermediate Fragment 
207 592.2038039601 CC1CC2=C(C3=NC=C([NH+]=CN)N3C3C=C(O)C(=C=O)O3)C=C(C(=O)N=C(C=C3CCCCC3)C(=O)O)C(O)=C2C(O)O1
208 565.1929049281 CC1CC2=C(C(O)=C(C(=O)N=C(C=C3CCCCC3)C(=O)O)CC2=C2N=CC(=[NH2+])N2C2C=C(O)C(=C=O)O2)C(O)O1
209 635.2096176121 CC1CC2=C(C3=NC(C(=O)N=C(N)N)=CN3C3C=C(O)C(=C=O)O3)C=C(C(=O)[NH+]=C(C=C3CCCCC3)C(=O)O)C(O)=C2C(O)O1 Intermediate Fragment 
210 635.2096176121 CC1CC2=C(C3=NC(=C(O)N=CN)C(=N)N3C3C=C(O)C(=C=O)O3)C=C(C(=O)[NH+]=C(C=C3CCCCC3)C(=O)O)C(O)=C2C(O)O1 Intermediate Fragment 
211 635.2096176121 CC1CC2=C(C(N=C3C=C(O)C(=C=O)O3)=NC3=C(O)N=C(N)N=C3)C=C(C(=O)[NH+]=C(CC3CCCCC3)C(=O)O)C(O)=C2C(O)O1 Intermediate Fragment 
212 635.2096176121 CC1CC2=C(C(O)=C(C(=O)[NH+]=C(C=C3C=CCCC3)C(=O)O)CC2=CN(C2=NC(N)=NC(O)=C2N)C2C=C(O)C(=C=O)O2)C(O)O1 Intermediate Fragment 
213 635.2096176121 CC1CC2=C(C3=NC4=C(O)N=C(N)N=C4N3CC=C(O)C(=O)C=O)C=C(C(=O)[NH+]=C(C=C3CCCCC3)C(=O)O)C(O)=C2C(O)O1 Intermediate Fragment 
214 617.1990529281 CC1CC2=C(C3=NC4=C(O)N=C(N)N=C4N3CC=C(O)C#CO)C=C(C(=O)[NH+]=C(C=C3C=CCCC3)C(=O)O)C(O)=C2C(O)O1
215 577.2041383081 CC1CC2=C(C3=NC4=C(O)N=C(N)N=C4N3CC#CO)C=C(C(=O)[NH+]=C(C=C3CCCCC3)C(=O)O)C(O)=C2C(O)O1
216 575.1884882441 CC1CC2=C(C3=NC4=C(O)N=C(N)N=C4N3CC#CO)C=C(C(=O)[NH+]=C(C=C3C=CCCC3)C(=O)O)C(O)=C2C(O)O1
217 573.1728381801 CC1CC2=C(C3=NC4=C(O)N=C(N)N=C4N3CC#CO)C=C(C(=O)[NH+]=C(C=C3C=CC=CC3)C(=O)O)C(O)=C2C(O)O1
218 551.2248737521 CCN1C(C2=C3CC(C)OC(O)C3=C(O)C(C(=O)[NH+]=C(C=C3CCCCC3)C(=O)O)=C2)=NC2=C(O)N=C(N)N=C21
219 549.2092236881 CCN1C(C2=C3CC(C)OC(O)C3=C(O)C(C(=O)[NH+]=C(C=C3C=CCCC3)C(=O)O)=C2)=NC2=C(O)N=C(N)N=C21
220 547.1935736241 CCN1C(C2=C3CC(C)OC(O)C3=C(O)C(C(=O)[NH+]=C(C=C3C=CC=CC3)C(=O)O)=C2)=NC2=C(O)N=C(N)N=C21
221 545.1779235601 CCN1C(C2=C3CC(C)OC(=O)C3=C(O)C(C(=O)[NH+]=C(C=C3C=CC=CC3)C(=O)O)=C2)=NC2=C(O)N=C(N)N=C21
222 543.1622734961 CCN1C(C2=C3C=C(C)OC(=O)C3=C(O)C(C(=O)[NH+]=C(C=C3C=CC=CC3)C(=O)O)=C2)=NC2=C(O)N=C(N)N=C21
223 533.1779235601 CC1CC2=C(C3=NC4=C(O)N=C(N)N=C4N3C)C=C(C(=O)[NH+]=C(C=C3C=CC=CC3)C(=O)O)C(O)=C2C(O)O1
224 529.1466234321 CC1=CC2=C(C3=NC4=C(O)N=C(N)N=C4N3C)C=C(C(=O)[NH+]=C(C=C3C=CC=CC3)C(=O)O)C(O)=C2C(=O)O1
225 635.2096176121 CC1CC2=C(C3=NC4=C(O)N=C(N)N=C4N3C(C)OC(=C=O)C=O)C=C(C(=O)[NH+]=C(C=C3CCCCC3)C(=O)O)C(O)=C2C(O)O1 Intermediate Fragment 
226 561.1728381801 CC(=O)N1C(C2=C3CC(C)OC(O)C3=C(O)C(C(=O)[NH+]=C(C=C3C=CC=CC3)C(=O)O)=C2)=NC2=C(O)N=C(N)N=C21
227 563.1884882441 CC(=O)N1C(C2=C3CC(C)OC(O)C3=C(O)C(C(=O)[NH+]=C(C=C3C=CCCC3)C(=O)O)=C2)=NC2=C(O)N=C(N)N=C21
228 635.2096176121 CC1CC2=C(C3=NC4=C(O)N=C(N)N=C4N3C(C=C=O)OC#CO)C=C(C(=O)[NH+]=C(CC3CCCCC3)C(=O)O)C(O)=C2C(O)O1 Intermediate Fragment 
229 591.1834028641 CC1CC2=C(C3=NC4=C(O)N=C(N)N=C4N3C(=O)C#CO)C=C(C(=O)[NH+]=C(C=C3CCCCC3)C(=O)O)C(O)=C2C(O)O1
230 593.1990529281 CC1CC2=C(C3=NC4=C(O)N=C(N)N=C4N3C(=O)C#CO)C=C(C(=O)[NH+]=C(CC3CCCCC3)C(=O)O)C(O)=C2C(O)O1
231 635.2096176121 CC1CC2=C(C3=NC4=C(O)N=C(N)N=C4N3C(=O)C=C(O)C#CO)C=C(C(=O)[NH+]=C(CC3CCCCC3)C(=O)O)C(O)=C2C(O)O1 Intermediate Fragment 
232 589.1677528001 CC1CC2=C(C3=NC4=C(O)N=C(N)N=C4N3C(=O)C#CO)C=C(C(=O)[NH+]=C(C=C3C=CCCC3)C(=O)O)C(O)=C2C(O)O1
233 47.0491412641 CC[OH2+]
234 567.2197883721 CC(=O)N1C(C2=C3CC(C)OC(O)C3=C(O)C(C(=O)[NH+]=C(CC3CCCCC3)C(=O)O)=C2)=NC2=C(O)N=C(N)N=C21
235 565.2041383081 CC(=O)N1C(C2=C3CC(C)OC(O)C3=C(O)C(C(=O)[NH+]=C(C=C3CCCCC3)C(=O)O)=C2)=NC2=C(O)N=C(N)N=C21
236 559.1571881161 CC(=O)N1C(C2=C3CC(C)OC(=O)C3=C(O)C(C(=O)[NH+]=C(C=C3C=CC=CC3)C(=O)O)=C2)=NC2=C(O)N=C(N)N=C21
237 73.0284058201 OCC#C[OH2+]
238 77.0597059481 OCCC[OH2+]
239 551.1884882441 CC1CC2=C(C3=NC4=C(O)N=C(N)N=C4N3C=O)C=C(C(=O)[NH+]=C(C=C3CCCCC3)C(=O)O)C(O)=C2C(O)O1
240 549.1728381801 CC1CC2=C(C3=NC4=C(O)N=C(N)N=C4N3C=O)C=C(C(=O)[NH+]=C(C=C3C=CCCC3)C(=O)O)C(O)=C2C(O)O1
241 531.1622734961 CC1CC2=C(C3=NC4=C(O)N=C(N)N=C4N3C)C=C(C(=O)[NH+]=C(C=C3C=CC=CC3)C(=O)O)C(O)=C2C(=O)O1
242 382.0782095241 C=C1CC2C(C3=NC4=C(O)N=C([NH3+])N=C4N3C=O)=CC(=C=O)C(O)=C2C(=O)O1
243 547.1571881161 CC1CC2=C(C3=NC4=C(O)N=C(N)N=C4N3C=O)C=C(C(=O)[NH+]=C(C=C3C=CC=CC3)C(=O)O)C(O)=C2C(O)O1
244 545.1415380521 CC1CC2=C(C3=NC4=C(O)N=C(N)N=C4N3C=O)C=C(C(=O)[NH+]=C(C=C3C=CC=CC3)C(=O)O)C(O)=C2C(=O)O1
245 87.0440558841 CC(O)C#C[OH2+]
246 89.0597059481 CC(O)C=C[OH2+]
247 71.0491412641 C#CC(C)[OH2+]
248 71.0491412641 CCC#C[OH2+]
249 633.1939675481 CC1CC2=C(C3=NC4=C(O)N=C(N)N=C4N3C(=O)C=C(O)C#CO)C=C(C(=O)[NH+]=C(C=C3CCCCC3)C(=O)O)C(O)=C2C(O)O1
250 635.2096176121 CC1CC(=C(C=C=C(O)[NH+]=C(C=C2CCCCC2)C(=O)O)C2=NC3=C(O)N=C(N)N=C3N2C2C=C(O)C(=C=O)O2)C(=CO)C(O)O1 Intermediate Fragment 
251 635.2096176121 CC1CC=C(C(O)=C(CCC2=NC3=C(O)N=C(N)N=C3N2C2C=C(O)C(=C=O)O2)C(=O)[NH+]=C(C=C2C=CCCC2)C(=O)O)C(O)O1 Intermediate Fragment 
252 635.2096176121 CC1CC(=C(CC(=CO)C(=O)[NH+]=C(C=C2C=CCCC2)C(=O)O)C2=NC3=C(O)N=C(N)N=C3N2C2C=C(O)C(=C=O)O2)CC(O)O1 Intermediate Fragment 
253 521.1415380521 NC1=NC(O)=C2N=C(CCC(=CO)C(=O)[NH+]=C(C=C3C=CC=CC3)C(=O)O)N(C3C=C(O)C(=C=O)O3)C2=N1
254 525.1728381801 NC1=NC(O)=C2N=C(CCC(=CO)C(=O)[NH+]=C(C=C3CCCCC3)C(=O)O)N(C3C=C(O)C(=C=O)O3)C2=N1
255 607.2147029921 CC1CC(=C(C#CC(=O)[NH+]=C(CC2CCCCC2)C(=O)O)C2=NC3=C(O)N=C(N)N=C3N2C2C=C(O)C(=C=O)O2)CC(O)O1
256 607.2147029921 CC1CC(=C(C#CC(=O)[NH+]=C(CC2CCCCC2)C(=O)O)C2=NC3=C(O)N=C(N)N=C3N2C(=O)C=C(O)C#CO)CC(O)O1 Intermediate Fragment 
257 605.1990529281 CC1CC(=C(C#CC(=O)[NH+]=C(C=C2CCCCC2)C(=O)O)C2=NC3=C(O)N=C(N)N=C3N2C2C=C(O)C(=C=O)O2)CC(O)O1
258 603.1834028641 CC1CC(=C(C#CC(=O)[NH+]=C(C=C2C=CCCC2)C(=O)O)C2=NC3=C(O)N=C(N)N=C3N2C2C=C(O)C(=C=O)O2)CC(O)O1
259 635.2096176121 CCCCC(C)=CC(=[NH+]C(=O)C1=CC(C2=NC3=C(O)N=C(N)N=C3N2C2C=C(O)C(=C=O)O2)=C2CC(C)OC(O)C2=C1O)C(=O)O Intermediate Fragment 
260 635.2096176121 CCCC(=CC(=[NH+]C(=O)C1=CC(C2=NC3=C(O)N=C(N)N=C3N2C2C=C(O)C(=C=O)O2)=C2CC(C)OC(O)C2=C1O)C(=O)O)CC Intermediate Fragment 
261 605.1626674201 CCCC#CC(=[NH+]C(=O)C1=CC(C2=NC3=C(O)N=C(N)N=C3N2C2C=C(O)C(=C=O)O2)=C2CC(C)OC(O)C2=C1O)C(=O)O
262 609.1939675481 CCCCCC(=[NH+]C(=O)C1=CC(C2=NC3=C(O)N=C(N)N=C3N2C2C=C(O)C(=C=O)O2)=C2CC(C)OC(O)C2=C1O)C(=O)O
263 607.1783174841 CCC(C)=CC(=[NH+]C(=O)C1=CC(C2=NC3=C(O)N=C(N)N=C3N2C2C=C(O)C(=C=O)O2)=C2CC(C)OC(O)C2=C1O)C(=O)O
264 605.1626674201 C=CC(C)=CC(=[NH+]C(=O)C1=CC(C2=NC3=C(O)N=C(N)N=C3N2C2C=C(O)C(=C=O)O2)=C2CC(C)OC(O)C2=C1O)C(=O)O
265 635.2096176121 CCCCCC=CC(=[NH+]C(=O)C1=CC(C2=NC3=C(O)N=C(N)N=C3N2C2C=C(O)C(=C=O)O2)=C2CC(C)OC(O)C2=C1O)C(=O)O Intermediate Fragment 
266 635.2096176121 CC(O)CC1=C(C2=NC3=C(O)N=C(N)N=C3N2C2C=C(O)C(=C=O)O2)C=C(C(=O)[NH+]=C(C=C2CCCCC2)C(=O)O)C(O)=C1CO Intermediate Fragment 
267 607.2147029921 CC(O)CC1=C(C2=NC3=C(O)N=C(N)N=C3N2C2C=C(O)C(=C=O)O2)C=C(C(=O)[NH+]=C(CC2CCCCC2)C(=O)O)C(O)=C1
268 635.2096176121 CCCC1=C(C2=NC3=C(O)N=C(N)N=C3N2C2C=C(O)C(=C=O)O2)C=C(C(=O)[NH+]=C(C=C2CCCCC2)C(=O)O)C(O)=C1C(O)O Intermediate Fragment 
269 587.1884882441 CCCC1=C(C2=NC3=C(O)N=C(N)N=C3N2C2C=C(O)C(=C=O)O2)C=C(C(=O)[NH+]=C(C=C2C=CCCC2)C(=O)O)C(O)=C1
270 589.2041383081 CCCC1=C(C2=NC3=C(O)N=C(N)N=C3N2C2C=C(O)C(=C=O)O2)C=C(C(=O)[NH+]=C(C=C2CCCCC2)C(=O)O)C(O)=C1
271 591.2197883721 CCCC1=C(C2=NC3=C(O)N=C(N)N=C3N2C2C=C(O)C(=C=O)O2)C=C(C(=O)[NH+]=C(CC2CCCCC2)C(=O)O)C(O)=C1
272 607.1783174841 CC1=C(C2=NC3=C(O)N=C(N)N=C3N2C2C=C(O)C(=C=O)O2)C=C(C(=O)[NH+]=C(C=C2CCCCC2)C(=O)O)C(O)=C1C(O)O
273 605.1626674201 CC1=C(C2=NC3=C(O)N=C(N)N=C3N2C2C=C(O)C(=C=O)O2)C=C(C(=O)[NH+]=C(C=C2C=CCCC2)C(=O)O)C(O)=C1C(O)O
274 635.2096176121 CCOC(O)C1=C(O)C(C(=O)[NH+]=C(C=C2CCCCC2)C(=O)O)=CC(C2=NC3=C(O)N=C(N)N=C3N2C2C=C(O)C(=C=O)O2)=C1C Intermediate Fragment 
275 635.2096176121 CC(C)OC(O)C1=C(O)C(C(=O)[NH+]=C(C=C2CCCCC2)C(=O)O)=CC(C2=NC3=C(O)N=C(N)N=C3N2C2C=C(O)C(=C=O)O2)=C1 Intermediate Fragment 
276 635.2096176121 CC(CC1=C(C2=NC3=C(O)N=C(N)N=C3N2C2C=C(O)C(=C=O)O2)C=C(C(=O)[NH+]=C(C=C2CCCCC2)C(=O)O)C(O)=C1)OCO Intermediate Fragment 
