#In-silico ESI-MS/MS [M+H]+ Spectra
#PREDICTED BY CFM-ID 4.0.8
#SMILES=n1cnc2c(c1NC=O)ncn2[C@H]1C[C@H]([C@H](O1)CO)O
#InChiKey=BXUHRBATIZQMGY-BWZBUEFSSA-N
energy0
134.04612 27.30 9 (13.991)
136.06177 16.88 7 (8.6521)
164.05669 100.00 42 68 51 80 71 44 74 61 65 78 (50.655 0.18227 0.11662 0.085139 0.075317 0.046859 0.042804 0.026529 0.016028 0.010055)
280.10403 22.00 0 173 101 117 174 120 150 115 109 94 110 114 108 (11.123 0.045628 0.037587 0.036437 0.011814 0.0077815 0.0076309 0.0033453 0.0017243 0.0016496 0.00044929 0.00025495 0.0001379)
energy1
134.04612 14.03 9 (8.019)
136.06177 36.27 7 (20.724)
164.05669 100.00 42 65 78 71 44 68 74 80 51 61 (54.535 0.44394 0.41406 0.3371 0.33011 0.25346 0.22911 0.21842 0.20615 0.17894)
energy2
45.03349 6.37 38 (1.198)
57.03349 5.83 162 (1.0958)
82.03997 21.23 55 (3.9922)
94.03997 14.76 53 (2.7753)
107.03522 10.13 49 (1.9046)
121.05087 11.94 2 (2.2445)
122.03489 14.11 47 73 (1.7452 0.9078)
134.04612 18.58 9 (3.4933)
136.06177 96.99 7 (18.238)
137.04579 19.08 72 46 76 62 (2.6185 0.49017 0.38209 0.098092)
146.04612 46.17 43 (8.6821)
147.03014 18.74 77 81 63 45 (1.9321 0.66614 0.52035 0.40602)
148.06177 20.10 32 (3.779)
150.07742 6.59 33 (1.239)
162.04104 7.07 41 67 79 70 60 (0.50319 0.36212 0.28109 0.14996 0.033434)
164.05669 100.00 42 78 65 51 61 68 44 80 74 71 (4.8311 4.2658 2.8916 2.534 1.1325 0.97361 0.85194 0.72053 0.34373 0.25987)
178.07234 8.90 118 (1.6727)

0 280.1040303481 O=C[NH2+]c1ncnc2c1ncn2C1CC(O)C(CO)O1
1 233.0669165681 OC1=C(C[OH2+])OC(N2C=NC3=CN=CN=C32)=C1
2 121.0508725801 C1=NC2=NC=[NH+]CC2=N1
3 235.0825666321 OC1C=C(N2C=NC3=CN=CN=C32)OC1C[OH2+]
4 237.0982166961 OC1CC(N2C=NC3=CN=CN=C32)OC1C[OH2+]
5 237.0982166961 OC(C=CN1C=NC2=CN=CN=C21)C(O)C[OH2+] Intermediate Fragment 
6 248.0778156001 [NH3+]C1=C2N=CN(C3=CC(O)=C(CO)O3)C2=NC=N1
7 136.0617716121 [NH2+]=C1N=CN=C2NCN=C12
8 250.0934656641 [NH3+]C1=C2N=CN(C3=CC(O)C(CO)O3)C2=NC=N1
9 134.0461215481 [NH2+]=C1N=CN=C2N=CN=C12
10 252.1091157281 [NH3+]C1=C2N=CN(C3CC(O)C(CO)O3)C2=NC=N1
11 117.0546205681 OC1C=COC1C[OH2+]
12 138.0774216761 [NH2+]=C1N=CN=C2NCNC12
13 140.0930717401 [NH3+]C1N=CN=C2NCNC21
14 142.1087218041 [NH3+]C1N=CNC2NCNC12
15 220.0829009801 [NH3+]C1=C2N=CN(C3=CC(O)CO3)C2=NC=N1
16 234.0985510441 CC1OC(N2C=NC3=C([NH3+])N=CN=C32)=CC1O
17 234.0985510441 [NH3+]C1=C2N=CN(C3=CCC(CO)O3)C2=NC=N1
18 252.1091157281 [NH3+]C1=C2N=CN(C=CC(O)C(O)CO)C2=NC=N1 Intermediate Fragment 
19 91.0389705041 OC=C([OH2+])CO
20 160.0617716121 C#CN1C=NC2=C([NH3+])N=CN=C21
21 162.0774216761 C=CN1C=NC2=C([NH3+])N=CN=C21
22 190.0723362961 [NH3+]C1=C2N=CN(C#CCO)C2=NC=N1
23 192.0879863601 [NH3+]C1=C2N=CN(C=CCO)C2=NC=N1
24 194.1036364241 [NH3+]C1=C2N=CN(CCCO)C2=NC=N1
25 234.0985510441 [NH3+]C1=C2N=CN(C#CC(O)CCO)C2=NC=N1
26 252.1091157281 [NH3+]C1=C2N=CN(C(O)=CC(O)CCO)C2=NC=N1 Intermediate Fragment 
27 75.0440558841 OC=CC[OH2+]
28 73.0284058201 OC#CC[OH2+]
29 252.1091157281 [NH3+]C1=C2N=CN(C(=CCO)OCCO)C2=NC=N1 Intermediate Fragment 
30 208.0829009801 [NH3+]C1=C2N=CN(C(O)=CCO)C2=NC=N1
31 262.0934656641 C=[NH+]C1=C2N=CN(C3=CC(O)C(CO)O3)C2=NC=N1
32 148.0617716121 C[NH+]=C1N=CN=C2N=CN=C21
33 150.0774216761 C[NH+]=C1N=CN=C2NCN=C21
34 262.0934656641 C=[NH+]C1=C2N=CN(C(=C=CO)OCCO)C2=NC=N1 Intermediate Fragment 
35 119.0702706321 OC1CCOC1C[OH2+]
36 99.0440558841 CC1=C([OH2+])C=CO1
37 117.0546205681 C=COC(=CO)C[OH2+] Intermediate Fragment 
38 45.0334912001 C=C[OH2+]
39 117.0546205681 OC=C=C(O)CC[OH2+] Intermediate Fragment 
40 115.0389705041 OC1=C(C[OH2+])OC=C1
41 162.0410361681 O=C=[NH+]C1=C2N=CNC2=NC=N1
42 164.0566862321 O=C=[NH+]C1=C2NCNC2=NC=N1
43 146.0461215481 C#[N+]C1=C2N=CNC2=NC=N1
44 164.0566862321 N=C=NC1=C(C=[NH+]C=O)N=CN1 Intermediate Fragment 
45 147.0301371361 C=NC1=NC=NC1=C=[N+]=C=O
46 137.0457872001 [NH2+]=C1NC=NC1=C=NC=O
47 122.0348881681 O=C[NH+]=C=C1C=NC=N1
48 120.0192381041 O=C=[N+]=C=C1C=NC=N1
49 107.0352225161 [NH+]#CN=C1C=NC=N1
50 109.0508725801 [NH+]#CN=C1C=NCN1
51 164.0566862321 O=C[NH+]=CN=C=NC1=CN=CN1 Intermediate Fragment 
52 96.0556236121 C=[NH+]C1=CN=CN1
53 94.0399735481 C#[N+]C1=CN=CN1
54 71.0239891361 [NH2+]=C=NC=O
55 82.0399735481 [NH2+]=C1C=NC=N1
56 83.0239891361 C#[N+]C=NC=O
57 94.0035880401 N#CN=C=[N+]=C=O
58 96.0192381041 N#C[NH+]=C=NC=O
59 56.0130901041 C=[N+]=C=O
60 162.0410361681 O=C=[N+]=CN=C=NC1=CN=CN1
61 164.0566862321 N=C=NC(=[NH+]C=O)C1=CNC=N1 Intermediate Fragment 
62 137.0457872001 NC(=[N+]=C=O)C1=CNC=N1
63 147.0301371361 C#[N+]C(N=C=O)=C1C=NC=N1
64 69.0447245801 C1=C[NH+]=CN1
65 164.0566862321 C=NC([NH+]=C=O)=C1N=CNC1=N Intermediate Fragment 
66 135.0301371361 N=C1NC=NC1=C=[N+]=C=O
67 162.0410361681 C#[N+]C(N=C=O)=C1N=CNC1=N
68 164.0566862321 C=NC1=C(C(N)=[N+]=C=O)N=CN1 Intermediate Fragment 
69 69.0083390721 N=C=[N+]=C=O
70 162.0410361681 C#[N+]C1=C(C(=N)N=C=O)N=CN1
71 164.0566862321 N=CNC1=NC=NC([NH+]=C=O)=C1 Intermediate Fragment 
72 137.0457872001 NC1=NC=NC([NH+]=C=O)=C1
73 122.0348881681 O=C=[NH+]C1=CC=NC=N1
74 164.0566862321 NC=NC1=C([NH+]=C=O)N=CN=C1 Intermediate Fragment 
75 43.0290745161 [NH+]#CN
76 137.0457872001 N=C1C=NC=NC1=[NH+]C=O
77 147.0301371361 C#[N+]C1=C(N=C=O)N=CN=C1
78 164.0566862321 C=NC1=C([NH+]=C=O)N=CN=C1N Intermediate Fragment 
79 162.0410361681 C#[N+]C1=C(N=C=O)N=CN=C1N
80 164.0566862321 C=NC1=NC=NC([NH+]=C=O)=C1N Intermediate Fragment 
81 147.0301371361 C#[N+]C1=NC=NC(N=C=O)=C1
82 135.0301371361 N=C1C=NC=NC1=[N+]=C=O
83 166.0723362961 OC=[NH+]C1=C2NCNC2=NC=N1
84 168.0879863601 OC[NH2+]C1=C2NCNC2=NC=N1
85 168.0879863601 OC[NH+]=CN=C=NC1=CNCN1 Intermediate Fragment 
86 170.1036364241 OC[NH2+]C1N=CN=C2NCNC21
87 152.0930717401 C[NH2+]C1=C2NCNC2=NC=N1
88 248.0778156001 O=C=[NH+]C1=C2N=CN(C3CC(O)CO3)C2=NC=N1
89 250.0934656641 O=C=[NH+]C1=C2NCN(C3CC(O)CO3)C2=NC=N1
90 252.1091157281 OC=[NH+]C1=C2NCN(C3CC(O)CO3)C2=NC=N1
91 262.0934656641 CC1OC(N2C=NC3=C([NH+]=C=O)N=CN=C32)CC1O
92 262.0934656641 O=C=[NH+]C1=C2N=CN(C3CCC(CO)O3)C2=NC=N1
93 262.0934656641 O=C=[NH+]C1=C2N=CN(C(O)=CCCCO)C2=NC=N1 Intermediate Fragment 
94 280.1040303481 N=C=NC1=C(C=[NH+]C=O)N=CN1C1CC(O)C(CO)O1 Intermediate Fragment 
95 263.0774812521 C=[NH+]C1=C(C=NC=O)N=CN1C1=CC(O)=C(CO)O1
96 149.0457872001 C=[NH+]C1=NC=NC1=C=NC=O
97 253.0931313161 [NH2+]=C1C(=C=NC=O)N=CN1C1CC(O)C(CO)O1
98 221.0669165681 [NH+]#CN=C1C=NCN1C1=CC(O)=C(CO)O1
99 223.0825666321 [NH+]#CN=C1C=NCN1C1=CC(O)C(CO)O1
100 225.0982166961 [NH+]#CN=C1C=NCN1C1CC(O)C(CO)O1
101 280.1040303481 O=C[NH+]=CN=C=NC1=CN=CN1C1CC(O)C(CO)O1 Intermediate Fragment 
102 212.1029677281 C=[NH+]C1=CN=CN1C1CC(O)C(CO)O1
103 210.0873176641 C=[NH+]C1=CN=CN1C1=CC(O)C(CO)O1
104 208.0716676001 C=[NH+]C1=CN=CN1C1=CC(O)=C(CO)O1
105 206.0560175361 C=[NH+]C1=CN=CN1C1=CC(O)=C(C=O)O1
106 204.0403674721 C#[N+]C1=CN=CN1C1=CC(O)=C(C=O)O1
107 198.0873176641 [NH2+]=C1C=NCN1C1=CC(O)C(CO)O1
108 280.1040303481 N=C=NC(=[NH+]C=O)C1=CN(C2CC(O)C(CO)O2)C=N1 Intermediate Fragment 
109 280.1040303481 C=NC([NH+]=C=O)=C1N=CN(C2CC(O)C(CO)O2)C1=N Intermediate Fragment 
110 280.1040303481 N=CN(C1=NC=NC([NH+]=C=O)=C1)C1CC(O)C(CO)O1 Intermediate Fragment 
111 263.0774812521 CN(C1=CC(O)=C(CO)O1)C1=NC=NC([NH+]=C=O)=C1
112 124.0505382321 OC=[NH+]C1=CC=NC=N1
113 159.0764186321 [NH+]#CNC1CC(O)C(CO)O1
114 280.1040303481 O=C=[NH+]C1=C(N=CNC2CC(O)C(CO)O2)C=NC=N1 Intermediate Fragment 
115 280.1040303481 C=NC1=C([NH+]=C=O)N=CN=C1NC1CC(O)C(CO)O1 Intermediate Fragment 
116 151.0614372641 CNC1=C([NH+]=C=O)N=CN=C1
117 280.1040303481 CC(O)C(CO)OCN1C=NC2=C([NH+]=C=O)N=CN=C21 Intermediate Fragment 
118 178.0723362961 CN1CNC2=C([NH+]=C=O)N=CN=C21
119 176.0566862321 CN1C=NC2=C([NH+]=C=O)N=CN=C21
120 280.1040303481 O=C=[NH+]C1=C2N=CN(CCC(O)C(O)CO)C2=NC=N1 Intermediate Fragment 
121 105.0546205681 C=C(O)C([OH2+])CO
122 87.0440558841 C=C(O)C=C[OH2+]
123 174.0410361681 [CH2+]N1C=NC2=C(N=C=O)N=CN=C21
124 180.0879863601 CN1CNC2=C([NH+]=CO)N=CN=C21
125 182.1036364241 CN1CNC2=C([NH2+]CO)N=CN=C21
126 93.0546205681 OCC([OH2+])CO
127 61.0284058201 OCC=[OH+]
128 73.0284058201 CC([OH2+])=C=O
129 89.0233204401 O=CC([OH2+])=CO
130 87.0076703761 O=C=C([OH2+])C=O
131 188.0566862321 C=CN1C=NC2=C([NH+]=C=O)N=CN=C21
132 188.0566862321 C#CN1C=NC(C=[NH+]C=O)=C1N=C=N Intermediate Fragment 
133 188.0566862321 C#CN(C=N)C1=NC=NC([NH+]=C=O)=C1 Intermediate Fragment 
134 190.0723362961 CCN1C=NC2=C([NH+]=C=O)N=CN=C21
135 192.0879863601 CCN1CNC2=C([NH+]=C=O)N=CN=C21
136 194.1036364241 CCN1CNC2=C([NH+]=CO)N=CN=C21
137 196.1192864881 CCN1CNC2=C([NH2+]CO)N=CN=C21
138 63.0440558841 OCC[OH2+]
139 218.0672509161 O=C=[NH+]C1=C2N=CN(C=CCO)C2=NC=N1
140 220.0829009801 O=C=[NH+]C1=C2N=CN(CCCO)C2=NC=N1
141 222.0985510441 O=C=[NH+]C1=C2NCN(CCCO)C2=NC=N1
142 204.0879863601 CCCN1C=NC2=C([NH+]=C=O)N=CN=C21
143 224.1142011081 OC=[NH+]C1=C2NCN(CCCO)C2=NC=N1
144 262.0934656641 O=C=[NH+]C1=C2N=CN(C=CC(O)CCO)C2=NC=N1
145 101.0597059481 C#CC(O)CC[OH2+]
146 216.0516008521 O=C=[NH+]C1=C2N=CN(C#CCO)C2=NC=N1
147 244.0829009801 CCC(O)C#CN1C=NC2=C([NH+]=C=O)N=CN=C21
148 244.0829009801 O=C=[NH+]C1=C2N=CN(C#CCCCO)C2=NC=N1
149 262.0934656641 N=C=NC1=C(C=[NH+]C=O)N=CN1C#CC(O)CCO Intermediate Fragment 
150 280.1040303481 O=C=[NH+]C1=C2N=CN(C(O)CC(O)CCO)C2=NC=N1 Intermediate Fragment 
151 91.0753560121 CC(O)CC[OH2+]
152 73.0647913281 C=C([OH2+])CC
153 89.0597059481 C=C(O)CC[OH2+]
154 71.0491412641 C=CC(=C)[OH2+]
155 71.0491412641 C#CCC[OH2+]
156 190.0359507881 O=C=[NH+]C1=C2N=CN(C=O)C2=NC=N1
157 192.0516008521 O=C=[NH+]C1=C2N=CN(CO)C2=NC=N1
158 194.0672509161 O=C=[NH+]C1=C2NCN(CO)C2=NC=N1
159 196.0829009801 OC=[NH+]C1=C2NCN(CO)C2=NC=N1
160 77.0597059481 OCCC[OH2+]
161 59.0491412641 CC=C[OH2+]
162 57.0334912001 CC#C[OH2+]
163 55.0178411361 [CH2+]C#CO
164 204.0516008521 C=C(O)N1C=NC2=C([NH+]=C=O)N=CN=C21
165 206.0672509161 CC(O)N1C=NC2=C([NH+]=C=O)N=CN=C21
166 208.0829009801 CC(O)N1CNC2=C([NH+]=C=O)N=CN=C21
167 210.0985510441 CC(O)N1CNC2=C([NH+]=CO)N=CN=C21
168 212.1142011081 CC(O)N1CNC2=C([NH2+]CO)N=CN=C21
169 47.0491412641 CC[OH2+]
170 234.0621655361 O=C=[NH+]C1=C2N=CN(C(O)=CCO)C2=NC=N1
171 236.0778156001 O=C=[NH+]C1=C2N=CN(C(O)CCO)C2=NC=N1
172 238.0934656641 O=C=[NH+]C1=C2NCN(C(O)CCO)C2=NC=N1
173 280.1040303481 O=C=[NH+]C1=C2N=CN(C(CCO)OCCO)C2=NC=N1 Intermediate Fragment 
174 280.1040303481 CC(OC(CO)CO)N1C=NC2=C([NH+]=C=O)N=CN=C21 Intermediate Fragment 
