#In-silico ESI-MS/MS [M+H]+ Spectra
#PREDICTED BY CFM-ID 4.0.8
#SMILES=n1c(nc2c(c1N)nc(n2[C@H]1C[C@H]([C@H](O1)CO)O)O)O
#InChiKey=KYWYFIDKBQZMJT-UOWFLXDJSA-N
energy0
168.05160 75.26 21 38 32 52 45 47 25 41 49 (37.996 0.42497 0.14888 0.13047 0.124 0.033874 0.024597 0.0063835 0.0024963)
284.09894 100.00 0 137 257 280 276 125 136 134 161 81 89 121 124 120 131 (49.739 1.4903 0.16969 0.069626 0.043361 0.033395 0.030214 0.02542 0.019361 0.019343 0.015651 0.009886 0.0040881 0.0035449 0.00054227)
energy1
125.04579 3.55 27 48 39 (0.9886 0.81499 0.39687)
150.04104 9.79 23 24 (3.7542 2.3136)
151.02505 10.51 22 51 26 40 (3.3169 2.3774 0.43485 0.38593)
168.05160 100.00 21 32 49 52 41 38 25 45 47 (53.666 2.2666 2.1566 1.5072 1.2992 0.45681 0.32777 0.21611 0.078881)
284.09894 7.47 0 257 276 121 280 134 89 161 137 124 125 120 136 81 131 (4.2774 0.1006 0.042199 0.038685 0.037857 0.033082 0.030504 0.022151 0.020546 0.0067776 0.0056354 0.0043872 0.0042469 0.0025405 0.00093931)
energy2
43.01784 15.96 212 (2.6681)
45.03349 17.39 10 (2.9075)
55.01784 7.89 260 (1.319)
57.03349 34.05 16 (5.694)
71.04914 11.27 144 145 (1.2058 0.67876)
73.02841 8.59 167 12 (1.3357 0.10001)
75.04406 6.17 165 13 (0.97174 0.059673)
83.02399 5.73 37 (0.95814)
98.03489 6.38 35 (1.0676)
113.03455 5.29 116 (0.8839)
124.05054 6.96 177 (1.1638)
125.04579 19.04 48 27 39 (2.0773 1.0574 0.048656)
140.04545 5.42 113 (0.90696)
140.05669 6.47 50 42 (1.0518 0.030462)
150.04104 54.06 23 24 (6.9255 2.114)
152.05669 13.59 54 55 158 (1.0969 1.0757 0.099261)
168.05160 100.00 21 41 49 25 52 32 45 38 47 (5.6781 3.6559 3.4674 1.9534 0.63244 0.56881 0.3477 0.2228 0.19517)
170.06725 9.45 53 59 56 57 (0.77737 0.34939 0.2396 0.21351)
172.08290 8.36 61 64 63 (1.0697 0.20456 0.12394)
174.09855 7.61 66 (1.2731)
178.03595 5.75 159 160 (0.53892 0.42327)
180.05160 12.12 140 156 151 153 (0.55068 0.52535 0.49523 0.45595)
182.06725 9.15 150 (1.5293)
192.05160 5.74 174 178 176 175 181 180 (0.31215 0.23154 0.16109 0.13354 0.083576 0.037246)
194.06725 15.01 185 182 183 193 195 191 190 194 (0.82043 0.60543 0.28506 0.24213 0.20336 0.19999 0.090032 0.063404)
196.08290 11.34 197 202 200 204 206 208 203 207 (0.54788 0.39326 0.24425 0.23155 0.1525 0.13285 0.12265 0.070568)
206.06725 5.75 215 (0.9617)
208.08290 8.48 233 (1.4175)
224.07782 5.72 219 214 216 229 230 227 226 231 (0.37027 0.18114 0.12865 0.08862 0.058601 0.05435 0.040633 0.034384)
241.09313 6.60 84 128 127 (1.0465 0.05403 0.0026963)

0 284.0989449681 [NH3+]c1nc(O)nc2c1nc(O)n2C1CC(O)C(CO)O1
1 267.0723958721 OC1=NC=C2N=C(O)N(C3=CC(O)C(C[OH2+])O3)C2=N1
2 153.0407018201 O=C1N=C2N=C([OH2+])N=C2CN1
3 119.0702706321 OC1CCOC1C[OH2+]
4 117.0546205681 OC1C=COC1C[OH2+]
5 87.0440558841 [OH2+]C1C=COC1
6 89.0597059481 [OH2+]C1CCOC1
7 99.0440558841 CC1=C([OH2+])C=CO1
8 99.0440558841 [OH2+]CC1=CC=CO1
9 117.0546205681 C=C(O)C(=C[OH2+])OC Intermediate Fragment 
10 45.0334912001 C=C[OH2+]
11 117.0546205681 C=COC(=CO)C[OH2+] Intermediate Fragment 
12 73.0284058201 OC#CC[OH2+]
13 75.0440558841 OC=CC[OH2+]
14 91.0389705041 OC=C([OH2+])CO
15 117.0546205681 OC=C=COCC[OH2+] Intermediate Fragment 
16 57.0334912001 C#CC[OH2+]
17 117.0546205681 OC=C=C(O)CC[OH2+] Intermediate Fragment 
18 99.0440558841 C#CC(O)=CC[OH2+]
19 115.0389705041 OC1=C(C[OH2+])OC=C1
20 166.0359507881 [NH2+]=C1N=C(O)N=C2N=C(O)N=C12
21 168.0516008521 [NH2+]=C1N=C(O)N=C2NC(O)N=C12
22 151.0250517561 O=C1N=CC2=NC([OH2+])=NC2=N1
23 150.0410361681 [NH2+]=C1N=C(O)N=C2N=CN=C12
24 150.0410361681 [NH2+]=C1N=CN=C2N=C(O)N=C12
25 168.0516008521 N=C(O)N=C1NC(O)=NC1=C=[NH2+] Intermediate Fragment 
26 151.0250517561 N#CC1=C([NH+]=C=O)NC(O)=N1
27 125.0457872001 N#CC1=NC(O)NC1=[NH2+]
28 123.0301371361 N#CC1=NC(O)=NC1=[NH2+]
29 46.0287401681 [NH2+]=CO
30 108.0192381041 [NH+]#CC1=NC(=O)N=C1
31 141.0407018201 [NH2+]=C(O)N=C1C=NC(O)=N1
32 168.0516008521 [NH+]#CN=C(O)N=C1C=NC(O)N1 Intermediate Fragment 
33 126.0298027881 O=C=[NH+]C1C=NC(O)=N1
34 124.0141527241 O=C=[N+]=C1C=NC(O)=N1
35 98.0348881681 [NH2+]=C1C=NC(O)=N1
36 71.0239891361 N#C[NH+]=CO
37 83.0239891361 [OH+]=C1N=CC=N1
38 168.0516008521 NC(O)=NC(=[NH2+])C1=NC(=O)N=C1 Intermediate Fragment 
39 125.0457872001 N=C([NH3+])C1=NC(=O)N=C1
40 151.0250517561 N=C([NH+]=C=O)C1=NC(=O)N=C1
41 168.0516008521 N=C1NC(O)=NC1=C([NH3+])N=C=O Intermediate Fragment 
42 140.0566862321 N=C([NH3+])C1=NC(O)=NC1=N
43 100.0505382321 [NH2+]=C1C=NC(O)N1
44 166.0359507881 N=C1N=C(O)N=C1C(=N)[NH+]=C=O
45 168.0516008521 NC(=[NH2+])C1=C(N=C=O)NC(O)=N1 Intermediate Fragment 
46 166.0359507881 N=C(N)C1=NC(O)=NC1=[N+]=C=O
47 168.0516008521 N=C(O)N=C1C=NC(O)=NC1=[NH2+] Intermediate Fragment 
48 125.0457872001 N=C1C=NC(O)=NC1=[NH2+]
49 168.0516008521 NC1=NC(O)=NC([NH3+])=C1N=C=O Intermediate Fragment 
50 140.0566862321 N=C1C(=[NH2+])N=C(O)N=C1N
51 151.0250517561 N=C1N=C(O)N=CC1=[N+]=C=O
52 168.0516008521 NC1=C([NH3+])N=C(O)N=C1N=C=O Intermediate Fragment 
53 170.0672509161 [NH2+]=C1N=C(O)N=C2NC(O)NC12
54 152.0566862321 [NH3+]C1=C2N=CNC2=NC(O)=N1
55 152.0566862321 [NH3+]C1=C2N=C(O)NC2=NC=N1
56 170.0672509161 N=C1NC(O)=NC1=C([NH3+])N=CO Intermediate Fragment 
57 170.0672509161 N=C(O)NC1=NC(O)=NC([NH3+])=C1 Intermediate Fragment 
58 153.0407018201 [NH3+]C1=CC(N=C=O)=NC(O)=N1
59 170.0672509161 NC1=NC(O)=NC([NH3+])=C1N=CO Intermediate Fragment 
60 153.0407018201 [NH3+]C1=C(N=C=O)C=NC(O)=N1
61 172.0829009801 [NH3+]C1N=C(O)N=C2NC(O)NC21
62 154.0723362961 [NH3+]C1=C2NCNC2=NC(O)=N1
63 172.0829009801 N=C1NC(O)NC1=C([NH3+])N=CO Intermediate Fragment 
64 172.0829009801 NC(O)NC1=NC(O)=NC([NH3+])=C1 Intermediate Fragment 
65 112.0505382321 [NH3+]C1=CC=NC(O)=N1
66 174.0985510441 [NH3+]C1N=C(O)NC2NC(O)NC12
67 156.0879863601 [NH3+]C1N=C(O)N=C2NCNC21
68 252.0727302201 [NH3+]C1=C2N=C(O)N(C3=CC(O)CO3)C2=NC(O)=N1
69 254.0883802841 [NH3+]C1=C2N=C(O)N(C3CC(O)CO3)C2=NC(O)=N1
70 236.0778156001 [NH3+]C1=C2N=C(O)N(C3=CCCO3)C2=NC(O)=N1
71 254.0883802841 [NH3+]C1=C2N=C(O)N(C=CC(O)CO)C2=NC(O)=N1 Intermediate Fragment 
72 266.0883802841 CC1OC(N2C(O)=NC3=C([NH3+])N=C(O)N=C32)=CC1O
73 266.0883802841 C=C(O)C(=C)OCN1C(O)=NC2=C([NH3+])N=C(O)N=C21 Intermediate Fragment 
74 266.0883802841 CC(O)C(O)=C=CN1C(O)=NC2=C([NH3+])N=C(O)N=C21 Intermediate Fragment 
75 266.0883802841 CCC(O)=C=C(O)N1C(O)=NC2=C([NH3+])N=C(O)N=C21 Intermediate Fragment 
76 240.0727302201 [NH3+]C1=C2N=C(O)N(C(O)=CCO)C2=NC(O)=N1
77 266.0883802841 [NH3+]C1=C2N=C(O)N(C3=CCC(CO)O3)C2=NC(O)=N1
78 266.0883802841 [NH3+]C1=C2N=C(O)N(C(O)=C=CCCO)C2=NC(O)=N1 Intermediate Fragment 
79 266.0883802841 [NH3+]C1=C2N=CN(C3=CC(O)C(CO)O3)C2=NC(O)=N1
80 266.0883802841 [NH3+]C1=C2N=C(O)N(C3=CC(O)C(CO)O3)C2=NC=N1
81 284.0989449681 N=C(O)N=C1C(=C=[NH2+])N=C(O)N1C1CC(O)C(CO)O1 Intermediate Fragment 
82 267.0723958721 N#CC1=C([NH+]=CO)N(C2=CC(O)C(CO)O2)C(O)=N1
83 153.0407018201 N#CC1=NC(O)=NC1[NH+]=CO
84 241.0931313161 N=C=C1N=C(O)N(C2CC(O)C(CO)O2)C1=[NH2+]
85 224.0665822201 [NH+]#CC1=CN(C2=CC(O)C(CO)O2)C(O)=N1
86 110.0348881681 [NH+]#CC1=NC(=O)NC1
87 257.0880459361 [NH2+]=C(O)N=C1C=NC(O)N1C1=CC(O)C(CO)O1
88 214.0822322841 [NH2+]=C1C=NC(O)N1C1=CC(O)C(CO)O1
89 284.0989449681 [NH+]#CN=C(O)N=C1C=NC(O)N1C1CC(O)C(CO)O1 Intermediate Fragment 
90 242.0771469041 OC=[NH+]C1=CN=C(O)N1C1=CC(O)C(CO)O1
91 212.0665822201 [NH2+]=C1C=NC(O)N1C1=CC(O)=C(CO)O1
92 199.0713332521 OC1=NC=CN1C1=CC(O)C(C[OH2+])O1
93 197.0556831881 OC1=NC=CN1C1=CC(O)=C(C[OH2+])O1
94 128.0454528521 OC=[NH+]C1C=NC(O)=N1
95 242.0771469041 OC=[NH+]C1=CN=C(O)N1C=C=C(O)C(O)CO Intermediate Fragment 
96 242.0771469041 OC=[NH+]C1=CN=C(O)N1C(O)=C=C(O)CCO Intermediate Fragment 
97 154.0247174081 O=C=[NH+]C1=CN=C(O)N1C=O
98 242.0771469041 OC=C=C(OCCO)N1C([NH+]=CO)=CN=C1O Intermediate Fragment 
99 240.0614968401 OC=[NH+]C1=CN=C(O)N1C1=CC(O)=C(CO)O1
100 240.0614968401 OC=CC(O)=C=C(O)N1C([NH+]=CO)=CN=C1O Intermediate Fragment 
101 238.0458467761 O=CC1=C(O)C=C(N2C([NH+]=CO)=CN=C2O)O1
102 196.0716676001 CC1=C(O)C=C(N2C(=[NH2+])C=NC2O)O1
103 196.0716676001 [NH2+]=C1C=NC(O)N1C1=CC=C(CO)O1
104 214.0822322841 C=NC(O)N(C#[NH+])C1=CC(O)C(CO)O1 Intermediate Fragment 
105 159.0764186321 [NH+]#CNC1CC(O)C(CO)O1
106 214.0822322841 N=CC(=[NH2+])N(CO)C1=CC(O)=C(CO)O1 Intermediate Fragment 
107 214.0822322841 C=C(O)C(=CO)OCN1C(=[NH2+])C=NC1O Intermediate Fragment 
108 214.0822322841 [NH2+]=C1C=NC(O)N1C=C=C(O)C(O)CO Intermediate Fragment 
109 214.0822322841 [NH2+]=C1C=NC(O)N1C(O)=C=C(O)CCO Intermediate Fragment 
110 214.0822322841 [NH2+]=C1C=NC(O)N1C(=C=CO)OCCO Intermediate Fragment 
111 170.0560175361 [NH2+]=C1C=NC(O)N1C(O)=C=CO
112 214.0822322841 C=C(OC(=CO)CO)N1C(=[NH2+])C=NC1O Intermediate Fragment 
113 140.0454528521 C=C(O)N1C(=[NH2+])C=NC1=O
114 210.0509321561 [NH2+]=C1C=NC(O)N1C1=CC(O)=C(C=O)O1
115 199.0713332521 OC(=C=C(O)N1C=CN=C1O)CC[OH2+] Intermediate Fragment 
116 113.0345538201 OC1=NC=CN1C=[OH+]
117 197.0556831881 OC(=C=C(O)N1C=CN=C1O)C=C[OH2+] Intermediate Fragment 
118 195.0400331241 OC1=NC=CN1C1=CC(O)=C(C=[OH+])O1
119 88.0505382321 N=C[NH+]=C(N)O
120 284.0989449681 NC(O)=NC(=[NH2+])C1=CN(C2=CC(O)C(CO)O2)C(O)=N1 Intermediate Fragment 
121 284.0989449681 N=C1C(=C([NH3+])N=CO)N=C(O)N1C1=CC(O)C(CO)O1 Intermediate Fragment 
122 256.1040303481 N=C1C(=C(N)[NH3+])N=C(O)N1C1=CC(O)C(CO)O1
123 239.0774812521 N=C=C1N=C(O)N(C2=CC(O)C(CO)O2)C1=[NH2+]
124 284.0989449681 NC(=[NH2+])C1=C(N=CO)N(C2=CC(O)C(CO)O2)C(O)=N1 Intermediate Fragment 
125 284.0989449681 N=C(O)N(C1=CC(O)C(CO)O1)C1=NC(O)=NC([NH3+])=C1 Intermediate Fragment 
126 267.0723958721 [NH3+]C1=CC(N(CO)C2=CC(O)=C(C=O)O2)=NC(O)=N1
127 241.0931313161 [NH3+]C1=CC(N=C2CC(O)C(CO)O2)=NC(O)=N1
128 241.0931313161 N=C(C=C([NH3+])N=CO)N=C1C=C(O)C(CO)O1 Intermediate Fragment 
129 239.0774812521 [NH3+]C1=CC(N=C2C=C(O)C(CO)O2)=NC(O)=N1
130 112.0505382321 N=C(O)N=C=C=C[NH3+] Intermediate Fragment 
131 284.0989449681 [NH3+]C1=C(N=C(O)N=C2CC(O)C(CO)O2)C=NC(O)=N1 Intermediate Fragment 
132 160.0604342201 OC=[NH+]C1=CC(O)C(CO)O1
133 155.0563518841 [NH2+]=C1N=C(O)N=CC1=NCO
134 284.0989449681 [NH3+]C1=C(N=CO)C(N=C2CC(O)C(CO)O2)=NC(O)=N1 Intermediate Fragment 
135 256.1040303481 NC1=C([NH3+])N=C(O)N=C1N=C1CC(O)C(CO)O1
136 284.0989449681 NC1=C([NH3+])N=C(O)N=C1N(CO)C1=CC(O)=C(CO)O1 Intermediate Fragment 
137 284.0989449681 C=C(O)C(CO)OCN1C(O)=NC2=C([NH3+])N=C(O)N=C21 Intermediate Fragment 
138 240.0727302201 [NH3+]C1=C2N=C(O)N(COC=CO)C2=NC(O)=N1
139 198.0621655361 [NH3+]C1=C2N=C(O)N(CO)C2=NC(O)=N1
140 180.0516008521 [CH2+]N1C(O)=NC2=C(N)N=C(O)N=C21
141 196.0465154721 [NH3+]C1=C2N=C(O)N(C=O)C2=NC(O)=N1
142 87.0440558841 C=C(O)C=C[OH2+]
143 89.0597059481 C=C(O)CC[OH2+]
144 71.0491412641 C=CC(=C)[OH2+]
145 71.0491412641 C#CCC[OH2+]
146 91.0753560121 CC(O)CC[OH2+]
147 73.0647913281 C=C([OH2+])CC
148 186.0985510441 CN1C2=NC(O)=NC([NH3+])C2NC1O
149 184.0829009801 CN1C2=NC(O)=NC(=[NH2+])C2NC1O
150 182.0672509161 CN1C2=NC(O)=NC(=[NH2+])C2=NC1O
151 180.0516008521 [CH2+]N1C(O)=NC(=C=N)C1=NC(=N)O Intermediate Fragment 
152 137.0457872001 CN1C(=[NH2+])C(C#N)=NC1=O
153 180.0516008521 CN1C(=O)N=CC1=NC(O)=NC#[NH+] Intermediate Fragment 
154 138.0298027881 [CH2+]N1C(N=C=O)=CN=C1O
155 110.0348881681 [CH2+]N1C(=N)C=NC1=O
156 180.0516008521 C=NC1=NC(O)=NC([NH3+])=C1N=C=O Intermediate Fragment 
157 137.0457872001 C#[N+]C1=NC(O)=NC(N)=C1
158 152.0566862321 C=NC1=NC(O)=NC(=[NH2+])C1=N
159 178.0359507881 [CH2+]N1C(=O)N=C2C(=N)N=C(O)N=C21
160 178.0359507881 [CH2+]N1C(=O)N=C(C#N)C1=NC(=N)O Intermediate Fragment 
161 284.0989449681 [NH3+]C1=C2N=C(O)N(C=CC(O)C(O)CO)C2=NC(O)=N1 Intermediate Fragment 
162 105.0546205681 C=C(O)C([OH2+])CO
163 93.0546205681 OCC([OH2+])CO
164 61.0284058201 OC=C[OH2+]
165 75.0440558841 CC([OH2+])=CO
166 59.0127557561 OC#C[OH2+]
167 73.0284058201 CC([OH2+])=C=O
168 89.0233204401 O=CC([OH2+])=CO
169 71.0127557561 OC#CC=[OH+]
170 71.0127557561 [CH2+]C(O)=C=O
171 87.0076703761 O=C=C([OH2+])C=O
172 68.9971056921 [O+]#CC#CO
173 84.9920203121 O=C=C(O)C#[O+]
174 192.0516008521 C#CN1C(O)=NC2=C([NH3+])N=C(O)N=C21
175 192.0516008521 C#CN1C(O)=NC(=C=[NH2+])C1=NC(=N)O Intermediate Fragment 
176 192.0516008521 C#CN1C(=NC(O)=NC#[NH+])C=NC1O Intermediate Fragment 
177 124.0505382321 C#CN1C(=[NH2+])C=NC1O
178 192.0516008521 [C+]#CN(C(=N)O)C1=NC(O)=NC(N)=C1 Intermediate Fragment 
179 149.0457872001 [CH+]=C=NC1=NC(O)=NC(N)=C1
180 192.0516008521 C=C=NC1=NC(O)=NC([NH3+])=C1N=C=O Intermediate Fragment 
181 192.0516008521 C#CN(C#[O+])C1=NC(O)=NC(N)=C1N Intermediate Fragment 
182 194.0672509161 C=CN1C(O)=NC2=C([NH3+])N=C(O)N=C21
183 194.0672509161 C=CN1C(O)=NC(=C=[NH2+])C1=NC(=N)O Intermediate Fragment 
184 151.0614372641 C=CN1C(=[NH2+])C(=C=N)N=C1O
185 194.0672509161 C=CN1C(=NC(O)=NC#[NH+])C=NC1O Intermediate Fragment 
186 152.0454528521 C#CN1C([NH+]=CO)=CN=C1O
187 150.0298027881 C#CN1C([NH+]=C=O)=CN=C1O
188 109.0396392001 C#CN1C=CN=C1[OH2+]
189 107.0239891361 [C+]#CN1C=CN=C1O
190 194.0672509161 C#CN1C(=N)C(=C([NH3+])N=CO)N=C1O Intermediate Fragment 
191 194.0672509161 C#CN(C(=N)O)C1=NC(O)=NC([NH3+])=C1 Intermediate Fragment 
192 151.0614372641 C=C=NC1=NC(O)=NC([NH3+])=C1
193 194.0672509161 C=C=NC(O)=NC1=C([NH3+])N=C(O)N=C1 Intermediate Fragment 
194 194.0672509161 C=C=NC1=NC(O)=NC([NH3+])=C1N=CO Intermediate Fragment 
195 194.0672509161 C#CN(C=O)C1=NC(O)=NC([NH3+])=C1N Intermediate Fragment 
196 166.0723362961 CC=NC1=NC(O)=NC(=[NH2+])C1=N
197 196.0829009801 CCN1C(O)=NC2=C([NH3+])N=C(O)N=C21
198 178.0723362961 C=CN1C=NC2=C([NH3+])N=C(O)N=C21
199 178.0723362961 C=CN1C(O)=NC2=C([NH3+])N=CN=C21
200 196.0829009801 CCN1C(O)=NC(=C=[NH2+])C1=NC(=N)O Intermediate Fragment 
201 179.0563518841 C=CN1C(O)=NC(C#N)=C1[NH+]=CO
202 196.0829009801 CCN1C(=NC(O)=NC#[NH+])C=NC1O Intermediate Fragment 
203 196.0829009801 C=CN1C(=N)C(=C([NH3+])N=CO)N=C1O Intermediate Fragment 
204 196.0829009801 C=CN(C(=N)O)C1=NC(O)=NC([NH3+])=C1 Intermediate Fragment 
205 179.0563518841 C#CN(C=O)C1=NC(O)=NC([NH3+])=C1
206 196.0829009801 CC=NC(O)=NC1=C([NH3+])N=C(O)N=C1 Intermediate Fragment 
207 196.0829009801 CC=NC1=NC(O)=NC([NH3+])=C1N=CO Intermediate Fragment 
208 196.0829009801 C#CN(CO)C1=NC(O)=NC([NH3+])=C1N Intermediate Fragment 
209 198.0985510441 CCN1C2=NC(O)=NC([NH3+])=C2NC1O
210 200.1142011081 CCN1C2=NC(O)=NC([NH3+])C2NC1O
211 63.0440558841 OCC[OH2+]
212 43.0178411361 C=C=[OH+]
213 222.0621655361 [NH3+]C1=C2N=C(O)N(C#CCO)C2=NC(O)=N1
214 224.0778156001 [NH3+]C1=C2N=C(O)N(C=CCO)C2=NC(O)=N1
215 206.0672509161 CC#CN1C(O)=NC2=C([NH3+])N=C(O)N=C21
216 224.0778156001 N=C(O)N=C1C(=C=[NH2+])N=C(O)N1C=CCO Intermediate Fragment 
217 207.0512665041 N#CC1=C([NH+]=CO)N(C#CCO)C(O)=N1
218 181.0720019481 N=C=C1N=C(O)N(C=CCO)C1=[NH2+]
219 224.0778156001 [NH+]#CN=C(O)N=C1C=NC(O)N1C=CCO Intermediate Fragment 
220 182.0560175361 OC=[NH+]C1=CN=C(O)N1C#CCO
221 180.0403674721 O=CC#CN1C([NH+]=CO)=CN=C1O
222 154.0611029161 [NH2+]=C1C=NC(O)N1C#CCO
223 139.0502038841 OC1=NC=CN1C#CC[OH2+]
224 137.0345538201 OC1=NC=CN1C#CC=[OH+]
225 135.0189037561 [O+]#CC#CN1C=CN=C1O
226 224.0778156001 N=C1C(=C([NH3+])N=CO)N=C(O)N1C#CCO Intermediate Fragment 
227 224.0778156001 N=C(O)N(C#CCO)C1=NC(O)=NC([NH3+])=C1 Intermediate Fragment 
228 181.0720019481 [NH3+]C1=CC(N=C=CCO)=NC(O)=N1
229 224.0778156001 [NH3+]C1=C(N=C(O)N=C=CCO)C=NC(O)=N1 Intermediate Fragment 
230 224.0778156001 [NH3+]C1=C(N=CO)C(N=C=CCO)=NC(O)=N1 Intermediate Fragment 
231 224.0778156001 NC1=C([NH3+])N=C(O)N=C1N(C#CC=O)CO Intermediate Fragment 
232 226.0934656641 [NH3+]C1=C2N=C(O)N(CCCO)C2=NC(O)=N1
233 208.0829009801 CC=CN1C(O)=NC2=C([NH3+])N=C(O)N=C21
234 226.0934656641 N=C(O)N=C1C(=C=[NH2+])N=C(O)N1CCCO Intermediate Fragment 
235 226.0934656641 [NH+]#CN=C(O)N=C1C=NC(O)N1CCCO Intermediate Fragment 
236 226.0934656641 [NH3+]C1=C(N=CO)C(N=CCCO)=NC(O)=N1 Intermediate Fragment 
237 226.0934656641 NC1=C([NH3+])N=C(O)N=C1N(C#CCO)CO Intermediate Fragment 
238 228.1091157281 [NH3+]C1=C2NC(O)N(CCCO)C2=NC(O)=N1
239 266.0883802841 [NH3+]C1=C2N=C(O)N(C#CC(O)CCO)C2=NC(O)=N1
240 101.0597059481 C#CC(O)CC[OH2+]
241 190.0359507881 [C+]#CN1C(O)=NC2=C(N)N=C(O)N=C21
242 47.0491412641 CC[OH2+]
243 220.0465154721 [NH3+]C1=C2N=C(O)N(C#CC=O)C2=NC(O)=N1
244 234.0621655361 C=C(O)C#CN1C(O)=NC2=C([NH3+])N=C(O)N=C21
245 236.0778156001 CC(O)C#CN1C(O)=NC2=C([NH3+])N=C(O)N=C21
246 238.0934656641 CC(O)C=CN1C(O)=NC2=C([NH3+])N=C(O)N=C21
247 248.0778156001 CC=C(O)C#CN1C(O)=NC2=C([NH3+])N=C(O)N=C21
248 248.0778156001 [NH3+]C1=C2N=C(O)N(C#CC=CCO)C2=NC(O)=N1
249 266.0883802841 N=C(O)N=C1C(=C=[NH2+])N=C(O)N1C#CC(O)CCO Intermediate Fragment 
250 266.0883802841 [NH+]#CN=C(O)N=C1C=NC(O)N1C#CC(O)CCO Intermediate Fragment 
251 198.0873176641 [NH2+]=C1C=NC(O)N1C#CC(O)CCO
252 266.0883802841 N=C1C(=C([NH3+])N=CO)N=C(O)N1C#CC(O)=CCO Intermediate Fragment 
253 223.0825666321 N=C=C1N=C(O)N(C#CC(O)CCO)C1=[NH2+]
254 266.0883802841 N=C(O)N(C#CC(O)=CCO)C1=NC(O)=NC([NH3+])=C1 Intermediate Fragment 
255 266.0883802841 [NH3+]C1=C(N=CO)C(N=C=C=C(O)CCO)=NC(O)=N1 Intermediate Fragment 
256 223.0825666321 [NH3+]C1=CC(N=C=C=C(O)CCO)=NC(O)=N1
257 284.0989449681 [NH3+]C1=C2N=C(O)N(C(O)=CC(O)CCO)C2=NC(O)=N1 Intermediate Fragment 
258 194.0308654081 NC1=C2N=C(O)N(C#[O+])C2=NC(O)=N1
259 200.0778156001 [NH3+]C1=C2NC(O)N(CO)C2=NC(O)=N1
260 55.0178411361 [CH2+]C#CO
261 208.0465154721 [CH+]=C(O)N1C(O)=NC2=C(N)N=C(O)N=C21
262 210.0621655361 C=C(O)N1C(O)=NC2=C([NH3+])N=C(O)N=C21
263 210.0621655361 C=C(O)N1C(=NC(O)=NC#[NH+])C=NC1O Intermediate Fragment 
264 168.0403674721 C=C(O)N1C([NH+]=C=O)=CN=C1O
265 210.0621655361 [CH+]=C(O)N(C(=N)O)C1=NC(O)=NC(N)=C1 Intermediate Fragment 
266 167.0563518841 [CH2+]C(O)=NC1=NC(O)=NC(N)=C1
267 212.0778156001 CC(O)N1C(O)=NC2=C([NH3+])N=C(O)N=C21
268 214.0934656641 CC(O)N1C2=NC(O)=NC([NH3+])=C2NC1O
269 216.1091157281 CC(O)N1C2=NC(O)=NC([NH3+])C2NC1O
270 29.0385765801 C=[CH3+]
271 238.0570801561 [NH3+]C1=C2N=C(O)N(C(O)=C=CO)C2=NC(O)=N1
272 222.0621655361 C=C=C(O)N1C(O)=NC2=C([NH3+])N=C(O)N=C21
273 240.0727302201 [NH+]#CN=C(O)N=C1C=NC(O)N1C(O)=CCO Intermediate Fragment 
274 198.0509321561 OC=C=C(O)N1C([NH+]=CO)=CN=C1O
275 242.0883802841 [NH3+]C1=C2N=C(O)N(C(O)CCO)C2=NC(O)=N1
276 284.0989449681 [NH3+]C1=C2N=C(O)N(C(=CCO)OCCO)C2=NC(O)=N1 Intermediate Fragment 
277 238.0570801561 [NH3+]C1=C2N=C(O)N(COC#CO)C2=NC(O)=N1
278 242.0883802841 [NH3+]C1=C2N=C(O)N(COCCO)C2=NC(O)=N1
279 254.0883802841 C=C(OCCO)N1C(O)=NC2=C([NH3+])N=C(O)N=C21
280 284.0989449681 C=C(OC(CO)CO)N1C(O)=NC2=C([NH3+])N=C(O)N=C21 Intermediate Fragment 
