#In-silico ESI-MS/MS [M+H]+ Spectra
#PREDICTED BY CFM-ID 4.0.8
#SMILES=[nH]1c(nc2c(c1=O)nc(n2[C@@H]1O[C@H](CO)[C@@H](C1)O)Nc1c(cccc1C)C)N
#InChiKey=IQRGAHLECAFOBY-IJLUTSLNSA-N
energy0
271.13019 29.87 10 49 24 34 50 56 39 19 35 46 43 40 45 (20.661 0.10575 0.035281 0.027114 0.022741 0.019808 0.014786 0.0086441 0.006291 0.0017339 0.0010287 0.0010087 0.00062394)
387.17753 100.00 0 177 144 174 204 219 218 108 113 129 130 167 165 142 140 143 132 (68.427 0.98768 0.2113 0.093571 0.065363 0.064848 0.058795 0.029054 0.010116 0.0092087 0.0086559 0.0074046 0.0056707 0.0038529 0.0020631 0.0015064 0.00015766)
energy1
105.06988 6.47 15 (3.2363)
150.04104 4.28 13 (2.1422)
165.05194 11.12 16 (5.5623)
254.10364 5.38 18 20 47 (2.2314 0.46034 0.0014217)
255.09889 15.64 17 (7.8261)
271.13019 100.00 10 56 24 49 19 34 50 35 39 40 45 43 46 (46.785 0.87332 0.64289 0.58191 0.38022 0.28215 0.27046 0.083969 0.051738 0.046228 0.025775 0.002819 0.002667)
343.15131 3.45 83 (1.7284)
369.16696 6.75 66 145 81 78 1 86 85 75 82 72 84 74 (2.4709 0.55593 0.081417 0.080172 0.064072 0.037461 0.024421 0.022016 0.019394 0.015619 0.0051579 0.00018459)
387.17753 9.42 0 177 144 113 167 129 218 219 165 130 204 174 108 140 142 132 143 (3.1849 1.1728 0.16306 0.040722 0.03452 0.0237 0.021598 0.015094 0.01315 0.01265 0.011252 0.010561 0.0066678 0.0016564 0.0013879 9.6347e-05 7.9614e-05)
energy2
45.03349 12.83 157 (1.9169)
57.03349 27.11 189 (4.0518)
59.04914 20.29 191 (3.0324)
75.04406 5.94 124 (0.8876)
89.05971 11.19 166 (1.6731)
93.06988 5.97 222 (0.89303)
97.10118 6.25 220 (0.93406)
105.06988 5.89 15 (0.88022)
106.06513 13.68 90 (2.0445)
122.09643 9.70 12 (1.4497)
132.08078 5.87 48 (0.8768)
150.04104 11.95 13 (1.7866)
152.05669 9.16 94 (1.3687)
165.05194 10.96 16 (1.6386)
167.06759 13.29 61 (1.9861)
255.09889 41.62 17 (6.2209)
269.11454 6.87 9 42 33 (0.98542 0.024147 0.016726)
271.13019 100.00 10 24 56 50 35 19 40 49 46 43 34 39 45 (9.4347 1.5501 0.89057 0.83749 0.54164 0.45627 0.30085 0.27265 0.21578 0.16106 0.099172 0.098777 0.08722)
295.13019 21.63 160 (3.2329)
297.14584 56.74 79 (8.4804)
299.12510 6.31 194 195 (0.60935 0.33429)
300.13427 5.87 112 (0.87669)
309.14584 6.58 150 (0.98344)
313.14075 5.95 168 (0.88867)
319.18770 10.00 171 (1.4953)
321.13058 9.91 213 (1.4811)
327.15640 33.29 76 152 176 153 154 (1.7174 1.2634 0.70642 0.65157 0.63738)
343.11493 9.31 223 211 (0.96033 0.43062)
367.15131 5.28 203 (0.78988)
385.16188 11.79 128 139 164 202 (1.3537 0.18717 0.15263 0.068666)

0 387.1775296361 Cc1cccc(C)c1[NH2+]c1nc2c(=O)[nH]c(N)nc2n1C1CC(O)C(CO)O1
1 369.1669649521 CC1CCCC(C)C1=[NH+]C1=NC2=CN=C(N)N=C2N1C1C=C(O)C(=C=O)O1
2 255.1352709001 CC1=CC=CC(C)C1=[NH+]C1=NC2=CN=C(N)N=C2N1
3 117.0546205681 OC1CCOC1=C[OH2+]
4 99.0440558841 C=C1OCC=C1[OH2+]
5 117.0546205681 CCC(O)C(=O)C=[OH+] Intermediate Fragment 
6 99.0440558841 CC=C(O)C#C[OH2+]
7 117.0546205681 O=CCC(O)C=C[OH2+] Intermediate Fragment 
8 115.0389705041 OC1CCOC1=C=[OH+]
9 269.1145354561 C=C1C=CC=C(C)C1=[NH+]C1=NC2=C(O)N=C(N)N=C2N1
10 271.1301855201 CC1=CC=CC(C)C1=[NH+]C1=NC2=C(O)N=C(N)N=C2N1
11 253.1196208361 C=C1C=CC=C(C)C1=[NH+]C1=NC2=CN=C(N)N=C2N1
12 122.0964258041 CC1=CC=CC(C)C1=[NH2+]
13 150.0410361681 [NH3+]C1=NC(=O)C2=NC=NC2=N1
14 107.0855267721 CC1=CC([CH4+])=CC=C1
15 105.0698767081 [CH2+]C1=CC=CC(C)=C1
16 165.0519352001 NC1=NC(=O)C2=NC([NH3+])=NC2=N1
17 255.0988853921 [CH2+]C1=CC=CCC1=NC1=NC2=C(O)N=C(N)N=C2N1
18 254.1036364241 C=C1C=CC=C(C)C1=[NH+]C1=NC2=C(O)N=CN=C2N1
19 271.1301855201 CC1=CC=CC(C)C1=[NH+]C1=NC(=C=O)C(=NC(=N)N)N1 Intermediate Fragment 
20 254.1036364241 C=C1C=CC=C(C)C1=NC1=NC(C=O)=C([NH+]=C=N)N1
21 229.1083874561 CC1=CC=CC(C)C1=NC1=NC(=C=O)C(=[NH2+])N1
22 227.0927373921 C=C1C=CC=C(C)C1=NC1=NC(=C=O)C(=[NH2+])N1
23 243.1352709001 CC1=CC=CC(C)C1=NC1=NC(=NC(N)=[NH2+])C=N1
24 271.1301855201 CC1=CC=CC(C)C1=[NH+]C1=NC(=NC(N)=NC=O)C=N1 Intermediate Fragment 
25 228.1243718681 C=C1C=CC=C(C)C1=NC1=NC=C([NH+]=CN)N1
26 226.1087218041 C=C1C=CC=C(C)C1=NC1=NC=C([NH+]=C=N)N1
27 224.0930717401 [CH+]=C1C=CC=C(C)C1=NC1=NC=C(N=C=N)N1
28 201.1134728361 CC1=CC=CC(C)C1=NC1=NC(=[NH2+])C=N1
29 199.0978227721 C=C1C=CC=C(C)C1=NC1=NC(=[NH2+])C=N1
30 186.1025738041 C=C1C=CC=C(C)C1=[NH+]C1=NC=CN1
31 184.0869237401 [CH+]=C1C=CC=C(C)C1=NC1=NC=CN1
32 241.1196208361 C=C1C=CC=C(C)C1=NC1=NC(=NC(N)=[NH2+])C=N1
33 269.1145354561 C=C1C=CC=C(C)C1=NC1=NC(=NC(N)=[NH+]C=O)C=N1
34 271.1301855201 C=C1C=CC=C(C)C1=[NH+]C1=NC(C(=O)N=C(N)N)=CN1 Intermediate Fragment 
35 271.1301855201 C=C1C=CC=C(C)C1=[NH+]C1=NC(=C(O)N=CN)C(=N)N1 Intermediate Fragment 
36 242.1036364241 C=C1C=CC=C(C)C1=NC1=NC(=N)C(C([NH3+])=O)=N1
37 244.1192864881 CC1=CC=CC(C)C1=NC1=NC(=N)C(C([NH3+])=O)=N1
38 225.0770873281 [CH+]=C1C=CC=C(C)C1=NC1=NC(=C=O)C(=N)N1
39 271.1301855201 C=C1C=CC=C(C)C1=[NH+]C1=NC(C(N)=O)=C(N=CN)N1 Intermediate Fragment 
40 271.1301855201 C=C1C=CC=C(C)C1=[NH+]C(=N)NC1=NC(N)=NC(O)=C1 Intermediate Fragment 
41 145.0760247081 C=C1C=CC=C(C)C1=NC#[NH+]
42 269.1145354561 [CH+]=C1C=CC=C(C)C1=NC(=N)NC1=NC(N)=NC(O)=C1
43 271.1301855201 C=C1C=CC=C(C)C1=[NH+]C(N)=NC1=C(O)N=C(N)N=C1 Intermediate Fragment 
44 125.0457872001 NC1=NC(=O)C(=[NH2+])C=N1
45 271.1301855201 CC1=CC=CC(C)=C1[NH+]=C=NC1=C(O)N=C(N)N=C1N Intermediate Fragment 
46 271.1301855201 CC1=CC=CC(C)=C1[NH+]=C=NC1=NC(N)=NC(O)=C1N Intermediate Fragment 
47 254.1036364241 [CH2+]C1=CC=CC(C)=C1N=C=NC1=NC(N)=NC(O)=C1
48 132.0807757401 C#[N+]C1=C(C)C=CC=C1C
49 271.1301855201 C=C=C=C(C)C(CC)=[NH+]C1=NC2=C(O)N=C(N)N=C2N1 Intermediate Fragment 
50 271.1301855201 C=C=C(C)C(=[NH+]C1=NC2=C(O)N=C(N)N=C2N1)C(=C)C Intermediate Fragment 
51 229.0832353281 C#CC(=C)C=[NH+]C1=NC2=C(O)N=C(N)N=C2N1
52 231.0988853921 C#CC(C)C=[NH+]C1=NC2=C(O)N=C(N)N=C2N1
53 245.1145354561 C=CC(=[NH+]C1=NC2=C(O)N=C(N)N=C2N1)C(=C)C
54 243.0988853921 C#CC(=[NH+]C1=NC2=C(O)N=C(N)N=C2N1)C(=C)C
55 241.0832353281 C#CC(=NC1=NC2=C(O)N=C(N)N=C2N1)C(=[CH+])C
56 271.1301855201 CCC=C=CC(C)=C=[NH+]C1=NC2=C(O)N=C(N)N=C2N1 Intermediate Fragment 
57 243.0988853921 CC#CC(C)=C=[NH+]C1=NC2=C(O)N=C(N)N=C2N1
58 245.1145354561 CC=CC(C)=C=[NH+]C1=NC2=C(O)N=C(N)N=C2N1
59 273.1458355841 CC1=CCCC(C)C1=[NH+]C1=NC2=C(O)N=C(N)N=C2N1
60 275.1614856481 CC1CCCC(C)C1=[NH+]C1=NC2=C(O)N=C(N)N=C2N1
61 167.0675852641 NC1=NC(=O)C2=NC([NH3+])NC2=N1
62 277.1771357121 CC1CCCC(C)C1[NH2+]C1=NC2=C(O)N=C(N)N=C2N1
63 355.1513148881 CC1=CC=CC(C)C1=[NH+]C1=NC2=C(O)N=C(N)N=C2N1C1CC(O)=CO1
64 357.1669649521 CC1=CCCC(C)C1=[NH+]C1=NC2=C(O)N=C(N)N=C2N1C1CC(O)=CO1
65 359.1826150161 CC1CCCC(C)C1=[NH+]C1=NC2=C(O)N=C(N)N=C2N1C1CC(O)=CO1
66 369.1669649521 C=C1OC(N2C([NH+]=C3C(C)=CCCC3C)=NC3=C(O)N=C(N)N=C32)C=C1O
67 351.1564002681 C=C1C=CC(N2C([NH+]=C3C(C)=CC=CC3C)=NC3=C(O)N=C(N)N=C32)O1
68 248.0778156001 C=C1OC(N2C=NC3=C(O)N=C([NH3+])N=C32)CC1=O
69 250.0934656641 C=C1OC(N2C=NC3=C(O)N=C([NH3+])N=C32)CC1O
70 263.0887146321 C=C1OC(N2C([NH3+])=NC3=C(O)N=C(N)N=C32)CC1=O
71 353.1356648241 C=C1OC(N2C([NH+]=C3CC=CC=C3C)=NC3=C(O)N=C(N)N=C32)C=C1O
72 369.1669649521 C=C1OC(N2C(=NC(N)=NC=O)C=NC2=[NH+]C2=C(C)C=CCC2C)C=C1O Intermediate Fragment 
73 299.1502522681 C=C1OC(N2C(=[NH2+])C=NC2=NC2=C(C)C=CCC2C)C=C1O
74 369.1669649521 C=C1OC(N(C(=N)[NH+]=C2C(C)=CC=CC2C)C2=NC(N)=NC(O)=C2)C=C1O Intermediate Fragment 
75 369.1669649521 CC(=O)C(O)=CCN1C([NH+]=C2C(C)=CC=CC2C)=NC2=C(O)N=C(N)N=C21 Intermediate Fragment 
76 327.1564002681 CC1=CCCC(C)C1=[NH+]C1=NC2=C(O)N=C(N)N=C2N1CC#CO
77 323.1251001401 C=C1C=CC=C(C)C1=[NH+]C1=NC2=C(O)N=C(N)N=C2N1CC#CO
78 369.1669649521 C=C(C=O)OC(C)N1C([NH+]=C2C(C)=CC=CC2C)=NC2=C(O)N=C(N)N=C21 Intermediate Fragment 
79 297.1458355841 C=C1C=CC=C(C)C1=[NH+]C1=NC2=C(O)N=C(N)N=C2N1CC
80 299.1614856481 CCN1C([NH+]=C2C(C)=CC=CC2C)=NC2=C(O)N=C(N)N=C21
81 369.1669649521 C#COC(C=C=O)N1C([NH+]=C2C(C)CCCC2C)=NC2=C(O)N=C(N)N=C21 Intermediate Fragment 
82 369.1669649521 C#CC(O)=CC(=O)N1C([NH+]=C2C(C)CCCC2C)=NC2=C(O)N=C(N)N=C21 Intermediate Fragment 
83 343.1513148881 CC1CCCC(C)C1=[NH+]C1=NC2=C(O)N=C(N)N=C2N1C(=O)C#CO
84 369.1669649521 C=C=CC(C)C(CC)=[NH+]C1=NC2=C(O)N=C(N)N=C2N1C1C=C(O)C(=C)O1 Intermediate Fragment 
85 369.1669649521 C=C=C(C)C(=[NH+]C1=NC2=C(O)N=C(N)N=C2N1C1C=C(O)C(=C)O1)C(C)C Intermediate Fragment 
86 369.1669649521 C=C1OC(N2C([NH+]=C=C(C)C=CCCC)=NC3=C(O)N=C(N)N=C32)C=C1O Intermediate Fragment 
87 128.1433759961 CC1CCCC(C)C1[NH3+]
88 126.1277259321 CC1CCCC(C)C1=[NH2+]
89 124.1120758681 CC1=CCCC(C)C1=[NH2+]
90 106.0651256761 [CH2+]C1=CC=CCC1=N
91 120.0807757401 C=C1C=CC=C(C)C1=[NH2+]
92 260.0414300921 [NH3+]C1=NC(O)=C2N=CN(C3=CC(=O)C(=C=O)O3)C2=N1
93 264.0727302201 [NH3+]C1=NC(O)=C2N=CN(C3CC(O)C(=C=O)O3)C2=N1
94 152.0566862321 [NH3+]C1=NC(=O)C2=NCNC2=N1
95 266.0883802841 [NH3+]C1=NC(O)=C2N=CN(C3CC(O)C(=CO)O3)C2=N1
96 268.1040303481 [NH3+]C1=NC(O)=C2N=CN(C3CC(O)C(CO)O3)C2=N1
97 250.0934656641 [NH3+]C1=NC(O)=C2N=CN(C3CCC(=CO)O3)C2=N1
98 268.1040303481 [NH3+]C1=NC(O)=C2N=CN(C(=O)CC(O)CCO)C2=N1 Intermediate Fragment 
99 113.1324769641 CC1CCCC([CH4+])C1
100 279.0836292521 NC1=NC(O)=C2N=C([NH3+])N(C3CC(O)C(=C=O)O3)C2=N1
101 281.0992793161 NC1=NC(O)=C2N=C([NH3+])N(C3CC(O)C(=CO)O3)C2=N1
102 281.0992793161 NC1=NC(O)=C2N=C([NH3+])N(CCC(O)C(=O)C=O)C2=N1 Intermediate Fragment 
103 371.1462295081 CC1CCCCC1=[NH+]C1=NC2=C(O)N=C(N)N=C2N1C1C=C(O)C(=C=O)O1
104 257.1145354561 CC1=CCCCC1=[NH+]C1=NC2=NC(N)=NC(=O)C2=N1
105 371.1462295081 CC1=CCCCC1=[NH+]C1=NC2=C(O)N=C(N)N=C2N1CC=C(O)C(=O)C=O Intermediate Fragment 
106 371.1462295081 CC1CCCCC1=[NH+]C1=NC2=C(O)N=C(N)N=C2N1C(=O)C=C(O)C#CO Intermediate Fragment 
107 370.1509805401 CC1CCCC(C)C1=[NH+]C1=NC2=C(O)N=CN=C2N1C1C=C(O)C(=C=O)O1
108 387.1775296361 CC1CCCC(C)C1[NH2+]C1=NC(=C=O)C(=NC(=N)N)N1C1C=C(O)C(=C=O)O1 Intermediate Fragment 
109 370.1509805401 CC1=CCCC(C)C1=NC1=NC(C=O)=C([NH+]=CN)N1C1C=C(O)C(=C=O)O1
110 345.1557315721 CC1CCCC(C)C1NC1=NC(=C=O)C(=[NH2+])N1C1C=C(O)C(=C=O)O1
111 328.1291824761 CC1=CCCC(C)C1=[NH+]C1=NC(C=O)=CN1C1C=C(O)C(=C=O)O1
112 300.1342678561 CC1=CCCC(C)C1=[NH+]C1=NC=CN1C1C=C(O)C(=C=O)O1
113 387.1775296361 CC1CCCC(C)C1[NH+]=C1N=CC(=NC(N)=NC=O)N1C1C=C(O)C(=C=O)O1 Intermediate Fragment 
114 344.1717159841 CC1CCCC(C)C1=NC1=NC=C([NH+]=CN)N1C1C=C(O)C(=C=O)O1
115 317.1608169521 CC1CCCC(C)C1N=C1N=CC(=[NH2+])N1C1C=C(O)C(=C=O)O1
116 344.1717159841 CC1=CCCC(C)C1=NC1=NC=C([NH+]=CN)N1CC=C(O)C(=O)C=O Intermediate Fragment 
117 344.1717159841 CC1CCCC(C)C1=NC1=NC=C([NH+]=CN)N1C(=O)C=C(O)C#CO Intermediate Fragment 
118 342.1560659201 CC1=CCCC(C)C1=NC1=NC=C([NH+]=CN)N1C1C=C(O)C(=C=O)O1
119 342.1560659201 CC1=CC=CC(C)C1=NC1=NC=C([NH+]=CN)N1CC=C(O)C(=O)C=O Intermediate Fragment 
120 340.1404158561 CC1=CC=CC(C)C1=NC1=NC=C([NH+]=CN)N1C1C=C(O)C(=C=O)O1
121 299.1502522681 CC1=C(N=C2N=CC(=[NH2+])N2C2C=CC(=C=O)O2)C(C)CCC1
122 317.1608169521 CC1=C(N=C2N=CC(=[NH2+])N2CC=C(O)C(=O)C=O)C(C)CCC1 Intermediate Fragment 
123 317.1608169521 CC1CCCC(C)C1N=C1N=CC(=[NH2+])N1C(=O)C=C(O)C#CO Intermediate Fragment 
124 75.0440558841 OCC=C[OH2+]
125 302.1499179201 CC1CCCC(C)C1=[NH+]C1=NC=CN1C1C=C(O)C(=C=O)O1
126 359.1826150161 CC1CCCC(C)C1N=C1N=CC(=NC(N)=[NH2+])N1C1C=C(O)C(=C=O)O1
127 359.1826150161 CC1CCCC(C)C1N=C1N=CC(=NC(N)=[NH2+])N1C(=O)C=C(O)C#CO Intermediate Fragment 
128 385.1618795721 CC1=C(N=C2N=CC(=NC(N)=[NH+]C=O)N2C2C=C(O)C(=C=O)O2)C(C)CCC1
129 387.1775296361 CC1CCCC(C)C1=[NH+]C1=NC(C(=O)N=C(N)N)=CN1C1C=C(O)C(=C=O)O1 Intermediate Fragment 
130 387.1775296361 CC1CCCC(C)C1=[NH+]C1=NC(=C(O)N=CN)C(=N)N1C1C=C(O)C(=C=O)O1 Intermediate Fragment 
131 343.1400815081 CC1CCCC(C)C1=NC1=NC(=C=O)C(=[NH2+])N1C1C=C(O)C(=C=O)O1
132 387.1775296361 CC1CCCC(C)C1=[NH+]C(=N)N(C1=NC(N)=NC(O)=C1)C1C=C(O)C(=C=O)O1 Intermediate Fragment 
133 243.1087813801 NC1=NC(O)=CC([NH2+]C2CC(O)C(CO)O2)=N1
134 241.0931313161 NC1=NC(O)=CC([NH+]=C2CC(O)C(CO)O2)=N1
135 241.0931313161 NC1=NC(O)=CC([NH+]=C(O)CC(O)C=CO)=N1 Intermediate Fragment 
136 147.0916747721 CC1=CC=CC(C)C1=NC#[NH+]
137 149.1073248361 CC1=CCCC(C)C1=NC#[NH+]
138 276.1342678561 CC1CCCC(C)C1=NC(=[NH2+])N=C1C=C(O)C(=C=O)O1
139 385.1618795721 CC1=CCCC(C)C1=NC(=[NH2+])N(C1=NC(N)=NC(O)=C1)C1C=C(O)C(=C=O)O1
140 387.1775296361 CC1CCCC(C)C1[NH2+]C(=NC1=C(O)N=C(N)N=C1)N=C1C=C(O)C(=C=O)O1 Intermediate Fragment 
141 127.0614372641 NC1=NC(=O)C([NH3+])C=N1
142 387.1775296361 CC1CCCC(C)C1[NH2+]C=NC1=C(O)N=C(N)N=C1N=C1C=C(O)C(=C=O)O1 Intermediate Fragment 
143 387.1775296361 CC1=C([NH+]=CN(C2=NC(N)=NC(O)=C2N)C2C=C(O)C(=C=O)O2)C(C)CCC1 Intermediate Fragment 
144 387.1775296361 CC1CCCC(C)C1=[NH+]C1=NC2=C(O)N=C(N)N=C2N1CC=C(O)C(=O)C=O Intermediate Fragment 
145 369.1669649521 CC1=CCCC(C)C1=[NH+]C1=NC2=C(O)N=C(N)N=C2N1CC=C(O)C#CO
146 351.1564002681 C#CC(O)=CCN1C([NH+]=C2C(C)=CC=CC2C)=NC2=C(O)N=C(N)N=C21
147 331.1877003961 CC1CCCC(C)C1[NH2+]C1=NC2=C(O)N=C(N)N=C2N1CC#CO
148 329.1720503321 CC1CCCC(C)C1=[NH+]C1=NC2=C(O)N=C(N)N=C2N1CC#CO
149 311.1614856481 C#CCN1C([NH+]=C2C(C)=CCCC2C)=NC2=C(O)N=C(N)N=C21
150 309.1458355841 C#CCN1C([NH+]=C2C(C)=CC=CC2C)=NC2=C(O)N=C(N)N=C21
151 283.1301855201 C=C1C=CC=C(C)C1=[NH+]C1=NC2=C(O)N=C(N)N=C2N1C
152 327.1564002681 CC1=C([NH+]=C2N=CC(=NC(N)=NC=O)N2CC#CO)C(C)CC=C1 Intermediate Fragment 
153 327.1564002681 CC1=CCCC(C)C1=[NH+]C(N=CC#CO)=NC1=C(O)N=C(N)N=C1 Intermediate Fragment 
154 327.1564002681 CCCC=CC(C)=C=[NH+]C1=NC2=C(O)N=C(N)N=C2N1CC#CO Intermediate Fragment 
155 325.1407502041 CC1=CC=CC(C)C1=[NH+]C1=NC2=C(O)N=C(N)N=C2N1CC#CO
156 63.0440558841 OCC[OH2+]
157 45.0334912001 C=C[OH2+]
158 303.1927857761 CCN1C([NH+]=C2C(C)CCCC2C)=NC2=C(O)N=C(N)N=C21
159 301.1771357121 CCN1C([NH+]=C2C(C)=CCCC2C)=NC2=C(O)N=C(N)N=C21
160 295.1301855201 C=CN1C([NH+]=C2C(=C)C=CC=C2C)=NC2=C(O)N=C(N)N=C21
161 91.0389705041 OCC(=[OH+])CO
162 93.0546205681 OCC([OH2+])CO
163 281.1145354561 C=C1C=CC=C(C)C1=NC1=NC2=C(O)N=C(N)N=C2N1[CH2+]
164 385.1618795721 CC1=CCCC(C)C1=[NH+]C1=NC2=C(O)N=C(N)N=C2N1CC=C(O)C(=O)C=O
165 387.1775296361 C=C(O)C(=C=O)OCN1C([NH+]=C2C(C)CCCC2C)=NC2=C(O)N=C(N)N=C21 Intermediate Fragment 
166 89.0597059481 CC(O)C=C[OH2+]
167 387.1775296361 CC1CCCC(C)C1=[NH+]C1=NC2=C(O)N=C(N)N=C2N1C(C)OC(=C=O)C=O Intermediate Fragment 
168 313.1407502041 CC(=O)N1C([NH+]=C2C(C)=CC=CC2C)=NC2=C(O)N=C(N)N=C21
169 315.1564002681 CC(=O)N1C([NH+]=C2C(C)=CCCC2C)=NC2=C(O)N=C(N)N=C21
170 317.1720503321 CC(=O)N1C([NH+]=C2C(C)CCCC2C)=NC2=C(O)N=C(N)N=C21
171 319.1877003961 CC(=O)N1C([NH2+]C2C(C)CCCC2C)=NC2=C(O)N=C(N)N=C21
172 357.1669649521 CC1=CCCC(C)C1=[NH+]C1=NC2=C(O)N=C(N)N=C2N1C(C)OC#CO
173 359.1826150161 CC1CCCC(C)C1=[NH+]C1=NC2=C(O)N=C(N)N=C2N1C(C)OC#CO
174 387.1775296361 CC1CCCC(C)C1[NH2+]C1=NC2=C(O)N=C(N)N=C2N1C(C=C=O)OC#CO Intermediate Fragment 
175 345.1669649521 CC1CCCC(C)C1[NH2+]C1=NC2=C(O)N=C(N)N=C2N1C(=O)C#CO
176 327.1564002681 C#CC(=O)N1C([NH+]=C2C(C)CCCC2C)=NC2=C(O)N=C(N)N=C21
177 387.1775296361 CC1CCCC(C)C1[NH2+]C1=NC2=C(O)N=C(N)N=C2N1C(=O)C=C(O)C#CO Intermediate Fragment 
178 341.1356648241 CC1=CCCC(C)C1=[NH+]C1=NC2=C(O)N=C(N)N=C2N1C(=O)C#CO
179 325.1043646961 CC1C=CC=CC1=[NH+]C1=NC2=C(O)N=C(N)N=C2N1C(=O)C#CO
180 47.0491412641 CC[OH2+]
181 29.0385765801 C=[CH3+]
182 311.1251001401 C=C1C=CC=C(C)C1=[NH+]C1=NC2=C(O)N=C(N)N=C2N1C(C)=O
183 68.9971056921 [O+]#CC#CO
184 41.0021910721 [C+]#CO
185 71.0127557561 O=CC#C[OH2+]
186 43.0178411361 C#C[OH2+]
187 73.0284058201 OCC#C[OH2+]
188 55.0178411361 C#CC=[OH+]
189 57.0334912001 C#CC[OH2+]
190 77.0597059481 OCCC[OH2+]
191 59.0491412641 C=CC[OH2+]
192 303.1564002681 CC1CCCC(C)C1=[NH+]C1=NC2=C(O)N=C(N)N=C2N1C=O
193 301.1407502041 CC1=CCCC(C)C1=[NH+]C1=NC2=C(O)N=C(N)N=C2N1C=O
194 299.1251001401 CC1=CC=CC(C)C1=[NH+]C1=NC2=C(O)N=C(N)N=C2N1C=O
195 299.1251001401 CC1=CC=CC(C)=C1[NH+]=C1N=CC(=NC(N)=NC=O)N1C=O Intermediate Fragment 
196 297.1094500761 C=C1C=CC=C(C)C1=[NH+]C1=NC2=C(O)N=C(N)N=C2N1C=O
197 87.0440558841 CC(O)C#C[OH2+]
198 69.0334912001 C=CC#C[OH2+]
199 91.0753560121 CC(O)CC[OH2+]
200 73.0647913281 C=CC(C)[OH2+]
201 73.0647913281 CCC=C[OH2+]
202 385.1618795721 CC1CCCC(C)C1=[NH+]C1=NC2=C(O)N=C(N)N=C2N1C(=O)C=C(O)C#CO
203 367.1513148881 CC1=CC=CC(C)C1=[NH+]C1=NC2=C(O)N=C(N)N=C2N1CC=C(O)C#CO
204 387.1775296361 CCCC(C)C(CC)=[NH+]C1=NC2=C(O)N=C(N)N=C2N1C1C=C(O)C(=C=O)O1 Intermediate Fragment 
205 359.1462295081 CCCC(C)C=[NH+]C1=NC2=C(O)N=C(N)N=C2N1C1C=C(O)C(=C=O)O1
206 361.1618795721 CCCC(C)C[NH2+]C1=NC2=C(O)N=C(N)N=C2N1C1C=C(O)C(=C=O)O1
207 361.1618795721 CCC([NH2+]C1=NC2=C(O)N=C(N)N=C2N1C1C=C(O)C(=C=O)O1)C(C)C
208 359.1462295081 CCC(=[NH+]C1=NC2=C(O)N=C(N)N=C2N1C1C=C(O)C(=C=O)O1)C(C)C
209 357.1305794441 C=C(C)C(CC)=[NH+]C1=NC2=C(O)N=C(N)N=C2N1C1C=C(O)C(=C=O)O1
210 345.1305794441 CCC(CC)=[NH+]C1=NC2=C(O)N=C(N)N=C2N1C1C=C(O)C(=C=O)O1
211 343.1149293801 C=CC(CC)=[NH+]C1=NC2=C(O)N=C(N)N=C2N1C1C=C(O)C(=C=O)O1
212 323.1462295081 CCC[NH2+]C1=NC2=C(O)N=C(N)N=C2N1C1CC(O)C(=CO)O1
213 321.1305794441 CCC[NH2+]C1=NC2=C(O)N=C(N)N=C2N1C1CC(O)C(=C=O)O1
214 319.1149293801 CCC[NH2+]C1=NC2=C(O)N=C(N)N=C2N1C1C=C(O)C(=C=O)O1
215 317.0992793161 CCC=[NH+]C1=NC2=C(O)N=C(N)N=C2N1C1C=C(O)C(=C=O)O1
216 205.0832353281 CCC=[NH+]C1=NC2=NC(N)=NC(=O)C2=N1
217 315.0836292521 CC=C=[NH+]C1=NC2=C(O)N=C(N)N=C2N1C1C=C(O)C(=C=O)O1
218 387.1775296361 CCC(C)C(=[NH+]C1=NC2=C(O)N=C(N)N=C2N1C1C=C(O)C(=C=O)O1)C(C)C Intermediate Fragment 
219 387.1775296361 CCCCCC(C)C=[NH+]C1=NC2=C(O)N=C(N)N=C2N1C1C=C(O)C(=C=O)O1 Intermediate Fragment 
220 97.1011768361 C[CH+]#CCCCC
221 95.0855267721 C[CH+]#CC=CCC
222 93.0698767081 C[CH+]#CC#CCC
223 343.1149293801 CCC(C)=C=[NH+]C1=NC2=C(O)N=C(N)N=C2N1C1C=C(O)C(=C=O)O1
224 357.1305794441 CCCC(C)=C=[NH+]C1=NC2=C(O)N=C(N)N=C2N1C1C=C(O)C(=C=O)O1
