#In-silico ESI-MS/MS [M+H]+ Spectra
#PREDICTED BY CFM-ID 4.0.8
#SMILES=n1(c(nc2c(c1=O)ncn2[C@@H]1O[C@H](CO)[C@@H](C1)O)N)C
#InChiKey=VJSHSPNFYFRXGN-FSDSQADBSA-N
energy0
166.07234 100.00 14 47 31 38 18 49 55 40 52 54 (90.861 1.5688 0.26507 0.2256 0.17237 0.075813 0.0314 0.026241 0.018708 0.010305)
energy1
135.03014 4.24 21 41 (2.8426 0.01911)
149.04579 6.39 16 44 (4.0958 0.21241)
150.04104 4.58 17 (3.0882)
164.05669 4.53 13 (3.0561)
166.07234 100.00 14 40 18 47 31 38 49 54 55 52 (58.926 2.7984 2.6939 1.0098 0.95159 0.47627 0.31019 0.14717 0.079403 0.032153)
energy2
29.03858 2.77 166 (1.0351)
43.01784 2.84 177 (1.0577)
45.03349 6.62 145 (2.4678)
55.01784 4.17 179 (1.5552)
57.03349 21.89 8 (8.167)
71.04914 3.14 187 188 (0.81116 0.35963)
109.05087 6.57 33 (2.4496)
138.07742 4.75 30 (1.7715)
139.06144 4.81 50 43 53 19 (1.2946 0.32546 0.16598 0.0075478)
149.04579 3.97 16 44 (1.4752 0.0072153)
150.04104 8.72 17 (3.2532)
152.05669 5.05 58 (1.8839)
166.07234 100.00 14 54 31 40 18 47 55 52 49 38 (12.237 11.787 4.0606 2.8991 2.0275 1.6233 1.241 0.58507 0.51117 0.33091)
168.08799 4.36 57 (1.6261)
170.10364 5.53 59 60 61 62 (1.3856 0.26392 0.22563 0.18677)
172.11929 2.68 63 (1.0013)
190.07234 6.18 134 (2.3045)
192.08799 6.10 133 (2.2761)
206.10364 2.70 139 (1.0076)
212.11420 10.21 160 (3.8093)
246.09855 2.60 135 128 (0.72254 0.24727)

0 282.1196804121 Cn1c([NH3+])nc2c(ncn2C2CC(O)C(CO)O2)c1=O
1 264.1091157281 CN1CC2=C(N=C1[NH3+])N(C1CC(O)C(=C=O)O1)C=N2
2 150.0774216761 CN1CC2=NC=NC2=NC1=[NH2+]
3 117.0546205681 OC1CCOC1=C[OH2+]
4 99.0440558841 C=C1OCC=C1[OH2+]
5 99.0440558841 [OH+]=C=C1CCCO1
6 117.0546205681 CCC(O)C(=O)C=[OH+] Intermediate Fragment 
7 99.0440558841 CC=C(O)C#C[OH2+]
8 57.0334912001 CC#C[OH2+]
9 117.0546205681 O=CCC(O)C=C[OH2+] Intermediate Fragment 
10 117.0546205681 OCCCOC#C[OH2+] Intermediate Fragment 
11 117.0546205681 CCOC(=C=[OH+])CO Intermediate Fragment 
12 115.0389705041 OC1CCOC1=C=[OH+]
13 164.0566862321 [CH2+]N1C(=O)C2=C(N=C1N)NC=N2
14 166.0723362961 CN1C(=O)C2=C(N=C1[NH3+])NC=N2
15 148.0617716121 [CH2+]N1C=C2N=CN=C2N=C1N
16 149.0457872001 [CH2+]N1C=NC2=C(N=CN2)C1=O
17 150.0410361681 [NH3+]C1=NC(=O)C2=NC=NC2=N1
18 166.0723362961 CN=C([NH3+])N=C1NC=NC1=C=O Intermediate Fragment 
19 139.0614372641 NC=[NH+]C1=C(C=O)N=CN1
20 137.0457872001 N=C=[NH+]C1=C(C=O)N=CN1
21 135.0301371361 N=C=NC1=C(C#[O+])N=CN1
22 114.0661882961 [NH2+]=C1NCNC1C=O
23 110.0348881681 [NH2+]=C1N=CN=C1C=O
24 108.0192381041 N=C1N=CN=C1C#[O+]
25 57.0447245801 C[NH2+]C#N
26 59.0603746441 C[NH2+]C=N
27 97.0396392001 [OH+]=CC1=CNC=N1
28 95.0239891361 [O+]#CC1=CNC=N1
29 136.0617716121 C=[NH+]C(=N)N=C1C=NC=N1
30 138.0774216761 C[NH2+]C(=N)N=C1C=NC=N1
31 166.0723362961 CN(C#[O+])C(N)=NC1=CN=CN1 Intermediate Fragment 
32 111.0665226441 NC=[NH+]C1C=NC=N1
33 109.0508725801 N=C=[NH+]C1C=NC=N1
34 107.0352225161 N=C=[N+]=C1C=NC=N1
35 84.0556236121 [NH2+]=C1C=NCN1
36 82.0399735481 [NH2+]=C1C=NC=N1
37 134.0461215481 C#[N+]C(=N)N=C1C=NC=N1
38 166.0723362961 [CH2+]N(C(=N)N)C(=O)C1=CNC=N1 Intermediate Fragment 
39 124.0505382321 C=[NH+]C(=O)C1=CNC=N1
40 166.0723362961 CN(C#[NH+])C(O)=C1N=CNC1=N Intermediate Fragment 
41 135.0301371361 C#[N+]C(=O)C1=NC=NC1=N
42 137.0457872001 C=[NH+]C(=O)C1=NC=NC1=N
43 139.0614372641 C[NH2+]C(=O)C1=NC=NC1=N
44 149.0457872001 C=[N+](C#N)C(=O)C1=CNC=N1
45 85.0396392001 C[NH+](C#N)C=O
46 112.0505382321 [NH2+]=C1NCN=C1C=O
47 166.0723362961 CNC(=O)C1=C(N=C=[NH2+])NC=N1 Intermediate Fragment 
48 122.0348881681 C#[N+]C(=O)C1=CNC=N1
49 166.0723362961 CN1C(=O)C=C(N=C=N)N=C1[NH3+] Intermediate Fragment 
50 139.0614372641 [CH2+]N1C(=O)C=C(N)N=C1N
51 124.0505382321 [CH2+]N1C(=O)C=CN=C1N
52 166.0723362961 CN1C(=O)C(N=C=N)=CN=C1[NH3+] Intermediate Fragment 
53 139.0614372641 CN1C(=N)N=CC(=[NH2+])C1=O
54 166.0723362961 C=NC1=C(N)N=C(N)N([CH2+])C1=O Intermediate Fragment 
55 166.0723362961 C=NC1=C(N)C(=O)N([CH2+])C(N)=N1 Intermediate Fragment 
56 137.0457872001 [CH2+]N1C(=N)N=CC(=N)C1=O
57 168.0879863601 CN1C(=O)C2=C(N=C1[NH3+])NCN2
58 152.0566862321 [NH3+]C1=NC(O)=C2N=CNC2=N1
59 170.1036364241 CN1C([NH3+])=NC2=C(NCN2)C1O
60 170.1036364241 CN=C([NH3+])N=C1NCNC1=CO Intermediate Fragment 
61 170.1036364241 CN(C=O)C([NH3+])=NC1=CNCN1 Intermediate Fragment 
62 170.1036364241 CN(C[NH3+])C(O)=C1N=CNC1=N Intermediate Fragment 
63 172.1192864881 CN1C([NH3+])=NC2NCNC2C1O
64 250.0934656641 CN1C(=O)C2=C(N=C1[NH3+])N(C1CC(O)=CO1)C=N2
65 232.0829009801 CN1C(=O)C2=C(N=C1[NH3+])N(C1=CC=CO1)C=N2
66 252.1091157281 CN1C(=O)C2=C(N=C1[NH3+])N(C1CC(O)CO1)C=N2
67 234.0985510441 CN1C(=O)C2=C(N=C1[NH3+])N(C1CC=CO1)C=N2
68 254.1247657921 CN1C(=O)C2=C(N=C1[NH3+])N(C1CC(O)CO1)CN2
69 264.1091157281 C=C1OC(N2C=NC3=C2N=C([NH3+])N(C)C3=O)CC1O
70 264.1091157281 CC(=O)C(O)=CCN1C=NC2=C1N=C([NH3+])N(C)C2=O Intermediate Fragment 
71 264.1091157281 C=C(C=O)OC(C)N1C=NC2=C1N=C([NH3+])N(C)C2=O Intermediate Fragment 
72 265.0931313161 CN1C=NC2=C(N=CN2C2CC(O)C(=CO)O2)C1=[OH+]
73 266.0883802841 [NH3+]C1=NC(O)=C2N=CN(C3CC(O)C(=CO)O3)C2=N1
74 282.1196804121 CN=C([NH3+])N=C1C(=C=O)N=CN1C1CC(O)C(CO)O1 Intermediate Fragment 
75 253.0931313161 NC=[NH+]C1=C(C=O)N=CN1C1CC(O)C(=CO)O1
76 251.0774812521 NC=[NH+]C1=C(C=O)N=CN1C1CC(O)C(=C=O)O1
77 226.0822322841 [NH2+]=C1C(=C=O)N=CN1C1CC(O)C(CO)O1
78 254.1247657921 C[NH+]=C(N)N=C1C=NCN1C1CC(O)C(=CO)O1
79 282.1196804121 CN(C=O)C([NH3+])=NC1=CN=CN1C1CC(O)C(=CO)O1 Intermediate Fragment 
80 227.1138667601 NC=[NH+]C1=CN=CN1C1CC(O)C(CO)O1
81 225.0982166961 NC=[NH+]C1=CN=CN1C1CC(O)C(=CO)O1
82 181.0607685681 OC1CC(N2C=CN=C2)OC1=C=[OH+]
83 225.0982166961 NC=[NH+]C1=CN=CN1CCC(O)C(=O)C=O Intermediate Fragment 
84 225.0982166961 NC=[NH+]C1=CN=CN1C(=O)CC(O)C=CO Intermediate Fragment 
85 223.0825666321 NC=[NH+]C1=CN=CN1C1CC(O)C(=C=O)O1
86 223.0825666321 NC=[NH+]C1=CN=CN1CC=C(O)C(=O)C=O Intermediate Fragment 
87 221.0669165681 NC=[NH+]C1=CN=CN1C1C=C(O)C(=C=O)O1
88 200.1029677281 [NH2+]=C1C=NCN1C1CC(O)C(CO)O1
89 198.0873176641 [NH2+]=C1C=NCN1C1CC(O)C(=CO)O1
90 198.0873176641 [NH2+]=C1C=NCN1C(=O)CC(O)C=CO Intermediate Fragment 
91 183.0764186321 OC1CC(N2C=CN=C2)OC1=C[OH2+]
92 183.0764186321 O=C(C=[OH+])C(O)CCN1C=CN=C1 Intermediate Fragment 
93 183.0764186321 O=C(CC(O)C=C[OH2+])N1C=CN=C1 Intermediate Fragment 
94 181.0607685681 O=C(C=[OH+])C(O)=CCN1C=CN=C1 Intermediate Fragment 
95 179.0451185041 O=C1CC(N2C=CN=C2)OC1=C=[OH+]
96 252.1091157281 C[NH+]=C(N)N=C1C=NCN1C1CC(O)C(=C=O)O1
97 250.0934656641 C[NH+]=C(N)N=C1C=NCN1C1C=C(O)C(=C=O)O1
98 282.1196804121 CN(C(=N)[NH3+])C(=O)C1=CN(C2CC(O)C(=CO)O2)C=N1 Intermediate Fragment 
99 240.0978823481 C[NH2+]C(=O)C1=CN(C2CC(O)C(=CO)O2)C=N1
100 209.0556831881 O=C=C1OC(N2C=NC(C=[OH+])=C2)CC1O
101 282.1196804121 CN(C[NH3+])C(O)=C1N=CN(C2CC(O)C(=C=O)O2)C1=N Intermediate Fragment 
102 253.0931313161 C[NH2+]C(O)=C1N=CN(C2CC(O)C(=C=O)O2)C1=N
103 255.1087813801 C[NH2+]C(O)=C1N=CN(C2CC(O)C(=CO)O2)C1=N
104 224.0665822201 [NH2+]=C1C(=C=O)N=CN1C1CC(O)C(=CO)O1
105 255.1087813801 C[NH2+]C(O)=C1N=CN(C(=O)CC(O)C=CO)C1=N Intermediate Fragment 
106 282.1196804121 CNC(=O)C1=C(N=C[NH3+])N(C2CC(O)C(=CO)O2)C=N1 Intermediate Fragment 
107 255.1087813801 NC=[NH+]C1=C(C=O)N=CN1C1CC(O)C(CO)O1
108 282.1196804121 CN1C(=O)C=C(N(C=N)C2CC(O)C(=CO)O2)N=C1[NH3+] Intermediate Fragment 
109 265.0931313161 CN1C(=O)C=C([NH+](C)C2C=C(O)C(=C=O)O2)N=C1N
110 255.1087813801 CN1C(=O)C=C([NH+]=C2CC(O)C(CO)O2)N=C1N
111 126.0661882961 CN1C(=O)C=CN=C1[NH3+]
112 108.0556236121 [CH2+]N1C=CC=NC1=N
113 126.0661882961 CN=C([NH3+])N=C=C=CO Intermediate Fragment 
114 126.0661882961 C=CN=C(N)N(C)C#[O+] Intermediate Fragment 
115 96.0556236121 C#CN=C(N)[NH+]=C
116 124.0505382321 C#CN=C(N)[N+](=C)C=O
117 126.0661882961 C=NC(=N)N([CH2+])C(=C)O Intermediate Fragment 
118 126.0661882961 CN(C=[NH2+])C(O)=C=C=N Intermediate Fragment 
119 126.0661882961 CNC(O)=C=CN=C=[NH2+] Intermediate Fragment 
120 155.0451185041 [NH+]#CN=C1CC(O)C(=CO)O1
121 282.1196804121 CN1C(=O)C(N=C=NC2CC(O)C(CO)O2)=CN=C1[NH3+] Intermediate Fragment 
122 282.1196804121 C=NC1=C(N=C2CC(O)C(CO)O2)N=C([NH3+])N(C)C1=O Intermediate Fragment 
123 157.1083874561 C[NH2+]C1=CN=C(N)N(C)C1O
124 151.0614372641 C#[N+]C1=CN=C(N)N(C)C1=O
125 282.1196804121 CN1C(=O)C2=C(N=C1[NH3+])N(CCC(O)C(=O)CO)C=N2 Intermediate Fragment 
126 264.1091157281 CN1C(=O)C2=C(N=C1[NH3+])N(CCC(O)C#CO)C=N2
127 236.1142011081 C=C(O)CCN1C=NC2=C1N=C([NH3+])N(C)C2=O
128 246.0985510441 C#CC(O)=CCN1C=NC2=C1N=C([NH3+])N(C)C2=O
129 222.0985510441 CN1C(=O)C2=C(N=C1[NH3+])N(CC=CO)C=N2
130 220.0829009801 CN1C(=O)C2=C(N=C1[NH3+])N(CC#CO)C=N2
131 218.0672509161 CN1C(=O)C2=C(N=C1N)N([CH+]C#CO)C=N2
132 194.1036364241 CCN1C=NC2=C1N=C([NH3+])N(C)C2=O
133 192.0879863601 C=CN1C=NC2=C1N=C([NH3+])N(C)C2=O
134 190.0723362961 C#CN1C=NC2=C1N=C([NH3+])N(C)C2=O
135 246.0985510441 CN1C(=O)C2=C(N=C1[NH3+])N(CC=CC#CO)C=N2
136 264.1091157281 CN(C=[NH2+])C(O)=C1N=CN(CC=C(O)C#CO)C1=N Intermediate Fragment 
137 226.1298511721 CN1C(=O)C2=C(N=C1[NH3+])N(CCCO)CN2
138 224.1142011081 CN1C(=O)C2=C(N=C1[NH3+])N(CCCO)C=N2
139 206.1036364241 C=CCN1C=NC2=C1N=C([NH3+])N(C)C2=O
140 204.0879863601 C#CCN1C=NC2=C1N=C([NH3+])N(C)C2=O
141 178.0723362961 [CH2+]N1C=NC2=C1N=C(N)N(C)C2=O
142 222.0985510441 CN(C=O)C([NH3+])=NC1=CN=CN1CC#CO Intermediate Fragment 
143 222.0985510441 CNC(=O)C1=C(N=C[NH3+])N(CC#CO)C=N1 Intermediate Fragment 
144 63.0440558841 OCC[OH2+]
145 45.0334912001 C=C[OH2+]
146 198.1349365521 CCN1CNC2=C1N=C([NH3+])N(C)C2O
147 196.1192864881 CCN1CNC2=C1N=C([NH3+])N(C)C2=O
148 178.0723362961 C=CN1C=NC2=C(O)N=C([NH3+])N=C21
149 194.1036364241 CCN1C=NC(=C=O)C1=NC([NH3+])=NC Intermediate Fragment 
150 194.1036364241 C=CN1C=NC=C1N=C([NH3+])N(C)C=O Intermediate Fragment 
151 282.1196804121 CC(O)C(=CO)OCN1C=NC2=C1N=C([NH3+])N(C)C2=O Intermediate Fragment 
152 282.1196804121 CC(OC(=CO)CO)N1C=NC2=C1N=C([NH3+])N(C)C2=O Intermediate Fragment 
153 75.0440558841 OCC=C[OH2+]
154 206.0672509161 [CH2+]C(=O)N1C=NC2=C1N=C(N)N(C)C2=O
155 208.0829009801 CC(=O)N1C=NC2=C1N=C([NH3+])N(C)C2=O
156 208.0829009801 CNC(=O)C1=C(N=C=[NH2+])N(C(C)=O)C=N1 Intermediate Fragment 
157 208.0829009801 [CH2+]C(=O)N(C=N)C1=CC(=O)N(C)C(N)=N1 Intermediate Fragment 
158 208.0829009801 CC(=O)N=C=NC1=CN=C([NH3+])N(C)C1=O Intermediate Fragment 
159 210.0985510441 CC(O)N1C=NC2=C1N=C([NH3+])N(C)C2=O
160 212.1142011081 CC(O)N1CNC2=C1N=C([NH3+])N(C)C2=O
161 250.0934656641 CC(OC#CO)N1C=NC2=C1N=C([NH3+])N(C)C2=O
162 252.1091157281 CC(OC=CO)N1C=NC2=C1N=C([NH3+])N(C)C2=O
163 254.1247657921 CC(OCCO)N1C=NC2=C1N=C([NH3+])N(C)C2=O
164 282.1196804121 CN1C(=O)C2=C(N=C1[NH3+])N(C(CCO)OC=CO)C=N2 Intermediate Fragment 
165 47.0491412641 CC[OH2+]
166 29.0385765801 C=[CH3+]
167 236.0778156001 CN1C(=O)C2=C(N=C1[NH3+])N(C(=O)C=CO)C=N2
168 238.0934656641 CN1C(=O)C2=C(N=C1[NH3+])N(C(=O)CCO)C=N2
169 240.1091157281 CN1C(=O)C2=C(N=C1[NH3+])N(C(O)CCO)C=N2
170 238.0934656641 CN1C(=O)C2=C(N=C1[NH3+])N(COC=CO)C=N2
171 236.0778156001 CN1C(=O)C2=C(N=C1[NH3+])N(COC#CO)C=N2
172 282.1196804121 CN1C(=O)C2=C(N=C1[NH3+])N(C(=O)CC(O)CCO)C=N2 Intermediate Fragment 
173 214.1298511721 CC(O)N1CNC2=C1N=C([NH3+])N(C)C2O
174 214.1298511721 CC(O)N1CNC=C1N=C([NH3+])N(C)C=O Intermediate Fragment 
175 68.9971056921 [O+]#CC#CO
176 71.0127557561 O=CC#C[OH2+]
177 43.0178411361 C#C[OH2+]
178 73.0284058201 OCC#C[OH2+]
179 55.0178411361 C#CC=[OH+]
180 198.0985510441 CN1C(=O)C2=C(N=C1[NH3+])N(CO)CN2
181 196.0829009801 CN1C(=O)C2=C(N=C1[NH3+])N(CO)C=N2
182 194.0672509161 CN1C(=O)C2=C(N=C1[NH3+])N(C=O)C=N2
183 192.0516008521 CN1C(=O)C2=C(N=C1N)N(C#[O+])C=N2
184 87.0440558841 CC(O)C#C[OH2+]
185 69.0334912001 C=CC#C[OH2+]
186 89.0597059481 CC(O)C=C[OH2+]
187 71.0491412641 C#CC(C)[OH2+]
188 71.0491412641 CCC#C[OH2+]
189 91.0753560121 CC(O)CC[OH2+]
190 73.0647913281 C=CC(C)[OH2+]
191 73.0647913281 CCC=C[OH2+]
192 280.1040303481 CN1C(=O)C2=C(N=C1[NH3+])N(C(=O)CC(O)C=CO)C=N2
