#In-silico ESI-MS/MS [M+H]+ Spectra
#PREDICTED BY CFM-ID 4.0.8
#SMILES=[C@H]1(C[C@@H](O[C@@H]1CO)n1cc(c(nc1=O)N)C(=O)C)O
#InChiKey=WQJKXCUDTTWFSJ-IWSPIJDZSA-N
energy0
137.03455 43.15 31 52 72 (23.085 0.37631 0.047442)
154.06110 100.00 5 55 46 61 69 36 71 (52.014 0.70161 0.61278 0.53592 0.34574 0.14154 0.1284)
270.10845 9.08 0 131 180 198 218 124 201 260 115 200 250 207 (4.7573 0.091222 0.039192 0.03106 0.011776 0.0071504 0.0021426 0.0018209 0.0016511 0.0016448 0.0011341 0.00074598)
energy1
43.01784 6.28 32 (1.7601)
84.04439 5.54 41 (1.5527)
99.04406 5.82 7 93 83 (0.92656 0.47344 0.23129)
109.03964 6.18 43 (1.731)
111.05529 24.82 44 47 (6.0203 0.93396)
112.05054 10.51 28 (2.9463)
136.05054 33.38 34 30 (8.8218 0.53228)
137.03455 57.08 31 52 72 (14.399 1.4359 0.16035)
138.02980 5.25 35 (1.4721)
152.04545 28.92 6 60 73 68 54 (4.2458 3.1855 0.37415 0.28154 0.018964)
154.06110 100.00 5 55 61 46 36 69 71 (21.785 2.8419 0.97019 0.96295 0.91663 0.3492 0.19816)
180.07675 6.06 117 (1.6974)
energy2
43.01784 7.36 32 (1.5899)
45.03349 17.03 88 (3.6819)
55.01784 3.97 185 (0.85893)
57.03349 13.28 95 (2.8713)
67.01784 2.65 63 (0.57195)
71.04914 3.91 188 189 (0.54112 0.30461)
73.02841 3.14 137 87 (0.58693 0.091689)
81.04472 4.47 235 (0.96628)
82.02874 5.80 40 (1.254)
95.06037 2.49 223 (0.53784)
99.04406 14.97 7 83 93 (1.5647 1.5043 0.16597)
109.03964 11.11 43 (2.4017)
111.05529 16.24 47 44 (2.7587 0.75202)
112.05054 15.94 28 (3.4447)
126.06619 8.75 45 (1.8922)
136.05054 9.99 34 30 (1.3087 0.85082)
137.03455 9.94 31 72 52 (1.7365 0.27616 0.13515)
138.02980 3.39 35 (0.73344)
138.06619 5.11 29 (1.1037)
152.04545 32.80 6 68 60 54 73 (5.1295 0.97625 0.59354 0.20553 0.1862)
154.06110 100.00 5 46 61 55 36 71 69 (8.0534 5.4116 2.3467 2.0798 1.61 1.1922 0.92243)
166.06110 12.04 126 125 (1.7077 0.89593)
168.07675 9.34 127 155 246 (1.5505 0.26573 0.2031)
178.06110 6.32 116 (1.3651)
180.07675 22.32 117 (4.8254)
182.09240 3.21 118 167 (0.42395 0.27036)
184.10805 6.66 119 (1.4393)
194.09240 3.34 159 158 (0.38256 0.34025)
198.07608 2.98 206 (0.64398)
234.08732 5.03 147 145 146 9 10 (0.39258 0.2844 0.27591 0.06917 0.065569)

0 270.1084470321 CC(=O)c1cn(C2CC(O)C(CO)O2)c(=O)nc1[NH3+]
1 238.0822322841 CC(=O)C1=CN(C2C=C(O)CO2)C(=O)N=C1[NH3+]
2 240.0978823481 CC(O)C1=CN(C2C=C(O)CO2)C(=O)N=C1[NH3+]
3 252.0978823481 C=C1OC(N2C=C(C(C)O)C([NH3+])=NC2=O)C=C1O
4 156.0767529801 CC(O)C1=C([NH3+])N=C(O)N=C1
5 154.0611029161 CC(=O)C1=C([NH3+])N=C(O)N=C1
6 152.0454528521 [CH2+]C(=O)C1=C(N)N=C(O)N=C1
7 99.0440558841 C=C1OC=CC1[OH2+]
8 210.0873176641 C=C1OC(N2C=CC([NH3+])=NC2O)C=C1O
9 234.0873176641 C=CC1=CN(C2C=C(O)C(=C)O2)C(=O)N=C1[NH3+]
10 234.0873176641 C=C1C=CC(N2C=C(C(C)=O)C([NH3+])=NC2=O)O1
11 252.0978823481 C=C(CO)OC(=C)N1C=C(C(C)=O)C([NH3+])=NC1=O Intermediate Fragment 
12 252.0978823481 CC(=O)C(O)=C=CN1C=C(C(C)O)C([NH3+])=NC1=O Intermediate Fragment 
13 252.0978823481 C#CC(O)=C=C(O)N1C=C(C(C)O)C([NH3+])=NC1O Intermediate Fragment 
14 252.0978823481 C=C1OC(N(C=C(C#[NH+])C(C)O)C(=N)O)C=C1O Intermediate Fragment 
15 252.0978823481 C=C1OC(=NC=C(C([NH3+])=NC=O)C(C)O)C=C1O Intermediate Fragment 
16 209.0920686961 C=C1OC(=[NH+]C=C(C=N)C(C)O)C=C1O
17 160.1080531081 CC(O)C1C=NC(O)NC1[NH3+]
18 114.0661882961 [NH3+]C1=CC=NC(O)N1
19 116.0818383601 [NH3+]C1CC=NC(O)N1
20 160.1080531081 CC(O)C(=C=NCO)C(N)[NH3+] Intermediate Fragment 
21 132.1131384881 CC(O)C(C=[NH2+])C(N)N
22 160.1080531081 CC(O)C(=C=NC(N)O)C[NH3+] Intermediate Fragment 
23 160.1080531081 CC(O)C=C=NC(O)NC[NH3+] Intermediate Fragment 
24 160.1080531081 C=NC(O)NC([NH3+])=CC(C)O Intermediate Fragment 
25 99.0552892641 [CH2+]C(O)=C=C(N)N
26 160.1080531081 C=C(C([NH3+])=NC(N)O)C(C)O Intermediate Fragment 
27 158.0924030441 CC(O)C1=C([NH3+])NC(O)N=C1
28 112.0505382321 [NH3+]C1=CC=NC(O)=N1
29 138.0661882961 C=CC1=C([NH3+])N=C(O)N=C1
30 136.0505382321 [CH2+]C(=O)C1=C(N)N=CN=C1
31 137.0345538201 [CH2+]C(=O)C1=CN=C(O)N=C1
32 43.0178411361 C=C=[OH+]
33 41.0021910721 [CH+]=C=O
34 136.0505382321 C#CC1=C([NH3+])N=C(O)N=C1
35 138.0298027881 NC1=C(C#[O+])C=NC(O)=N1
36 154.0611029161 CC(=O)C(=C=N)C([NH3+])=NC=O Intermediate Fragment 
37 127.0502038841 CC(O)=C=C(N)[NH+]=C=O
38 71.0239891361 N=C=[NH+]C=O
39 69.0083390721 N=C=[N+]=C=O
40 82.0287401681 CC(O)=[C+]C#N
41 84.0443902321 CC(O)=CC#[NH+]
42 107.0239891361 [CH2+]C(=O)C(=C=N)C#N
43 109.0396392001 CC(=O)C(=C=N)C#[NH+]
44 111.0552892641 CC(O)C(=C=N)C#[NH+]
45 126.0661882961 CC(=O)C(C#[NH+])=C(N)N
46 154.0611029161 CC(=O)C(=C=NC=O)C(=N)[NH3+] Intermediate Fragment 
47 111.0552892641 [CH+]=C(C(=N)N)C(C)=O
48 45.0447245801 NC=[NH2+]
49 43.0290745161 [NH+]#CN
50 110.0236547881 CC(=O)C#C[NH+]=C=O
51 112.0393048521 CC(=O)C#C[NH2+]C=O
52 137.0345538201 CC(=O)C(=C=[NH+]C=O)C#N
53 124.0505382321 [CH2+]C(=O)C(C#N)=C(N)N
54 152.0454528521 CC(=O)C(=C=NC#[O+])C(=N)N
55 154.0611029161 CC(O)C(=C=NC(=N)O)C#[NH+] Intermediate Fragment 
56 94.0287401681 [CH+]=C(C#N)C(C)=O
57 71.0239891361 C#[N+]C(=N)O
58 125.0345538201 [CH2+]C(O)=C=C=NC(=N)O
59 127.0502038841 CC(O)=C=C=[NH+]C(=N)O
60 152.0454528521 CC(=O)C(=C=[NH+]C(=N)O)C#N
61 154.0611029161 CC(O)C=C=NC(=O)N=C=[NH2+] Intermediate Fragment 
62 69.0334912001 C#CC(C)=[OH+]
63 67.0178411361 [C+]#CC(C)=O
64 86.0348881681 N=C=NC([NH3+])=O
65 96.0192381041 C#[N+]C(=O)N=C=N
66 108.0080047241 [CH2+]C(=O)C#CN=C=O
67 86.0600402961 CC(O)CC#[NH+]
68 152.0454528521 CC(O)=C=C=[NH+]C(=O)N=C=N
69 154.0611029161 C=NC(O)=NC(N)=C=C([CH2+])O Intermediate Fragment 
70 125.0345538201 [CH2+]C(O)=C=C(N)N=C=O
71 154.0611029161 C=C(C([CH2+])=O)C(N)=NC(N)=O Intermediate Fragment 
72 137.0345538201 [CH+]=C(C(=N)N=C=O)C(C)=O
73 152.0454528521 CC(=O)C(=C=N)C(N)=NC#[O+] Intermediate Fragment 
74 111.0076703761 O=C1C=COC1=C=[OH+]
75 113.0233204401 OC1C=COC1=C=[OH+]
76 115.0389705041 OC1C=COC1=C[OH2+]
77 87.0440558841 [OH2+]C1C=COC1
78 115.0389705041 C=C=C(O)C(=O)C[OH2+] Intermediate Fragment 
79 115.0389705041 O=C=C=C(O)CC[OH2+] Intermediate Fragment 
80 117.0546205681 OC1C=COC1C[OH2+]
81 85.0284058201 [OH+]=C1C=COC1
82 89.0597059481 [OH2+]C1CCOC1
83 99.0440558841 [OH2+]C=C1C=CCO1
84 117.0546205681 C=COC(=C[OH2+])CO Intermediate Fragment 
85 91.0389705041 OCC(=[OH+])CO
86 75.0440558841 OCC=C[OH2+]
87 73.0284058201 OCC#C[OH2+]
88 45.0334912001 C=C[OH2+]
89 89.0597059481 C=C[OH+]CCO
90 117.0546205681 C=C(O)C(=C[OH2+])OC Intermediate Fragment 
91 117.0546205681 C=C=C(O)C(O)C[OH2+] Intermediate Fragment 
92 29.0385765801 C=[CH3+]
93 99.0440558841 C=C=C(O)C=C[OH2+]
94 59.0491412641 CC=C[OH2+]
95 57.0334912001 CC#C[OH2+]
96 59.0127557561 OC=C=[OH+]
97 61.0284058201 OCC=[OH+]
98 117.0546205681 OC=C=C(O)CC[OH2+] Intermediate Fragment 
99 47.0491412641 CC[OH2+]
100 87.0440558841 C=C(O)C=C[OH2+]
101 89.0597059481 C=C(O)CC[OH2+]
102 71.0127557561 OC#CC=[OH+]
103 117.0546205681 OC=C=COCC[OH2+] Intermediate Fragment 
104 252.0978823481 CC(O)C1=CN(C2C=C(O)C(=C=O)O2)CN=C1[NH3+]
105 253.0818979361 CC(O)C1=CN(C2C=C(O)C(=C=[OH+])O2)C(O)N=C1
106 224.0665822201 [NH3+]C1=NC(O)N(C2C=C(O)C(=C=O)O2)C=C1
107 196.0716676001 [NH3+]C1=NC(=O)N(C2=CC(O)CO2)C=C1
108 226.0822322841 [NH3+]C1C=CN(C2C=C(O)C(=C=O)O2)C(O)N1
109 226.0822322841 [NH3+]C1C=CN(C=C=C(O)C(=O)C=O)C(O)N1 Intermediate Fragment 
110 228.0978823481 [NH3+]C1CCN(C2C=C(O)C(=C=O)O2)C(O)N1
111 228.0978823481 [NH3+]C1CCN(C(O)=C=C(O)C#CO)C(O)N1 Intermediate Fragment 
112 252.0978823481 CCC1=CN(C2C=C(O)C(=C=O)O2)C(O)N=C1[NH3+]
113 252.0978823481 CCC1=CN(C=C=C(O)C(=O)C=O)C(O)N=C1[NH3+] Intermediate Fragment 
114 254.0771469041 [NH3+]C1=NC(O)N(C2C=C(O)C(=C=O)O2)C=C1CO
115 270.1084470321 C=C(OC(=C=O)CO)N1C=C(C(C)O)C([NH3+])=NC1O Intermediate Fragment 
116 178.0611029161 C#CN1C=C(C(C)=O)C([NH3+])=NC1=O
117 180.0767529801 C#CN1C=C(C(C)O)C([NH3+])=NC1=O
118 182.0924030441 C#CN1C=C(C(C)O)C([NH3+])=NC1O
119 184.1080531081 C#CN1C=C(C(C)O)C([NH3+])NC1O
120 196.0716676001 C=C(O)N1C=C(C(C)=O)C([NH3+])=NC1=O
121 196.0716676001 C=C(O)N=C=C(C(C)=O)C([NH3+])=NC=O Intermediate Fragment 
122 196.0716676001 C=C(O)N(C#[O+])C=C(C(=N)N)C(C)=O Intermediate Fragment 
123 198.0873176641 C=C(O)N1C=C(C(C)O)C([NH3+])=NC1=O
124 270.1084470321 C=C(O)C(=C=O)OCN1C=C(C(C)O)C([NH3+])=NC1O Intermediate Fragment 
125 166.0611029161 [CH2+]N1C=C(C(C)=O)C(N)=NC1=O
126 166.0611029161 [CH2+]N(C=C(C#N)C(C)=O)C(=N)O Intermediate Fragment 
127 168.0767529801 CC(=O)C1=CN(C)C(=O)N=C1[NH3+]
128 182.0560175361 CC(=O)C1=CN(C=O)C(=O)N=C1[NH3+]
129 184.0716676001 CC(O)C1=CN(C=O)C(=O)N=C1[NH3+]
130 184.0716676001 CC(=O)C(=CN(C=O)C=O)C(=N)[NH3+] Intermediate Fragment 
131 270.1084470321 CC(O)C1=CN(C=C=C(O)C(=O)C=O)C(O)NC1[NH3+] Intermediate Fragment 
132 186.1237031721 C#CN1CC(C(C)O)C([NH3+])NC1O
133 186.1237031721 C#CN=CC(C(C)O)C([NH3+])NCO Intermediate Fragment 
134 87.0076703761 O=CC(=[OH+])C=O
135 89.0233204401 O=CC(=[OH+])CO
136 71.0127557561 CC(=O)C#[O+]
137 73.0284058201 CC(=[OH+])C=O
138 93.0546205681 OCC([OH2+])CO
139 75.0440558841 CC(=[OH+])CO
140 172.1080531081 CC(O)C1=CN(C)C(O)N=C1[NH3+]
141 170.0924030441 CC(O)C1=CN(C)C(=O)N=C1[NH3+]
142 152.0818383601 C=CC1=CN(C)C(=O)N=C1[NH3+]
143 252.0978823481 CC(O)C1=CN(C=C=C(O)C#CO)C(O)N=C1[NH3+]
144 176.0454528521 [C+]#CN1C=C(C(C)=O)C(N)=NC1=O
145 234.0873176641 C#CC(O)=C=CN1C=C(C(C)O)C([NH3+])=NC1=O
146 234.0873176641 CCC1=CN(C=C=C(O)C#CO)C(=O)N=C1[NH3+]
147 234.0873176641 CC(O)C1=CN(CC#CC#CO)C(=O)N=C1[NH3+]
148 210.0873176641 CC(O)C1=CN(CC#CO)C(=O)N=C1[NH3+]
149 208.0716676001 CC(=O)C1=CN(CC#CO)C(=O)N=C1[NH3+]
150 206.0560175361 CC(=O)C1=CN([CH+]C#CO)C(=O)N=C1N
151 252.0978823481 CC(O)C(C=[NH2+])=CN(C=C=C(O)C#CO)C(=N)O Intermediate Fragment 
152 252.0978823481 CC(O)C=CN(C=C=C(O)C#CO)C(=O)N=C[NH3+] Intermediate Fragment 
153 184.0968197281 CC(O)CC[NH2+]C=C=C(O)C#CO
154 214.1186177921 CC(O)C1=CN(CC#CO)C(O)NC1[NH3+]
155 168.0767529801 [NH3+]C1=NC(O)N(CC#CO)C=C1
156 196.1080531081 CCC1=CN(CC#CO)C(O)N=C1[NH3+]
157 212.1029677281 CC(O)C1=CN(CC#CO)C(O)N=C1[NH3+]
158 194.0924030441 CCC1=CN(CC#CO)C(=O)N=C1[NH3+]
159 194.0924030441 C#CCN1C=C(C(C)O)C([NH3+])=NC1=O
160 193.0607685681 CC(=O)C1=CN(CC#CO)C(=[OH+])N=C1
161 192.0767529801 C=CC1=CN(CC#CO)C(=O)N=C1[NH3+]
162 192.0767529801 C#CCN1C=C(C(C)=O)C([NH3+])=NC1=O
163 210.0873176641 CC(O)C(=CN=CC#CO)C([NH3+])=NC=O Intermediate Fragment 
164 167.0815040121 CC(O)C(C=N)=C[NH+]=CC#CO
165 210.0873176641 CC(=O)C(=CN(C=O)CC#CO)C(=N)[NH3+] Intermediate Fragment 
166 193.0607685681 CC(=O)C(C#N)=C[NH+](C=O)CC#CO
167 182.0924030441 CC(O)C(=C[NH+]=CC#CO)C(=N)N
168 210.0873176641 CC(O)C(C#[NH+])=CN(CC#CO)C(=N)O Intermediate Fragment 
169 127.0502038841 C[NH+](C=C=C=O)C(=N)O
170 183.0764186321 CC(O)C#C[NH+](CC#CO)C(=N)O
171 210.0873176641 CC(O)C=CN(CC#CO)C(=O)N=C=[NH2+] Intermediate Fragment 
172 140.0706049801 CC(O)C=C[NH+]=CC#CO
173 210.0873176641 C=C(C([NH3+])=NC(=O)N=CC#CO)C(C)O Intermediate Fragment 
174 139.0502038841 C=C(C(=N)[NH+]=C=O)C(C)=O
175 208.0716676001 CC(=O)C(=CN=CC#CO)C([NH3+])=NC=O Intermediate Fragment 
176 208.0716676001 CC(=O)C(C#[NH+])=CN(CC#CO)C(=N)O Intermediate Fragment 
177 208.0716676001 CC(O)=C=CN(CC#CO)C(=O)N=C=[NH2+] Intermediate Fragment 
178 63.0440558841 OCC[OH2+]
179 268.0927969681 CC(O)C1=CN(C=C=C(O)C(=O)C=O)C(O)N=C1[NH3+]
180 270.1084470321 CC(O)C1=CN(C(O)=C=C(O)C#CO)C(O)NC1[NH3+] Intermediate Fragment 
181 202.1186177921 C=C(O)N1C=C(C(C)O)C([NH3+])NC1O
182 200.1029677281 C=C(O)N1C=C(C(C)O)C([NH3+])=NC1O
183 194.0560175361 [CH+]=C(O)N1C=C(C(C)=O)C(N)=NC1=O
184 68.9971056921 [O+]#CC#CO
185 55.0178411361 C#CC=[OH+]
186 186.0873176641 CC(O)C1=CN(C=O)C(O)N=C1[NH3+]
187 180.0403674721 CC(=O)C1=CN(C#[O+])C(=O)N=C1N
188 71.0491412641 C=CC(=C)[OH2+]
189 71.0491412641 C#CCC[OH2+]
190 91.0753560121 CC(O)CC[OH2+]
191 73.0647913281 C=C([OH2+])CC
192 228.0978823481 CC(O)C1=CN(C(=O)C#CO)C(O)NC1[NH3+]
193 226.0822322841 CC(O)C1=CN(C(=O)C#CO)C(O)N=C1[NH3+]
194 208.0716676001 C#CC(=O)N1C=C(C(C)O)C([NH3+])=NC1=O
195 226.0822322841 CC(O)C(=CN(C=O)C(=O)C#CO)C(=N)[NH3+] Intermediate Fragment 
196 224.0665822201 CC(O)C1=CN(C(=O)C#CO)C(=O)N=C1[NH3+]
197 206.0560175361 C#CC(=O)N1C=C(C(C)=O)C([NH3+])=NC1=O
198 270.1084470321 CC(O)C1=CN(C(=C=CO)OC#CO)C(O)NC1[NH3+] Intermediate Fragment 
199 240.0978823481 C=C(OC#CO)N1C=C(C(C)O)C([NH3+])=NC1O
200 270.1084470321 CC(O)C=C([NH3+])N=C(O)N(C)C1C=C(O)C(=C=O)O1 Intermediate Fragment 
201 270.1084470321 CC(O)C=CN(C(O)N=C[NH3+])C1C=C(O)C(=C=O)O1 Intermediate Fragment 
202 202.1073844121 CC(O)CC[NH2+]C1C=C(O)C(=CO)O1
203 202.1073844121 CC(O)CC[NH2+]C(O)=C=C(O)C=CO Intermediate Fragment 
204 200.0917343481 CC(O)CC[NH2+]C1C=C(O)C(=C=O)O1
205 200.0917343481 CC(O)CC[NH2+]C(O)=C=C(O)C#CO Intermediate Fragment 
206 198.0760842841 CC(O)CC[NH+]=C1C=C(O)C(=C=O)O1
207 270.1084470321 CC(O)C(=CN(C(=N)O)C1C=C(O)C(=C=O)O1)C[NH3+] Intermediate Fragment 
208 100.0756903601 C=C(C=[NH2+])C(C)O
209 171.0400331241 NC(O)[NH+]=C1C=C(O)C(=C=O)O1
210 175.0713332521 NC(O)[NH2+]C1C=C(O)C(=CO)O1
211 183.0400331241 C[NH+](C(=N)O)C1=CC(=O)C(=C=O)O1
212 140.0342194721 C[NH+]=C1C=C(O)C(=C=O)O1
213 185.0556831881 C[NH+](C(=N)O)C1=CC(O)C(=C=O)O1
214 187.0713332521 C[NH+](C1=CC(O)C(=C=O)O1)C(N)O
215 187.0713332521 C[NH+](C=C=C(O)C(=O)C=O)C(N)O Intermediate Fragment 
216 253.0818979361 CC(O)C(C=N)=C[NH+](C=O)C1C=C(O)C(=C=O)O1
217 225.0869833161 CC(O)C(=C[NH+]=C1C=C(O)C(=C=O)O1)CN
218 270.1084470321 CC(O)C(=CN(CO)C1C=C(O)C(=C=O)O1)C(=N)[NH3+] Intermediate Fragment 
219 115.0865893921 C=C(C(N)=[NH2+])C(C)O
220 97.0760247081 C=CC(=C)C(N)=[NH2+]
221 113.0709393281 C=C(C(N)=[NH2+])C(C)=O
222 96.0443902321 C=C(C#[NH+])C(C)=O
223 95.0603746441 C#CC(=C)C(N)=[NH2+]
224 154.0134840281 O=C=C1OC(=[NH+]C=O)C=C1O
225 156.0291340921 O=C=C1OC(=[NH+]CO)C=C1O
226 138.0185694081 C=C1OC(=NC#[O+])C=C1O
227 128.0342194721 [NH3+]C1C=C(O)C(=C=O)O1
228 156.0291340921 C=C(O)C(=C=O)OC=[NH+]C=O Intermediate Fragment 
229 156.0291340921 O=CC(=O)C(O)=C=C=[NH+]CO Intermediate Fragment 
230 158.0447841561 O=C=C1OC([NH2+]CO)C=C1O
231 130.0498695361 [NH3+]C1C=C(O)C(=CO)O1
232 158.0447841561 C=C(O)C(=C=O)OC=[NH+]CO Intermediate Fragment 
233 158.0447841561 O=CC(=O)C(O)=C=C[NH2+]CO Intermediate Fragment 
234 158.0447841561 OC#CC(O)=C=C(O)[NH2+]CO Intermediate Fragment 
235 81.0447245801 [CH+]=C=C=C(N)N
236 168.0291340921 C=[N+](C=O)C1C=C(O)C(=C=O)O1
237 58.0287401681 C=[NH+]C=O
238 170.0447841561 C[NH+](C=O)C1C=C(O)C(=C=O)O1
239 142.0498695361 C[NH2+]C1C=C(O)C(=C=O)O1
240 226.0709989041 CC(O)C#C[NH+](CO)C1C=C(O)C(=C=O)O1
241 228.0866489681 CC(O)C=C[NH+](CO)C1C=C(O)C(=C=O)O1
242 242.1135324121 CC(O)C(C[NH+]=C1C=C(O)C(=C=O)O1)C(N)N
243 242.1135324121 CC(O)C(C[NH+]=C=C=C(O)C(=O)C=O)C(N)N Intermediate Fragment 
244 242.1135324121 CC(O)C(C=[NH+]C(O)=C=C(O)C#CO)C(N)N Intermediate Fragment 
245 170.0924030441 C=C(O)[NH+]=C=C(C(=N)N)C(C)O
246 168.0767529801 C=C(O)[NH+]=C=C(C(=N)N)C(C)=O
247 156.0767529801 CC(O)C(=C[NH+]=C=O)C(=N)N
248 224.1029677281 CC(O)C(=C[NH+]=C=C=C(O)C#CO)C(N)N
249 240.0978823481 CC(O)C(=C[NH+]=C1C=C(O)C(=C=O)O1)C(N)N
250 270.1084470321 CC(O)C(=CN=C1C=C(O)C(=C=O)O1)C([NH3+])NCO Intermediate Fragment 
251 141.0658539481 C=C(C(=N)[NH+]=C=O)C(C)O
252 144.0655196001 C[NH2+]C1C=C(O)C(=CO)O1
253 196.0604342201 CC(O)C=C[NH+]=C1C=C(O)C(=C=O)O1
254 223.0713332521 CC(O)C(C=N)=C[NH+]=C1C=C(O)C(=C=O)O1
255 227.1026333801 CC(O)C(CN)C[NH+]=C1C=C(O)C(=C=O)O1
256 117.1022394561 CC(O)C(C=[NH2+])CN
257 113.0709393281 CC(O)C(C#[NH+])=CN
258 227.1026333801 CC(O)C(CN)C[NH+]=C=C=C(O)C(=O)C=O Intermediate Fragment 
259 227.1026333801 CC(O)C(C=[NH+]C(O)=C=C(O)C#CO)CN Intermediate Fragment 
260 270.1084470321 C=C(C(C)O)C([NH3+])NC(O)N=C1C=C(O)C(=C=O)O1 Intermediate Fragment 
