#In-silico ESI-MS/MS [M+H]+ Spectra
#PREDICTED BY CFM-ID 4.0.8
#SMILES=[nH]1c(nc2c(c1=O)ncn2[C@@H]1O[C@H](CO)[C@@H](C1)O)NC/C=C/c1ccc2c(c1)OCO2
#InChiKey=MVXVKPVYNSBXSO-HGXOGYBISA-N
energy0
282.09855 30.89 110 104 53 (19.049 1.3748 0.0052037)
312.10912 100.00 20 107 102 115 89 112 86 59 56 69 45 98 82 99 101 70 71 75 61 (47.954 13.739 1.7256 1.3761 0.27596 0.18577 0.18467 0.14888 0.14143 0.1236 0.078155 0.043799 0.036439 0.033403 0.032132 0.028862 0.014502 0.011986 0.0037967)
energy1
99.04406 3.17 10 7 8 294 (1.2327 0.19958 0.089277 0.00015746)
161.05971 13.82 28 163 162 (5.9838 0.3896 0.26188)
266.10364 6.88 108 (3.3035)
282.09855 32.46 110 104 53 (14.002 1.4847 0.094441)
294.09855 10.26 111 103 21 (3.8665 0.87619 0.17979)
310.09347 2.47 19 55 81 68 (1.1254 0.051819 0.0033139 0.0026407)
312.10912 100.00 20 107 102 115 89 45 112 86 98 56 75 61 70 69 82 59 99 101 71 (31.056 10.272 1.5238 0.96747 0.89789 0.79384 0.53096 0.48951 0.43189 0.32426 0.13425 0.10922 0.090488 0.086681 0.076421 0.071546 0.065498 0.057423 0.016926)
energy2
59.04914 6.20 11 (0.99407)
73.02841 7.14 247 (1.1449)
75.04406 22.78 246 (3.6531)
77.03858 11.28 161 191 (1.0248 0.78436)
79.05423 12.71 180 150 (1.4316 0.60649)
81.06988 16.02 170 143 (1.8586 0.71037)
93.06988 7.47 152 (1.198)
119.04914 6.17 195 193 (0.51471 0.47417)
130.06513 9.43 310 (1.5118)
132.08078 12.18 309 (1.9531)
135.04406 18.09 41 202 (1.5595 1.3412)
144.06552 7.15 230 (1.1466)
159.04406 6.08 29 (0.97422)
161.05971 17.57 28 162 163 (1.6551 0.74739 0.414)
163.07536 9.19 27 160 (1.2486 0.22511)
164.05669 12.00 38 (1.9239)
166.07234 6.79 39 (1.0885)
176.07060 20.78 23 136 134 137 (1.1752 1.127 0.95756 0.072185)
228.08799 6.03 289 279 (0.63952 0.32812)
230.10364 11.48 290 280 (1.4159 0.42451)
242.10364 9.25 286 (1.4838)
266.10364 17.28 108 (2.771)
269.10330 9.50 57 (1.5232)
296.11420 6.28 330 2 302 (0.50293 0.34938 0.15418)
312.10912 100.00 75 20 89 45 61 107 99 102 112 69 98 82 56 71 115 86 59 101 70 (4.7067 2.2712 1.3994 1.3265 1.0502 0.97316 0.70907 0.6711 0.45727 0.38854 0.35616 0.29361 0.2813 0.26957 0.21506 0.21366 0.21299 0.14239 0.096676)
338.12477 11.20 242 (1.7964)
340.10403 25.83 291 269 278 (4.1336 0.0055483 0.0027942)
396.13025 8.39 305 312 120 (1.322 0.023263 0.00018825)
400.16155 7.08 210 122 328 (0.88547 0.16551 0.083702)
411.12991 7.22 209 218 (0.77949 0.37864)

0 428.1564598441 O=c1[nH]c([NH2+]CC=Cc2ccc3c(c2)OCO3)nc2c1ncn2C1CC(O)C(CO)O1
1 410.1458951601 O=C=C1OC(N2C=NC3=CN=C([NH+]=C=CCC4CCC5OCOC5C4)N=C32)C=C1O
2 296.1142011081 C(=C=[NH+]C1=NC=C2N=CNC2=N1)=C=C1CCC2OCOC2C1
3 119.0702706321 OC1CCOC1C[OH2+]
4 119.0702706321 O=CCC(O)CC[OH2+] Intermediate Fragment 
5 117.0546205681 OC1CCOC1=C[OH2+]
6 89.0597059481 [OH2+]C1CCOC1
7 99.0440558841 C=C1OCC=C1[OH2+]
8 99.0440558841 [OH+]=C=C1CCCO1
9 117.0546205681 CCC(O)C(=O)C=[OH+] Intermediate Fragment 
10 99.0440558841 CC=C(O)C#C[OH2+]
11 59.0491412641 CC=C[OH2+]
12 57.0334912001 CC#C[OH2+]
13 61.0284058201 OCC=[OH+]
14 117.0546205681 O=CCC(O)C=C[OH2+] Intermediate Fragment 
15 89.0597059481 CC(O)C=C[OH2+]
16 117.0546205681 OCCCOC#C[OH2+] Intermediate Fragment 
17 117.0546205681 CCOC(=C=[OH+])CO Intermediate Fragment 
18 115.0389705041 OC1CCOC1=C=[OH+]
19 310.0934656641 OC1=C2N=CNC2=NC([NH+]=C=C=C=C2C=CC3OCOC3C2)=N1
20 312.1091157281 OC1=C2N=CNC2=NC([NH+]=C=C=C=C2CCC3OCOC3C2)=N1
21 294.0985510441 C(=C=[NH+]C1=NC=C2N=CNC2=N1)=C=C1C=CC2OCOC2C1
22 178.0862550441 [NH+]#CC#CC1CCC2OCOC2C1
23 176.0706049801 [NH+]#CC#CC1=CCC2OCOC2C1
24 174.0549549161 [NH+]#CC#CC1=CC=C2OCOC2C1
25 172.0393048521 [NH+]#CC#CC1=CC=C2OCOC2=C1
26 141.0770873281 [OH2+]C1N=CN=C2NCNC21
27 163.0753560121 [CH2+]#CC=C1C=CC2OCOC2C1
28 161.0597059481 [CH2+]#CC=C1C=CC2=C(C1)OCO2
29 159.0440558841 [C+]#CC=C1C=CC2=C(C1)OCO2
30 150.0410361681 [NH3+]C1=NC(=O)C2=NC=NC2=N1
31 152.0566862321 [NH3+]C1=NC(=O)C2=NCNC2=N1
32 153.0910060761 [CH2+]#CC1CCC2OCOC2C1
33 151.0753560121 [CH2+]#CC1=CCC2OCOC2C1
34 149.0597059481 [CH2+]#CC1=CC=C2OCOC2C1
35 147.0440558841 [CH2+]#CC1=CC=C2OCOC2=C1
36 145.0284058201 [C+]#CC1=CC=C2OCOC2=C1
37 162.0410361681 C=[NH+]C1=NC(=O)C2=NC=NC2=N1
38 164.0566862321 C[NH2+]C1=NC(=O)C2=NC=NC2=N1
39 166.0723362961 C[NH2+]C1=NC(=O)C2=NCNC2=N1
40 137.0597059481 [CH3+]=C1C=CC2=C(C1)OCO2
41 135.0440558841 [CH+]=C1C=CC2=C(C1)OCO2
42 176.0566862321 CC=[NH+]C1=NC(=O)C2=NC=NC2=N1
43 188.0566862321 CC=C=[NH+]C1=NC(=O)C2=NC=NC2=N1
44 190.0723362961 CCC=[NH+]C1=NC(=O)C2=NC=NC2=N1
45 312.1091157281 N=C(N=C1NC=NC1=C=O)[NH+]=C=C=C=C1CCC2OCOC2C1 Intermediate Fragment 
46 295.0825666321 O=CC1=C([NH+]=C=NC#CC=C2C=CC3=C(C2)OCO3)NC=N1
47 201.0658539481 [NH+]#CN=C=C=C=C1C=CC2OCOC2C1
48 203.0815040121 [NH+]#CN=C=C=C=C1CCC2OCOC2C1
49 205.0971540761 [NH+]#CN=C=C=CC1CCC2OCOC2C1
50 214.0611029161 N=C(N)N=C=C=[C+]C1=CC=C2OCOC2=C1
51 216.0767529801 NC(=[NH2+])N=C=C=CC1=CC=C2OCOC2=C1
52 218.0924030441 NC(=[NH2+])N=C=C=CC1C=CC2=C(C1)OCO2
53 282.0985510441 [NH2+]=C(N=C=C=C=C1C=CC2OCOC2C1)N=C1C=NC=N1
54 284.1142011081 [NH2+]=C(N=C=C=C=C1CCC2OCOC2C1)N=C1C=NC=N1
55 310.0934656641 [NH2+]=C(N=C=C=C=C1C=CC2OCOC2C1)N=C1NC=NC1=C=O
56 312.1091157281 O=CN=C(N=C1C=NC=N1)[NH+]=C=C=C=C1CCC2OCOC2C1 Intermediate Fragment 
57 269.1033020761 C(=NC#CC=C1C=CC2OCOC2C1)=[NH+]C1=CN=CN1
58 267.0876520121 C(=NC#CC=C1C=CC2=C(C1)OCO2)=[NH+]C1=CN=CN1
59 312.1091157281 NC(=NC(=O)C1=CNC=N1)[NH+]=C=C=C=C1C=CC2OCOC2C1 Intermediate Fragment 
60 295.0825666321 O=C([NH+]=C=NC#CC=C1C=CC2=C(C1)OCO2)C1=CNC=N1
61 312.1091157281 N=C1NC=NC1=C(O)N=C=[NH+]C#CC=C1C=CC2OCOC2C1 Intermediate Fragment 
62 188.0706049801 C=[NH+]C#CC=C1C=CC2=C(C1)OCO2
63 186.0549549161 C#[N+]C#CC=C1C=CC2=C(C1)OCO2
64 231.0764186321 O=C[NH+]=C=NC#CC=C1C=CC2OCOC2C1
65 229.0607685681 O=C[NH+]=C=NC#CC=C1C=CC2=C(C1)OCO2
66 227.0451185041 [O+]#CN=C=NC#CC=C1C=CC2=C(C1)OCO2
67 110.0348881681 [NH2+]=C1N=CN=C1C=O
68 310.0934656641 N=C1NC=NC1=C(O)[NH+]=C=NC#CC=C1C=CC2=C(C1)OCO2
69 312.1091157281 NC(=O)C1=C(N=C=[NH+]C#CC=C2C=CC3OCOC3C2)NC=N1 Intermediate Fragment 
70 312.1091157281 N=C=NC1=NC([NH+]=C=C=C=C2CCC3OCOC3C2)=NC(O)=C1 Intermediate Fragment 
71 312.1091157281 N=C=NC1=C(O)N=C([NH+]=C=C=C=C2CCC3OCOC3C2)N=C1 Intermediate Fragment 
72 268.0716676001 OC1=CC=NC([NH+]=C=C=CC2=CC=C3OCOC3=C2)=N1
73 270.0873176641 OC1=CC=NC([NH+]=C=C=CC2C=CC3=C(C2)OCO3)=N1
74 285.0982166961 [NH2+]=C1C=NC(N=C=C=C=C2CCC3OCOC3C2)=NC1=O
75 312.1091157281 C=NC1=C(O)N=C([NH+]=C=C=C=C2C=CC3OCOC3C2)N=C1N Intermediate Fragment 
76 281.0669165681 NC1=NC(N=C=C=[C+]C2=CC=C3OCOC3=C2)=NC(O)=C1
77 283.0825666321 [NH3+]C1=NC(N=C=C=CC2=CC=C3OCOC3=C2)=NC(O)=C1
78 285.0982166961 [NH3+]C1=NC(N=C=C=CC2C=CC3=C(C2)OCO3)=NC(O)=C1
79 296.0778156001 NC1=NC(N=C=C=C=C2C=CC3=C(C2)OCO3)=NC(=O)C1=[NH2+]
80 295.0825666321 C=[NH+]C1=C(O)N=C(N=C=C=C=C2C=CC3=C(C2)OCO3)N=C1
81 310.0934656641 C=[NH+]C1=C(O)N=C(N=C=C=C=C2C=CC3=C(C2)OCO3)N=C1N
82 312.1091157281 C=NC1=NC([NH+]=C=C=C=C2C=CC3OCOC3C2)=NC(O)=C1N Intermediate Fragment 
83 295.0825666321 C=[NH+]C1=NC(N=C=C=C=C2C=CC3=C(C2)OCO3)=NC(O)=C1
84 283.0825666321 [NH2+]=C1C=NC(N=C=C=C=C2C=CC3OCOC3C2)=NC1=O
85 281.0669165681 [NH2+]=C1C=NC(N=C=C=C=C2C=CC3=C(C2)OCO3)=NC1=O
86 312.1091157281 C=C1OCOC1CC(C)=C=C=C=[NH+]C1=NC(O)=C2N=CNC2=N1 Intermediate Fragment 
87 226.0723362961 CC(C)=C=C=C=[NH+]C1=NC(=O)C2=NC=NC2=N1
88 224.0566862321 [CH2+]C(C)=C=C=C=NC1=NC(=O)C2=NC=NC2=N1
89 312.1091157281 C=CC(=C=C=C=[NH+]C1=NC(O)=C2N=CNC2=N1)CC1COCO1 Intermediate Fragment 
90 282.0621655361 OC1=C2N=CNC2=NC([NH+]=C=C=C=C=CC2=COCO2)=N1
91 284.0778156001 OC1=C2N=CNC2=NC([NH+]=C=C=C=CCC2=COCO2)=N1
92 286.0934656641 OC1=C2N=CNC2=NC([NH+]=C=C=C=CCC2COCO2)=N1
93 296.0778156001 [CH2+]C(=C=C=C=NC1=NC(O)=C2N=CNC2=N1)CC1=COCO1
94 240.0879863601 C=CC(C)=C=C=C=[NH+]C1=NC(O)=C2N=CNC2=N1
95 238.0723362961 C#CC(C)=C=C=C=[NH+]C1=NC(O)=C2N=CNC2=N1
96 226.0723362961 CC=C=C=C=C=[NH+]C1=NC(O)=C2N=CNC2=N1
97 224.0566862321 C=C=C=C=C=C=[NH+]C1=NC(O)=C2N=CNC2=N1
98 312.1091157281 CC(=C=C=C=[NH+]C1=NC(O)=C2N=CNC2=N1)C=CC1COCO1 Intermediate Fragment 
99 312.1091157281 CC1OCOC1CC=C=C=C=C=[NH+]C1=NC(O)=C2N=CNC2=N1 Intermediate Fragment 
100 296.0778156001 OC1=C2N=CNC2=NC([NH+]=C=C=C=C=C=CC2COCO2)=N1
101 312.1091157281 C=CC1OCOC1CC=C=C=C=[NH+]C1=NC(O)=C2N=CNC2=N1 Intermediate Fragment 
102 312.1091157281 OCOC1C=CC(=C=C=C=[NH+]C2=NC(O)=C3N=CNC3=N2)CC1 Intermediate Fragment 
103 294.0985510441 COC1=CCC(=C=C=C=[NH+]C2=NC(O)=C3N=CNC3=N2)C=C1
104 282.0985510441 OC1=C2N=CNC2=NC([NH+]=C=C=C=C2C=CC(O)CC2)=N1
105 268.1192864881 OC1=C2N=CNC2=NC([NH+]=C=C=C=C2CCCCC2)=N1
106 264.0879863601 OC1=C2N=CNC2=NC([NH+]=C=C=C=C2C=CC=CC2)=N1
107 312.1091157281 OCOC1CC=CC(=C=C=C=[NH+]C2=NC(O)=C3N=CNC3=N2)C1 Intermediate Fragment 
108 266.1036364241 OC1=C2N=CNC2=NC([NH+]=C=C=C=C2C=CCCC2)=N1
109 280.0829009801 OC1=CC=CC(=C=C=C=[NH+]C2=NC(O)=C3N=CNC3=N2)C1
110 282.0985510441 OC1=C2N=CNC2=NC([NH+]=C=C=C=C2C=CCC(O)C2)=N1
111 294.0985510441 COC1=CC=CC(=C=C=C=[NH+]C2=NC(O)=C3N=CNC3=N2)C1
112 312.1091157281 COC1CC(=C=C=C=[NH+]C2=NC(O)=C3N=CNC3=N2)C=CC1O Intermediate Fragment 
113 280.0829009801 OC1=CCC(=C=C=C=[NH+]C2=NC(O)=C3N=CNC3=N2)C=C1
114 296.0778156001 OC1=C(O)CC(=C=C=C=[NH+]C2=NC(O)=C3N=CNC3=N2)C=C1
115 312.1091157281 COC1C=CC(=C=C=C=[NH+]C2=NC(O)=C3N=CNC3=N2)CC1O Intermediate Fragment 
116 314.1247657921 OC1=C2N=CNC2=NC([NH+]=C=C=CC2CCC3OCOC3C2)=N1
117 316.1404158561 OC1=C2N=CNC2=NC([NH+]=C=CCC2CCC3OCOC3C2)=N1
118 318.1560659201 OC1=C2N=CNC2=NC([NH+]=CCCC2CCC3OCOC3C2)=N1
119 167.1066561401 [CH2+]#CCC1CCC2OCOC2C1
120 396.1302450961 OC1=COC(N2C=NC3=C(O)N=C([NH+]=C=C=C=C4CCC5OCOC5C4)N=C32)C1
121 398.1458951601 OC1=COC(N2C=NC3=C(O)N=C([NH+]=C=C=CC4CCC5OCOC5C4)N=C32)C1
122 400.1615452241 OC1=COC(N2C=NC3=C(O)N=C([NH+]=C=CCC4CCC5OCOC5C4)N=C32)C1
123 410.1458951601 C=C1OC(N2C=NC3=C(O)N=C([NH+]=C=C=CC4CCC5OCOC5C4)N=C32)C=C1O
124 410.1458951601 CC(=O)C(O)=CCN1C=NC2=C(O)N=C([NH+]=C=C=C=C3CCC4OCOC4C3)N=C21 Intermediate Fragment 
125 410.1458951601 C=C(C=O)OC(C)N1C=NC2=C(O)N=C([NH+]=C=C=C=C3CCC4OCOC4C3)N=C21 Intermediate Fragment 
126 410.1458951601 C=C1OC(N2C=NC3=C(O)N=C([NH+]=C=C=C=C4CCC(OCO)CC4)N=C32)C=C1O Intermediate Fragment 
127 362.1247657921 C=C1OC(N2C=NC3=C(O)N=C([NH+]=C=C=C=C4C=CCCC4)N=C32)C=C1O
128 410.1458951601 C=C1OC(N2C=NC3=C(O)N=C([NH+]=C=C=C=C4CCCC(OCO)C4)N=C32)C=C1O Intermediate Fragment 
129 410.1458951601 C=C1OC(N2C=NC3=C(O)N=C([NH+]=C=C=C=C4CCC(O)C(OC)C4)N=C32)C=C1O Intermediate Fragment 
130 184.1332052361 [NH2+]=CCCC1CCC2OCOC2C1
131 182.1175551721 [NH+]#CCCC1CCC2OCOC2C1
132 180.1019051081 [NH+]#CC=CC1CCC2OCOC2C1
133 178.0862550441 CC=C(C#CC#[NH+])CC1COCO1 Intermediate Fragment 
134 176.0706049801 C=C=C(C#CC#[NH+])CC1COCO1
135 178.0862550441 [NH+]#CC#CC1=CCCC(OCO)C1 Intermediate Fragment 
136 176.0706049801 [NH+]#CC#CC1=CC=CC(OCO)C1
137 176.0706049801 [NH+]#CC#CC1=CC=C(OCO)CC1 Intermediate Fragment 
138 257.1244314441 OCC1OC(N2CNC3C2=NC=NC3[OH2+])CC1O
139 169.1223062041 [CH3+]=CCC1CCC2OCOC2C1
140 169.1223062041 [CH2+]#CCC(C)CCC1COCO1 Intermediate Fragment 
141 169.1223062041 [CH2+]#CCC(CC)CC1COCO1 Intermediate Fragment 
142 95.0855267721 [CH2+]#CC=C(C)CC
143 81.0698767081 [CH2+]#CC=CCC
144 169.1223062041 [CH2+]#CCC(C)CC1OCOC1C Intermediate Fragment 
145 169.1223062041 [CH2+]#CCC1CCCC(OCO)C1 Intermediate Fragment 
146 169.1223062041 [CH2+]#CCC1CCC(O)C(OC)C1 Intermediate Fragment 
147 123.0440558841 C1=CC=C2[OH+]COC2=C1
148 43.0542266441 CC=[CH3+]
149 167.1066561401 [CH2+]#CC=CCCC1OCOC1C Intermediate Fragment 
150 79.0542266441 [CH2+]#CC#CCC
151 167.1066561401 [CH2+]#CC=C(C)CCC1COCO1 Intermediate Fragment 
152 93.0698767081 C=CC(C)=CC#[CH2+]
153 167.1066561401 [CH2+]#CC=C(CC)CC1COCO1 Intermediate Fragment 
154 167.1066561401 [CH2+]#CC=C(C)CC1OCOC1C Intermediate Fragment 
155 167.1066561401 [CH2+]#CC=C1CCC(OCO)CC1 Intermediate Fragment 
156 167.1066561401 [CH2+]#CC=C1CCCC(OCO)C1 Intermediate Fragment 
157 119.0855267721 [CH2+]#CC=C1C=CCCC1
158 167.1066561401 [CH2+]#CC=C1CCC(O)C(OC)C1 Intermediate Fragment 
159 165.0910060761 [CH2+]#CC=C1CCC2OCOC2C1
160 163.0753560121 [CH2+]#CC#CC=CC1OCOC1C Intermediate Fragment 
161 77.0385765801 C=CC#CC#[CH2+]
162 161.0597059481 [C+]#CC=C(C=C)CC1=COCO1 Intermediate Fragment 
163 161.0597059481 [CH2+]#CC=C1C=CC(OC=O)=CC1 Intermediate Fragment 
164 266.0883802841 [NH3+]C1=NC(O)=C2N=CN(C3CC(O)C(=CO)O3)C2=N1
165 268.1040303481 [NH3+]C1=NC(O)=C2N=CN(C3CC(O)C(CO)O3)C2=N1
166 250.0934656641 [NH3+]C1=NC(O)=C2N=CN(C3CCC(=CO)O3)C2=N1
167 268.1040303481 [NH3+]C1=NC(O)=C2N=CN(C(=O)CC(O)CCO)C2=N1 Intermediate Fragment 
168 155.1066561401 [CH3+]=CC1CCC2OCOC2C1
169 155.1066561401 [CH2+]#CC(C)CCC1COCO1 Intermediate Fragment 
170 81.0698767081 [CH2+]#CC(C)=CC
171 155.1066561401 [CH2+]#CC(CC)CC1COCO1 Intermediate Fragment 
172 67.0542266441 [CH2+]#CC=CC
173 85.0284058201 [CH2+]C1=COCO1
174 155.1066561401 [CH2+]#CC1CCCC(OCO)C1 Intermediate Fragment 
175 107.0855267721 [CH2+]#CC1=CCCCC1
176 155.1066561401 [CH2+]#CC1CCC(O)C(OC)C1 Intermediate Fragment 
177 153.0910060761 [CH2+]#CC=CCC1OCOC1C Intermediate Fragment 
178 153.0910060761 [CH2+]#CC(=CC)CC1COCO1 Intermediate Fragment 
179 123.0440558841 [CH2+]#CC=CC1=COCO1
180 79.0542266441 C=C=C(C)C#[CH2+]
181 65.0385765801 [CH2+]#CC#CC
182 153.0910060761 C=C(C#[CH2+])CC1OCOC1C Intermediate Fragment 
183 153.0910060761 [CH2+]#CC1=CCC(OCO)CC1 Intermediate Fragment 
184 153.0910060761 [CH2+]#CC1=CCCC(OCO)C1 Intermediate Fragment 
185 105.0698767081 [CH2+]#CC1=CC=CCC1
186 123.0804413921 C#CC1=CCCC([OH2+])C1
187 153.0910060761 [CH2+]#CC1=CCC(O)C(OC)C1 Intermediate Fragment 
188 151.0753560121 C=C=C(C#[CH2+])CC1COCO1 Intermediate Fragment 
189 149.0597059481 [CH2+]#CC=C=C=C1OCOC1C Intermediate Fragment 
190 149.0597059481 C=C=C(C#[CH2+])CC1=COCO1 Intermediate Fragment 
191 77.0385765801 C#CC(=C)C#[CH2+]
192 149.0597059481 [CH2+]#CC1=CC=C(OCO)C=C1 Intermediate Fragment 
193 119.0491412641 C#CC1=CC=C([OH2+])C=C1
194 149.0597059481 [CH2+]#CC1=CC=CC(OCO)=C1 Intermediate Fragment 
195 119.0491412641 C#CC1=CC=CC([OH2+])=C1
196 147.0440558841 [C+]#CC(=C=C)CC1=COCO1 Intermediate Fragment 
197 75.0229265161 [C+]#CC(=C)C#C
198 278.0883802841 C[NH2+]C1=NC(O)=C2N=CN(C3CC(O)C(=C=O)O3)C2=N1
199 280.1040303481 C[NH2+]C1=NC(O)=C2N=CN(C3CC(O)C(=CO)O3)C2=N1
200 282.1196804121 C[NH2+]C1=NC(O)=C2N=CN(C3CC(O)C(CO)O3)C2=N1
201 282.1196804121 C[NH2+]C1=NC(O)=C2N=CN(C(=O)CC(O)CCO)C2=N1 Intermediate Fragment 
202 135.0440558841 [CH+]=C1C=CC(=O)C(OC)=C1 Intermediate Fragment 
203 292.1040303481 CC[NH2+]C1=NC(O)=C2N=CN(C3CC(O)C(=C=O)O3)C2=N1
204 178.0723362961 CC=[NH+]C1=NC(O)=C2N=CNC2=N1
205 304.1040303481 CCC[NH2+]C1=NC(O)=C2N=CN(C3C=C(O)C(=C=O)O3)C2=N1
206 306.1196804121 CCC[NH2+]C1=NC(O)=C2N=CN(C3CC(O)C(=C=O)O3)C2=N1
207 192.0879863601 CCC=[NH+]C1=NC(O)=C2N=CNC2=N1
208 428.1564598441 N=C(N=C1C(=C=O)N=CN1C1C=C(O)C(=C=O)O1)[NH+]=CCCC1CCC2OCOC2C1 Intermediate Fragment 
209 411.1299107481 O=C=C1OC(N2C=NC(C=O)=C2[NH+]=C=NC#CCC2CCC3OCOC3C2)C=C1O
210 400.1615452241 [NH2+]=C(N=C=CCC1CCC2OCOC2C1)N=C1C=NCN1C1C=C(O)C(=C=O)O1
211 428.1564598441 O=C=C1OC(N2CN=CC2=NC(=NC=O)[NH+]=C=CCC2CCC3OCOC3C2)C=C1O Intermediate Fragment 
212 385.1506461921 O=C=C1OC(N2C=NC=C2[NH+]=C=NC=CCC2CCC3OCOC3C2)C=C1O
213 385.1506461921 O=C(C=C(O)C#CO)N1C=NC=C1[NH+]=C=NC=CCC1CCC2OCOC2C1 Intermediate Fragment 
214 383.1349961281 O=C=C1OC(N2C=NC=C2[NH+]=C=NC#CCC2CCC3OCOC3C2)C=C1O
215 381.1193460641 O=C=C1OC(N2C=NC=C2[NH+]=C=NC#CC=C2CCC3OCOC3C2)C=C1O
216 398.1458951601 [NH2+]=C(N=C=C=CC1CCC2OCOC2C1)N=C1C=NCN1C1C=C(O)C(=C=O)O1
217 428.1564598441 NC(=NC(=O)C1=CN(C2C=C(O)C(=C=O)O2)C=N1)[NH+]=C=CCC1CCC2OCOC2C1 Intermediate Fragment 
218 411.1299107481 O=C=C1OC(N2C=NC(C(=O)[NH+]=C=NC#CCC3CCC4OCOC4C3)=C2)C=C1O
219 428.1564598441 N=C1C(=C(O)N=C=[NH+]C=CCC2CCC3OCOC3C2)N=CN1C1C=C(O)C(=C=O)O1 Intermediate Fragment 
220 198.0873176641 [NH2+]=C1C=NCN1C1CC(O)C(=CO)O1
221 224.0665822201 [NH2+]=C1C(=C=O)N=CN1C1CC(O)C(=CO)O1
222 428.1564598441 NC(=O)C1=C(N=C=[NH+]C=CCC2CCC3OCOC3C2)N(C2C=C(O)C(=C=O)O2)C=N1 Intermediate Fragment 
223 428.1564598441 N=CN(C1=NC([NH+]=C=CCC2CCC3OCOC3C2)=NC(O)=C1)C1C=C(O)C(=C=O)O1 Intermediate Fragment 
224 401.1455608121 O=C=C1OC(=[NH+]C2=NC(N=CCCC3CCC4OCOC4C3)=NC(O)=C2)C=C1O
225 272.1029677281 OC1=CC=NC([NH+]=C=C=CC2C=CC3OCOC3C2)=N1
226 159.0764186321 [NH+]#CNC1CC(O)C(CO)O1
227 142.0498695361 C=[NH+]C1CC(O)C(=C=O)O1
228 159.0764186321 [NH+]#CN=C(O)CC(O)CCO Intermediate Fragment 
229 161.0920686961 [NH2+]=CNC1CC(O)C(CO)O1
230 144.0655196001 C=[NH+]C1CC(O)C(=CO)O1
231 428.1564598441 O=C=C1OC(N=C=NC2=C(O)N=C([NH+]=CCCC3CCC4OCOC4C3)N=C2)C=C1O Intermediate Fragment 
232 428.1564598441 C=NC1=C(O)N=C([NH+]=CCCC2CCC3OCOC3C2)N=C1N=C1C=C(O)C(=C=O)O1 Intermediate Fragment 
233 428.1564598441 O=CC(=O)C(O)=CCN1C=NC2=C(O)N=C([NH+]=C=CCC3CCC4OCOC4C3)N=C21 Intermediate Fragment 
234 410.1458951601 OC#CC(O)=CCN1C=NC2=C(O)N=C([NH+]=C=C=CC3CCC4OCOC4C3)N=C21
235 372.1666306041 OC#CCN1C=NC2=C(O)N=C([NH+]=CCCC3CCC4OCOC4C3)N=C21
236 370.1509805401 OC#CCN1C=NC2=C(O)N=C([NH+]=C=CCC3CCC4OCOC4C3)N=C21
237 368.1353304761 OC#CCN1C=NC2=C(O)N=C([NH+]=C=C=CC3CCC4OCOC4C3)N=C21
238 368.1353304761 CC1OCOC1CCC=C=C=C=[NH+]C1=NC(O)=C2N=CN(CC#CO)C2=N1 Intermediate Fragment 
239 366.1196804121 OC#CCN1C=NC2=C(O)N=C([NH+]=C=C=C=C3CCC4OCOC4C3)N=C21
240 340.1404158561 CCN1C=NC2=C(O)N=C([NH+]=C=C=C=C3CCC4OCOC4C3)N=C21
241 340.1404158561 CCN1C=NC2=C(O)N=C([NH+]=C=C=C=C3C=CCC(OCO)C3)N=C21 Intermediate Fragment 
242 338.1247657921 CCN1C=NC2=C(O)N=C([NH+]=C=C=C=C3C=CC4OCOC4C3)N=C21
243 336.1091157281 CCN1C=NC2=C(O)N=C([NH+]=C=C=C=C3C=CC4=C(C3)OCO4)N=C21
244 428.1564598441 C=C(O)C(=C=O)OCN1C=NC2=C(O)N=C([NH+]=C=CCC3CCC4OCOC4C3)N=C21 Intermediate Fragment 
245 428.1564598441 CC(OC(=C=O)C=O)N1C=NC2=C(O)N=C([NH+]=C=CCC3CCC4OCOC4C3)N=C21 Intermediate Fragment 
246 75.0440558841 OCC=C[OH2+]
247 73.0284058201 OCC#C[OH2+]
248 354.1196804121 CC(=O)N1C=NC2=C(O)N=C([NH+]=C=C=C=C3CCC4OCOC4C3)N=C21
249 356.1353304761 CC(=O)N1C=NC2=C(O)N=C([NH+]=C=C=CC3CCC4OCOC4C3)N=C21
250 428.1564598441 O=C=CC(OC#CO)N1C=NC2=C(O)N=C([NH+]=CCCC3CCC4OCOC4C3)N=C21 Intermediate Fragment 
251 47.0491412641 CC[OH2+]
252 384.1302450961 O=C(C#CO)N1C=NC2=C(O)N=C([NH+]=C=CCC3CCC4OCOC4C3)N=C21
253 386.1458951601 O=C(C#CO)N1C=NC2=C(O)N=C([NH+]=CCCC3CCC4OCOC4C3)N=C21
254 386.1458951601 OC#COCN1C=NC2=C(O)N=C([NH+]=C=CCC3CCC4OCOC4C3)N=C21
255 384.1302450961 OC#COCN1C=NC2=C(O)N=C([NH+]=C=C=CC3CCC4OCOC4C3)N=C21
256 428.1564598441 O=C(C=C(O)C#CO)N1C=NC2=C(O)N=C([NH+]=CCCC3CCC4OCOC4C3)N=C21 Intermediate Fragment 
257 382.1145950321 O=C(C#CO)N1C=NC2=C(O)N=C([NH+]=C=C=CC3CCC4OCOC4C3)N=C21
258 45.0334912001 C=C[OH2+]
259 360.1666306041 CC(=O)N1C=NC2=C(O)N=C([NH+]=CCCC3CCC4OCOC4C3)N=C21
260 358.1509805401 CC(=O)N1C=NC2=C(O)N=C([NH+]=C=CCC3CCC4OCOC4C3)N=C21
261 352.1040303481 CC(=O)N1C=NC2=C(O)N=C([NH+]=C=C=C=C3C=CC4OCOC4C3)N=C21
262 68.9971056921 [O+]#CC#CO
263 71.0127557561 O=CC#C[OH2+]
264 43.0178411361 C#C[OH2+]
265 77.0597059481 OCCC[OH2+]
266 344.1353304761 O=CN1C=NC2=C(O)N=C([NH+]=C=CCC3CCC4OCOC4C3)N=C21
267 342.1196804121 O=CN1C=NC2=C(O)N=C([NH+]=C=C=CC3CCC4OCOC4C3)N=C21
268 324.1091157281 CN1C=NC2=C(O)N=C([NH+]=C=C=C=C3C=CC4OCOC4C3)N=C21
269 340.1040303481 O=CN1C=NC2=C(O)N=C([NH+]=C=C=C=C3CCC4OCOC4C3)N=C21
270 338.0883802841 O=CN1C=NC2=C(O)N=C([NH+]=C=C=C=C3C=CC4OCOC4C3)N=C21
271 87.0440558841 CC(O)C#C[OH2+]
272 71.0491412641 C#CC(C)[OH2+]
273 71.0491412641 CCC#C[OH2+]
274 91.0753560121 CC(O)CC[OH2+]
275 73.0647913281 C=CC(C)[OH2+]
276 428.1564598441 CC(CC=C=[NH+]C1=NC(O)=C2N=CN(C3C=C(O)C(=C=O)O3)C2=N1)CC1OCOC1C Intermediate Fragment 
277 342.1196804121 CC(C)CC=C=[NH+]C1=NC(O)=C2N=CN(C3C=C(O)C(=C=O)O3)C2=N1
278 340.1040303481 CC(C)C=C=C=[NH+]C1=NC(O)=C2N=CN(C3C=C(O)C(=C=O)O3)C2=N1
279 228.0879863601 CC(C)C=C=C=[NH+]C1=NC(=O)C2=NC=NC2=N1
280 230.1036364241 CC(C)CC=C=[NH+]C1=NC(=O)C2=NC=NC2=N1
281 428.1564598441 CCC(CC=C=[NH+]C1=NC(O)=C2N=CN(C3C=C(O)C(=C=O)O3)C2=N1)CC1COCO1 Intermediate Fragment 
282 398.1095096521 O=C=C1OC(N2C=NC3=C(O)N=C([NH+]=C=C=CCCC4COCO4)N=C32)C=C1O
283 400.1251597161 O=C=C1OC(N2C=NC3=C(O)N=C([NH+]=C=CCCCC4COCO4)N=C32)C=C1O
284 402.1408097801 O=C=C1OC(N2C=NC3=C(O)N=C([NH+]=CCCCCC4COCO4)N=C32)C=C1O
285 356.1353304761 CCC(C)CC=C=[NH+]C1=NC(O)=C2N=CN(C3C=C(O)C(=C=O)O3)C2=N1
286 242.1036364241 CCC(C)=C=C=C=[NH+]C1=NC(O)=C2N=CNC2=N1
287 354.1196804121 CCC(C)C=C=C=[NH+]C1=NC(O)=C2N=CN(C3C=C(O)C(=C=O)O3)C2=N1
288 342.1196804121 CCCCC=C=[NH+]C1=NC(O)=C2N=CN(C3C=C(O)C(=C=O)O3)C2=N1
289 228.0879863601 CCC=C=C=C=[NH+]C1=NC(O)=C2N=CNC2=N1
290 230.1036364241 CCCC=C=C=[NH+]C1=NC(O)=C2N=CNC2=N1
291 340.1040303481 CCCC=C=C=[NH+]C1=NC(O)=C2N=CN(C3C=C(O)C(=C=O)O3)C2=N1
292 428.1564598441 CC(CC=C=[NH+]C1=NC(O)=C2N=CN(C3C=C(O)C(=C=O)O3)C2=N1)CCC1COCO1 Intermediate Fragment 
293 428.1564598441 CC1OCOC1CCCCC=C=[NH+]C1=NC(O)=C2N=CN(C3C=C(O)C(=C=O)O3)C2=N1 Intermediate Fragment 
294 99.0440558841 C=C1OCOC1=[CH3+]
295 97.0284058201 [CH+]=C1OCOC1=C
296 328.1040303481 CCCC=C=[NH+]C1=NC(O)=C2N=CN(C3C=C(O)C(=C=O)O3)C2=N1
297 330.1196804121 CCCCC=[NH+]C1=NC(O)=C2N=CN(C3C=C(O)C(=C=O)O3)C2=N1
298 412.1251597161 O=C=C1OC(N2C=NC3=C(O)N=C([NH+]=C=C=CCCCC4COCO4)N=C32)C=C1O
299 428.1564598441 CCC1OCOC1CCCC=C=[NH+]C1=NC(O)=C2N=CN(C3C=C(O)C(=C=O)O3)C2=N1 Intermediate Fragment 
300 428.1564598441 O=C=C1OC(N2C=NC3=C(O)N=C([NH+]=C=CCC4CCC(OCO)CC4)N=C32)C=C1O Intermediate Fragment 
301 410.1458951601 COC1CCC(C=C=C=[NH+]C2=NC(O)=C3N=CN(C4C=C(O)C(=C=O)O4)C3=N2)CC1
302 296.1142011081 COC1C=CC(=C=C=C=[NH+]C2=NC(O)=C3N=CNC3=N2)CC1
303 398.1458951601 O=C=C1OC(N2C=NC3=C(O)N=C([NH+]=C=CCC4CCC(O)CC4)N=C32)C=C1O
304 398.1458951601 O=C(C=C(O)C#CO)N1C=NC2=C(O)N=C([NH+]=C=CCC3CCC(O)CC3)N=C21 Intermediate Fragment 
305 396.1302450961 O=C=C1OC(N2C=NC3=C(O)N=C([NH+]=C=C=CC4CCC(O)CC4)N=C32)C=C1O
306 384.1666306041 O=C=C1OC(N2C=NC3=C(O)N=C([NH+]=CCCC4CCCCC4)N=C32)C=C1O
307 382.1509805401 O=C=C1OC(N2C=NC3=C(O)N=C([NH+]=C=CCC4CCCCC4)N=C32)C=C1O
308 380.1353304761 O=C=C1OC(N2C=NC3=C(O)N=C([NH+]=C=C=CC4CCCCC4)N=C32)C=C1O
309 132.0807757401 [NH+]#CC#CC1=CCCCC1
310 130.0651256761 [NH+]#CC#CC1=CC=CCC1
311 428.1564598441 O=C=C1OC(N2C=NC3=C(O)N=C([NH+]=C=CCC4CCCC(OCO)C4)N=C32)C=C1O Intermediate Fragment 
312 396.1302450961 O=C=C1OC(N2C=NC3=C(O)N=C([NH+]=C=C=CC4CCCC(O)C4)N=C32)C=C1O
313 398.1458951601 O=C=C1OC(N2C=NC3=C(O)N=C([NH+]=C=CCC4CCCC(O)C4)N=C32)C=C1O
314 380.1353304761 C=C1OC(N2C=NC3=C(O)N=C([NH+]=C=C=C=C4CCCC(O)C4)N=C32)C=C1O
315 148.0756903601 [NH+]#CC#CC1=CCCC(O)C1
316 146.0600402961 [NH+]#CC#CC1=CC=CC(O)C1
317 139.1117415201 C#CCC1CCCC([OH2+])C1
318 398.1458951601 O=C=C1OC(N2CN=CC2=NC(=NC=O)[NH+]=C=C=CC2CCCC(O)C2)C=C1O Intermediate Fragment 
319 398.1458951601 O=CC(=O)C(O)=CCN1C=NC2=C(O)N=C([NH+]=C=C=CC3CCCC(O)C3)N=C21 Intermediate Fragment 
320 398.1458951601 CC(OC(=C=O)C=O)N1C=NC2=C(O)N=C([NH+]=C=C=CC3CCCC(O)C3)N=C21 Intermediate Fragment 
321 398.1458951601 O=C=CC(OC#CO)N1C=NC2=C(O)N=C([NH+]=C=CCC3CCCC(O)C3)N=C21 Intermediate Fragment 
322 398.1458951601 O=C(C=C(O)C#CO)N1C=NC2=C(O)N=C([NH+]=C=CCC3CCCC(O)C3)N=C21 Intermediate Fragment 
323 380.1353304761 OC#CC(O)=CCN1C=NC2=C(O)N=C([NH+]=C=C=C=C3CCCC(O)C3)N=C21
324 356.1353304761 O=C(C#CO)N1C=NC2=C(O)N=C([NH+]=C=CCC3CCCC(O)C3)N=C21
325 354.1196804121 O=C(C#CO)N1C=NC2=C(O)N=C([NH+]=C=C=CC3CCCC(O)C3)N=C21
326 398.1458951601 CCCC(C=C=C=[NH+]C1=NC(O)=C2N=CN(C3C=C(O)C(=C=O)O3)C2=N1)CCO Intermediate Fragment 
327 398.1458951601 CC(C=C=C=[NH+]C1=NC(O)=C2N=CN(C3C=C(O)C(=C=O)O3)C2=N1)CCCCO Intermediate Fragment 
328 400.1615452241 O=C=C1OC(N2C=NC3=C(O)N=C([NH+]=CCCC4CCCC(O)C4)N=C32)C=C1O
329 410.1458951601 COC1CCCC(C=C=C=[NH+]C2=NC(O)=C3N=CN(C4C=C(O)C(=C=O)O4)C3=N2)C1
330 296.1142011081 COC1CC=CC(=C=C=C=[NH+]C2=NC(O)=C3N=CNC3=N2)C1
331 428.1564598441 COC1CC(CC=C=[NH+]C2=NC(O)=C3N=CN(C4C=C(O)C(=C=O)O4)C3=N2)CCC1O Intermediate Fragment 
332 428.1564598441 COC1CCC(CC=C=[NH+]C2=NC(O)=C3N=CN(C4C=C(O)C(=C=O)O4)C3=N2)CC1O Intermediate Fragment 
