#In-silico ESI-MS/MS [M+H]+ Spectra
#PREDICTED BY CFM-ID 4.0.8
#SMILES=[nH]1c(nc2c(c1=O)ncn2[C@@H]1O[C@H](CO)[C@@H](C1)O)/N=C\1/c2c(C(=O)C(=C1)N)cccc2
#InChiKey=HDHMRBNLSMGJSI-QUEHPHBXSA-N
energy0
290.06725 23.38 26 28 (17.654 0.050504)
307.09380 100.00 20 50 35 27 49 46 54 66 72 65 45 47 63 39 69 60 71 (74.519 0.68037 0.094756 0.094724 0.058526 0.046355 0.045949 0.043007 0.036279 0.030629 0.02343 0.023292 0.016201 0.0055842 0.0047054 0.0016294 0.0010535)
energy1
290.06725 56.19 26 28 (29.987 0.54698)
307.09380 100.00 20 27 50 54 35 65 46 49 72 60 39 69 66 45 47 63 71 (50.879 1.3652 0.56746 0.31945 0.25425 0.16451 0.15726 0.13282 0.11796 0.10687 0.072298 0.055151 0.03863 0.03361 0.029416 0.02683 0.017525)
energy2
47.04914 4.89 179 (1.3494)
57.03349 21.28 14 (5.8709)
71.04914 3.28 200 201 (0.62726 0.2781)
73.02841 6.61 170 (1.8242)
105.03349 2.80 64 (0.77161)
145.07602 7.35 96 (2.0286)
150.04104 5.52 25 (1.5231)
158.06004 4.77 24 (1.3152)
173.07094 19.64 22 95 98 93 92 99 (4.1453 0.46855 0.40777 0.17571 0.13042 0.09231)
200.08184 2.80 32 (0.77144)
250.07234 4.85 56 (1.3369)
264.08799 4.93 36 (1.3608)
267.08765 3.79 141 (1.0461)
279.09889 25.50 53 33 (6.2348 0.80203)
280.08290 4.88 48 59 (1.1568 0.19095)
281.07815 2.98 229 222 67 (0.65075 0.16397 0.0070459)
289.08324 5.36 21 (1.479)
290.06725 15.72 26 28 (3.9085 0.4289)
291.09889 6.07 107 2 (1.1237 0.54977)
305.07815 4.12 34 19 44 (0.61153 0.41432 0.11215)
307.09380 100.00 20 27 65 54 39 49 50 47 35 45 69 63 46 72 60 66 71 (8.7037 4.9553 2.6324 2.5511 1.7582 1.1813 1.086 1.0846 0.7194 0.65639 0.49313 0.40592 0.38898 0.33712 0.32304 0.19695 0.11743)
333.10945 5.25 154 173 (0.85598 0.59339)
353.13566 2.88 174 (0.79517)
354.11968 2.67 214 (0.73595)
355.15131 2.88 175 (0.79517)
363.12001 7.38 183 184 158 (0.97821 0.90454 0.15334)
367.15131 2.34 155 (0.64693)
377.09928 5.40 180 (1.49)
383.10984 2.40 240 234 (0.33268 0.32849)
395.14623 2.84 206 80 177 118 117 (0.29331 0.2605 0.19043 0.037976 0.0027289)

0 423.1411441281 NC1=CC(=[NH+]c2nc3c(ncn3C3CC(O)C(CO)O3)c(=O)[nH]2)c2ccccc2C1=O
1 405.1305794441 NC1=CC(=[NH+]C2=NC=C3N=CN(C4C=C(O)C(=C=O)O4)C3=N2)C2=C(CCCC2)C1=O
2 291.0988853921 NC1=CC([NH+]=C2N=CC3=NC=NC3=N2)C2=C(C=CC=C2)C1=O
3 119.0702706321 OC1CCOC1C[OH2+]
4 101.0597059481 C=C1OCCC1[OH2+]
5 101.0597059481 [OH2+]C=C1CCCO1
6 119.0702706321 O=CCC(O)CC[OH2+] Intermediate Fragment 
7 117.0546205681 OC=CC(O)CC=[OH+]
8 89.0597059481 [OH2+]C1CCOC1
9 99.0440558841 C=C1OCC=C1[OH2+]
10 99.0440558841 [OH+]=C=C1CCCO1
11 117.0546205681 CCC(O)C(=O)C=[OH+] Intermediate Fragment 
12 99.0440558841 CC=C(O)C#C[OH2+]
13 59.0491412641 CC=C[OH2+]
14 57.0334912001 CC#C[OH2+]
15 61.0284058201 OCC=[OH+]
16 117.0546205681 OCCCOC#C[OH2+] Intermediate Fragment 
17 117.0546205681 CCOC(=C=[OH+])CO Intermediate Fragment 
18 115.0389705041 OC1CCOC1=C=[OH+]
19 305.0781499481 NC1=CC(=[NH+]C2=NC(=O)C3=NC=NC3=N2)C2=C(C=CC=C2)C1=O
20 307.0938000121 NC1=CC(=[NH+]C2=NC(=O)C3=NC=NC3=N2)C2=C(C=CCC2)C1=O
21 289.0832353281 NC1=CC(=[N+]=C2N=CC3=NC=NC3=N2)C2=C(C=CC=C2)C1=O
22 173.0709393281 NC1=CC(=[NH2+])C2=C(C=CC=C2)C1=O
23 135.0301371361 [OH+]=C1N=CN=C2N=CN=C12
24 158.0600402961 [NH2+]=C1C=CC2=C(C=CC=C2)C1=O
25 150.0410361681 [NH3+]C1=NC(=O)C2=NC=NC2=N1
26 290.0672509161 O=C1C=CC(=[NH+]C2=NC(=O)C3=NC=NC3=N2)C2=C1C=CC=C2
27 307.0938000121 N=C(N=C1NC=NC1=C=O)[NH+]=C1C=C(N)C(=O)C2=C1C=CC=C2 Intermediate Fragment 
28 290.0672509161 N=C1C=C(N=C=NC2=C(C#[O+])N=CN2)C2=C(C=CC=C2)C1=O
29 110.0348881681 [NH2+]=C1N=CN=C1C=O
30 108.0192381041 N=C1N=CN=C1C#[O+]
31 198.0661882961 [NH+]#CN=C1C=C(N)C(=O)C2=C1C=CC=C2
32 200.0818383601 [NH+]#CN=C1C=C(N)C(=O)C2=C1CCC=C2
33 279.0988853921 NC1=CC(=NC(=[NH2+])N=C2C=NC=N2)C2=C(C=CC=C2)C1=O
34 305.0781499481 N=C(N=C1C=C(N)C(=O)C2=C1C=CC=C2)N=C1N=CN=C1C#[O+]
35 307.0938000121 NC1=CC(=[NH+]C(N=C2C=NC=N2)=NC=O)C2=C(C=CC=C2)C1=O Intermediate Fragment 
36 264.0879863601 N=C1C=C(N=C=[NH+]C2C=NC=N2)C2=C(C=CC=C2)C1=O
37 262.0723362961 N=C1C=C(N=C=[N+]=C2C=NC=N2)C2=C(C=CC=C2)C1=O
38 226.0611029161 N=C1C=C(N=C=[NH+]C=O)C2=C(C=CC=C2)C1=O
39 307.0938000121 N=C1N=CN=C1C(=O)N=C=[NH+]C1=C2C=CC=CC2=C(O)C(N)=C1 Intermediate Fragment 
40 183.0552892641 C#[N+]C1=CC(=N)C(=O)C2=C1C=CC=C2
41 125.0457872001 N=C1N=CN=C1C([NH3+])=O
42 224.0454528521 N=C1C=C(N=C=NC#[O+])C2=C(C=CC=C2)C1=O
43 82.0399735481 [NH2+]=C1C=NC=N1
44 305.0781499481 N=C1C=C(N=C=[NH+]C(=O)C2=NC=NC2=N)C2=C(C=CC=C2)C1=O
45 307.0938000121 NC(=O)C1=C(N=C=[N+]=C2C=C(N)C(=O)C3=C2C=CC=C3)NC=N1 Intermediate Fragment 
46 307.0938000121 N=C=NC1=NC([NH+]=C2C=C(N)C(=O)C3=C2C=CC=C3)=NC(O)=C1 Intermediate Fragment 
47 307.0938000121 N=C=NC1=C(O)N=C([NH+]=C2C=C(N)C(=O)C3=C2C=CC=C3)N=C1 Intermediate Fragment 
48 280.0829009801 NC1=CC(=NC2=NC(=O)C(=[NH2+])C=N2)C2=C(C=CC=C2)C1=O
49 307.0938000121 C=NC1=NC([NH+]=C2C=C(N)C(=O)C3=C2C=CC=C3)=NC(=O)C1=N Intermediate Fragment 
50 307.0938000121 N=C=CC(=[NH+]C1=NC(O)=C2N=CNC2=N1)C1=C(C=O)C=CC=C1 Intermediate Fragment 
51 275.0675852641 N=C=[C+]C(=NC1=NC(=O)C2=NC=NC2=N1)C1=CC=CC=C1
52 277.0832353281 N=C=CC(=[NH+]C1=NC(=O)C2=NC=NC2=N1)C1=CC=CC=C1
53 279.0988853921 N=C=CC(=[NH+]C1=NC(=O)C2=NC=NC2=N1)C1=CC=CCC1
54 307.0938000121 CC(=[NH+]C1=NC(O)=C2N=CNC2=N1)C1=C(C(=O)C#N)C=CC=C1 Intermediate Fragment 
55 174.0410361681 C=C=[NH+]C1=NC(=O)C2=NC=NC2=N1
56 250.0723362961 [CH2+]C(=NC1=NC(=O)C2=NC=NC2=N1)C1=CC=CC=C1
57 252.0879863601 CC(=[NH+]C1=NC(=O)C2=NC=NC2=N1)C1=CC=CC=C1
58 278.0672509161 CC(=NC1=NC(=O)C2=NC=NC2=N1)C1=C(C#[O+])C=CC=C1
59 280.0829009801 CC(=[NH+]C1=NC(=O)C2=NC=NC2=N1)C1=C(C=O)C=CC=C1
60 307.0938000121 C=C(N)C(O)=C1C=CC=CC1=C=[NH+]C1=NC(=O)C2=NC=NC2=N1 Intermediate Fragment 
61 264.0516008521 O=C=C1C=CC=CC1=C=[N+]=C1N=C2N=CN=C2C(=O)N1
62 266.0672509161 O=C=C1C=CC=CC1=C[NH+]=C1N=C2N=CN=C2C(=O)N1
63 307.0938000121 NC(=C=C=[NH+]C1=NC(O)=C2N=CNC2=N1)C(=O)C1=CC=CC=C1 Intermediate Fragment 
64 105.0334912001 [O+]#CC1=CC=CC=C1
65 307.0938000121 NC(C#[O+])=CC(=NC1=NC(O)=C2N=CNC2=N1)C1=CC=CC=C1 Intermediate Fragment 
66 307.0938000121 C=C=CC1=C(C)C(=O)C(N)=CC1=[NH+]C1=NC(=O)C2=NC=NC2=N1 Intermediate Fragment 
67 281.0781499481 C=C1C(=C)C(=[NH+]C2=NC(=O)C3=NC=NC3=N2)C=C(N)C1=O
68 267.0624998841 [CH2+]C1=CC(=NC2=NC(=O)C3=NC=NC3=N2)C=C(N)C1=O
69 307.0938000121 C=CC1=C(C=C)C(=[NH+]C2=NC(=O)C3=NC=NC3=N2)C=C(N)C1=O Intermediate Fragment 
70 277.0468498201 [C+]#CC1=CC(=NC2=NC(=O)C3=NC=NC3=N2)C=C(N)C1=O
71 307.0938000121 C=C=CC1=C(C)C(=[NH+]C2=NC(=O)C3=NC=NC3=N2)C=C(N)C1=O Intermediate Fragment 
72 307.0938000121 C=C=C=CC1=CC(=[NH+]C2=NC(O)=C3N=CNC3=N2)C=C(N)C1=O Intermediate Fragment 
73 255.0624998841 NC1=CC(=[NH+]C2=NC(=O)C3=NC=NC3=N2)C=CC1=O
74 309.1094500761 NC1=CC(=[NH+]C2=NC(=O)C3=NC=NC3=N2)C2=C(CCCC2)C1=O
75 311.1251001401 NC1CC(=[NH+]C2=NC(=O)C3=NC=NC3=N2)C2=C(CCCC2)C1=O
76 313.1407502041 NC1CC(=[NH+]C2=NC(=O)C3=NC=NC3=N2)C2=C(CCCC2)C1O
77 295.1301855201 NC1=CC2=C(CCC=C2)C(=[NH+]C2=NC(O)=C3N=CNC3=N2)C1
78 391.1149293801 NC1=CC(=[NH+]C2=NC(O)=C3N=CN(C4CC(O)=CO4)C3=N2)C2=C(C=CC=C2)C1=O
79 393.1305794441 NC1=CC(=[NH+]C2=NC(O)=C3N=CN(C4CC(O)=CO4)C3=N2)C2=C(C=CCC2)C1=O
80 395.1462295081 NC1=CC(=[NH+]C2=NC(O)=C3N=CN(C4CC(O)=CO4)C3=N2)C2=C(CCCC2)C1=O
81 405.1305794441 C=C1OC(N2C=NC3=C(O)N=C([NH+]=C4C=C(N)C(=O)C5=C4CCC=C5)N=C32)C=C1O
82 387.1200147601 C=C1C=CC(N2C=NC3=C(O)N=C([NH+]=C4C=C(N)C(=O)C5=C4C=CC=C5)N=C32)O1
83 387.1200147601 [CH+]=C1OC(N2C=NC3=C(O)N=C(N=C4CC(N)=CC5=C4C=CC=C5)N=C32)C=C1O
84 388.1040303481 C=C1OC(N2C=NC3=C(O)N=C([NH+]=C4C=CC(=O)C5=C4C=CC=C5)N=C32)C=C1O
85 405.1305794441 CC(=O)C(O)=CCN1C=NC2=C(O)N=C([NH+]=C3C=C(N)C(=O)C4=C3C=CC=C4)N=C21 Intermediate Fragment 
86 405.1305794441 C=C(C=O)OC(C)N1C=NC2=C(O)N=C([NH+]=C3C=C(N)C(=O)C4=C3C=CC=C4)N=C21 Intermediate Fragment 
87 405.1305794441 C#COC(C=C=O)N1C=NC2=C(O)N=C([NH+]=C3C=C(N)C(=O)C4=C3CCCC4)N=C21 Intermediate Fragment 
88 179.1178895201 NC1CC(=[NH2+])C2=C(CCCC2)C1=O
89 177.1022394561 NC1=CC(=[NH2+])C2=C(CCCC2)C1=O
90 160.0756903601 [NH3+]C1=CC=C2C=CC=CC2=C1O
91 175.0865893921 NC1=CC(=[NH2+])C2=C(C=CCC2)C1=O
92 173.0709393281 C=C(N)C(=O)C1=C(C#[NH+])C=CC=C1 Intermediate Fragment 
93 173.0709393281 CC(=[NH2+])C1=C(C(=O)C#N)C=CC=C1 Intermediate Fragment 
94 171.0552892641 [CH2+]C(=N)C1=C(C(=O)C#N)C=CC=C1
95 173.0709393281 N=C=CC(=[NH2+])C1=C(C=O)C=CC=C1 Intermediate Fragment 
96 145.0760247081 N=C=CC(=[NH2+])C1=CC=CC=C1
97 132.0443902321 [NH+]#CC1=C(C=O)C=CC=C1
98 173.0709393281 N=C(C=C(N)C#[O+])C1=CC=CC=C1 Intermediate Fragment 
99 173.0709393281 C=C=C=CC1=CC(=[NH2+])C=C(N)C1=O Intermediate Fragment 
100 251.0774812521 OC=C1OC(N2C=NC3=C([OH2+])N=CN=C32)CC1O
101 164.1069904881 [NH2+]=C1CCC2=C(CCCC2)C1=O
102 162.0913404241 [NH2+]=C1CCC2=C(C=CCC2)C1=O
103 160.0756903601 [NH2+]=C=CC=C1CCC=CC1=C=O Intermediate Fragment 
104 266.0883802841 [NH3+]C1=NC(O)=C2N=CN(C3CC(O)C(=CO)O3)C2=N1
105 266.0883802841 [NH3+]C1=NC(O)=C2N=CN(C(=O)CC(O)C=CO)C2=N1 Intermediate Fragment 
106 405.1305794441 NC1=CC2=C(CCC=C2)C(=[NH+]C2=NC(O)=C3N=CN(C4C=C(O)C(=C=O)O4)C3=N2)C1
107 291.0988853921 NC1=CC2=C(C=CC=C2)C(=[NH+]C2=NC(=O)C3=NC=NC3=N2)C1
108 405.1305794441 NC1=CC2=C(C=CC=C2)C(=[NH+]C2=NC(O)=C3N=CN(CC=C(O)C(=O)C=O)C3=N2)C1 Intermediate Fragment 
109 405.1305794441 NC1=CC2=C(CCC=C2)C(=[NH+]C2=NC(O)=C3N=CN(C(=O)C=C(O)C#CO)C3=N2)C1 Intermediate Fragment 
110 406.1145950321 O=C=C1OC(N2C=NC3=C(O)N=C([NH+]=C4C=CC(=O)C5=C4CCCC5)N=C32)C=C1O
111 292.0829009801 O=C1C=CC(=[NH+]C2=NC(=O)C3=NC=NC3=N2)C2=C1C=CCC2
112 406.1145950321 O=CC(=O)C(O)=CCN1C=NC2=C(O)N=C([NH+]=C3C=CC(=O)C4=C3CCC=C4)N=C21 Intermediate Fragment 
113 406.1145950321 O=C1C=CC(=[NH+]C2=NC(O)=C3N=CN(C(=O)C=C(O)C#CO)C3=N2)C2=C1CCCC2 Intermediate Fragment 
114 423.1411441281 N=C(N=C1C(=C=O)N=CN1C1C=C(O)C(=C=O)O1)[NH+]=C1CC(N)C(=O)C2=C1CCCC2 Intermediate Fragment 
115 406.1145950321 NC1=CC(N=C=[NH+]C2=C(C=O)N=CN2C2C=C(O)C(=C=O)O2)=C2CCC=CC2=C1O
116 226.0822322841 [NH2+]=C1C(=C=O)N=CN1C1CC(O)C(CO)O1
117 395.1462295081 NC1=CC(=NC(=[NH2+])N=C2C=NCN2C2C=C(O)C(=C=O)O2)C2=C(CCCC2)C1=O
118 395.1462295081 NC1=CC(=NC(=[NH2+])N=C2C=NCN2C(=O)C=C(O)C#CO)C2=C(CCCC2)C1=O Intermediate Fragment 
119 421.1254940641 NC1=CC(=NC(=[NH2+])N=C2C(=C=O)N=CN2C2C=C(O)C(=C=O)O2)C2=C(CCCC2)C1=O
120 423.1411441281 NC1=CC(=[NH+]C(=NC=O)N=C2C=NCN2C2C=C(O)C(=C=O)O2)C2=C(CCCC2)C1=O Intermediate Fragment 
121 380.1353304761 NC1=CC(N=C=[NH+]C2=CN=CN2C2C=C(O)C(=C=O)O2)=C2CCCCC2=C1O
122 380.1353304761 NC1=CC(N=C=[NH+]C2=CN=CN2C(=O)C=C(O)C#CO)=C2CCCCC2=C1O Intermediate Fragment 
123 378.1196804121 NC1=CC(N=C=[NH+]C2=CN=CN2C2C=C(O)C(=C=O)O2)=C2CCC=CC2=C1O
124 376.1040303481 NC1=CC(N=C=[NH+]C2=CN=CN2C2C=C(O)C(=C=O)O2)=C2C=CC=CC2=C1O
125 183.0764186321 OC1CC(N2C=CN=C2)OC1=C[OH2+]
126 183.0764186321 O=C(C=[OH+])C(O)CCN1C=CN=C1 Intermediate Fragment 
127 183.0764186321 O=C(CC(O)C=C[OH2+])N1C=CN=C1 Intermediate Fragment 
128 181.0607685681 OC1CC(N2C=CN=C2)OC1=C=[OH+]
129 181.0607685681 O=C(C=[OH+])C(O)=CCN1C=CN=C1 Intermediate Fragment 
130 179.0451185041 O=C1CC(N2C=CN=C2)OC1=C=[OH+]
131 393.1305794441 NC1=CC(=NC(=[NH2+])N=C2C=NCN2C2C=C(O)C(=C=O)O2)C2=C(C=CCC2)C1=O
132 423.1411441281 NC1=CC(=[NH+]C(N)=NC(=O)C2=CN(C3C=C(O)C(=C=O)O3)C=N2)C2=C(CCCC2)C1=O Intermediate Fragment 
133 423.1411441281 N=C1C(=C(O)N=C=[NH+]C2=C3CCCCC3=C(O)C(N)=C2)N=CN1C1C=C(O)C(=C=O)O1 Intermediate Fragment 
134 198.0873176641 [NH2+]=C1C=NCN1C1CC(O)C(=CO)O1
135 198.0873176641 [NH2+]=C1C=NCN1C(=O)CC(O)C=CO Intermediate Fragment 
136 423.1411441281 NC(=O)C1=C(N=C=[NH+]C2=C3CCCCC3=C(O)C(N)=C2)N(C2C=C(O)C(=C=O)O2)C=N1 Intermediate Fragment 
137 423.1411441281 N=CN(C1=NC([NH+]=C2C=C(N)C(=O)C3=C2CCCC3)=NC(O)=C1)C1C=C(O)C(=C=O)O1 Intermediate Fragment 
138 406.1145950321 C[NH+](C1=NC(N=C2C=C(N)C(=O)C3=C2C=CC=C3)=NC(O)=C1)C1C=C(O)C(=C=O)O1
139 396.1302450961 NC1CC(=NC2=NC(O)=CC([NH+]=C3C=C(O)C(=C=O)O3)=N2)C2=C(CCCC2)C1=O
140 396.1302450961 NC1=CC(=NC2=NC(O)=CC([NH+]=C(O)C=C(O)C#CO)=N2)C2=C(CCCC2)C1=O Intermediate Fragment 
141 267.0876520121 NC1=CC(=[NH+]C2=NC(O)=CC=N2)C2=C(C=CC=C2)C1=O
142 153.0294684401 [NH+]#CN=C1CC(O)C(=C=O)O1
143 43.0290745161 [NH+]#CN
144 155.0451185041 [NH+]#CN=C1CC(O)C(=CO)O1
145 157.0607685681 [NH+]#CN=C1CC(O)C(CO)O1
146 423.1411441281 NC1CC(=[NH+]C2=NC(O)=C(N=C=NC3C=C(O)C(=C=O)O3)C=N2)C2=C(CCCC2)C1=O Intermediate Fragment 
147 144.0655196001 C=[NH+]C1CC(O)C(=CO)O1
148 142.0498695361 C=[NH+]C1CC(O)C(=C=O)O1
149 423.1411441281 C=NC1=C(O)N=C([NH+]=C2CC(N)C(=O)C3=C2CCCC3)N=C1N=C1C=C(O)C(=C=O)O1 Intermediate Fragment 
150 292.0829009801 C#[N+]C1=C(O)N=C(N=C2C=C(N)C(=O)C3=C2C=CC=C3)N=C1
151 423.1411441281 NC1=CC(=[NH+]C2=NC(O)=C3N=CN(CC=C(O)C(=O)C=O)C3=N2)C2=C(CCCC2)C1=O Intermediate Fragment 
152 405.1305794441 NC1=CC(=[NH+]C2=NC(O)=C3N=CN(CC=C(O)C#CO)C3=N2)C2=C(C=CCC2)C1=O
153 387.1200147601 C#CC(O)=CCN1C=NC2=C(O)N=C([NH+]=C3C=C(N)C(=O)C4=C3C=CC=C4)N=C21
154 333.1094500761 C=CN1C=NC2=C(O)N=C([NH+]=C3C=C(N)C(=O)C4=C3C=CC=C4)N=C21
155 367.1513148881 NC1CC(=[NH+]C2=NC(O)=C3N=CN(CC#CO)C3=N2)C2=C(CCCC2)C1=O
156 365.1356648241 NC1=CC(=[NH+]C2=NC(O)=C3N=CN(CC#CO)C3=N2)C2=C(CCCC2)C1=O
157 347.1251001401 NC1=CC2=C(C=CC=C2)C(=[NH+]C2=NC(O)=C3N=CN(CC#CO)C3=N2)C1
158 363.1200147601 NC1=CC(=[NH+]C2=NC(O)=C3N=CN(CC#CO)C3=N2)C2=C(C=CCC2)C1=O
159 345.1094500761 NC1=CC2=C(C=CC=C2)C(=NC2=NC(O)=C3N=CN([CH+]C#CO)C3=N2)C1
160 319.0938000121 [CH2+]N1C=NC2=C(O)N=C(N=C3C=C(N)C(=O)C4=C3C=CC=C4)N=C21
161 361.1043646961 NC1=CC(=[NH+]C2=NC(O)=C3N=CN(CC#CO)C3=N2)C2=C(C=CC=C2)C1=O
162 339.1564002681 CCN1C=NC2=C(O)N=C([NH+]=C3C=C(N)C(=O)C4=C3CCCC4)N=C21
163 337.1407502041 CCN1C=NC2=C(O)N=C([NH+]=C3C=C(N)C(=O)C4=C3CCC=C4)N=C21
164 335.1251001401 CCN1C=NC2=C(O)N=C([NH+]=C3C=C(N)C(=O)C4=C3C=CC=C4)N=C21
165 317.1145354561 C#CN1C=NC2=C(O)N=C([NH+]=C3CC(N)=CC4=C3C=CC=C4)N=C21
166 331.0938000121 C#CN1C=NC2=C(O)N=C([NH+]=C3C=C(N)C(=O)C4=C3C=CC=C4)N=C21
167 423.1411441281 C=C(O)C(=C=O)OCN1C=NC2=C(O)N=C([NH+]=C3C=C(N)C(=O)C4=C3CCCC4)N=C21 Intermediate Fragment 
168 423.1411441281 CC(OC(=C=O)C=O)N1C=NC2=C(O)N=C([NH+]=C3C=C(N)C(=O)C4=C3CCCC4)N=C21 Intermediate Fragment 
169 75.0440558841 OCC=C[OH2+]
170 73.0284058201 OCC#C[OH2+]
171 349.1043646961 CC(=O)N1C=NC2=C(O)N=C([NH+]=C3C=C(N)C(=O)C4=C3C=CC=C4)N=C21
172 351.1200147601 CC(=O)N1C=NC2=C(O)N=C([NH+]=C3C=C(N)C(=O)C4=C3CCC=C4)N=C21
173 333.1094500761 [CH2+]C(=O)N1C=NC2=C(O)N=C(N=C3CC(N)=CC4=C3C=CC=C4)N=C21
174 353.1356648241 CC(=O)N1C=NC2=C(O)N=C([NH+]=C3C=C(N)C(=O)C4=C3CCCC4)N=C21
175 355.1513148881 CC(=O)N1C=NC2=C(O)N=C([NH+]=C3CC(N)C(=O)C4=C3CCCC4)N=C21
176 393.1305794441 CC(OC#CO)N1C=NC2=C(O)N=C([NH+]=C3C=C(N)C(=O)C4=C3CCC=C4)N=C21
177 395.1462295081 CC(OC#CO)N1C=NC2=C(O)N=C([NH+]=C3C=C(N)C(=O)C4=C3CCCC4)N=C21
178 423.1411441281 NC1CC(=[NH+]C2=NC(O)=C3N=CN(C(C=C=O)OC#CO)C3=N2)C2=C(CCCC2)C1=O Intermediate Fragment 
179 47.0491412641 CC[OH2+]
180 377.0992793161 NC1=CC(=[NH+]C2=NC(O)=C3N=CN(C(=O)C#CO)C3=N2)C2=C(C=CCC2)C1=O
181 379.1149293801 NC1=CC(=[NH+]C2=NC(O)=C3N=CN(C(=O)C#CO)C3=N2)C2=C(CCCC2)C1=O
182 381.1305794441 NC1CC(=[NH+]C2=NC(O)=C3N=CN(C(=O)C#CO)C3=N2)C2=C(CCCC2)C1=O
183 363.1200147601 C#CC(=O)N1C=NC2=C(O)N=C([NH+]=C3C=C(N)C(=O)C4=C3CCCC4)N=C21
184 363.1200147601 NC1=CC2=C(CCC=C2)C(=[NH+]C2=NC(O)=C3N=CN(C(=O)C#CO)C3=N2)C1
185 381.1305794441 NC1=CC(=[NH+]C2=NC(O)=C3N=CN(COC#CO)C3=N2)C2=C(CCCC2)C1=O
186 379.1149293801 NC1=CC(=[NH+]C2=NC(O)=C3N=CN(COC#CO)C3=N2)C2=C(C=CCC2)C1=O
187 423.1411441281 NC1CC(=[NH+]C2=NC(O)=C3N=CN(C(=O)C=C(O)C#CO)C3=N2)C2=C(CCCC2)C1=O Intermediate Fragment 
188 45.0334912001 C=C[OH2+]
189 347.0887146321 [CH2+]C(=O)N1C=NC2=C(O)N=C(N=C3C=C(N)C(=O)C4=C3C=CC=C4)N=C21
190 68.9971056921 [O+]#CC#CO
191 41.0021910721 [C+]#CO
192 71.0127557561 O=CC#C[OH2+]
193 43.0178411361 C#C[OH2+]
194 339.1200147601 NC1=CC(=[NH+]C2=NC(O)=C3N=CN(C=O)C3=N2)C2=C(CCCC2)C1=O
195 337.1043646961 NC1=CC(=[NH+]C2=NC(O)=C3N=CN(C=O)C3=N2)C2=C(C=CCC2)C1=O
196 335.0887146321 NC1=CC(=[NH+]C2=NC(O)=C3N=CN(C=O)C3=N2)C2=C(C=CC=C2)C1=O
197 333.0730645681 NC1=CC(=NC2=NC(O)=C3N=CN(C#[O+])C3=N2)C2=C(C=CC=C2)C1=O
198 87.0440558841 CC(O)C#C[OH2+]
199 89.0597059481 CC(O)C=C[OH2+]
200 71.0491412641 C#CC(C)[OH2+]
201 71.0491412641 CCC#C[OH2+]
202 91.0753560121 CC(O)CC[OH2+]
203 73.0647913281 C=CC(C)[OH2+]
204 73.0647913281 CCC=C[OH2+]
205 423.1411441281 NC=CC(=[NH+]C1=NC(O)=C2N=CN(C3C=C(O)C(=C=O)O3)C2=N1)C1=C(C=O)CCCC1 Intermediate Fragment 
206 395.1462295081 NC=CC(=[NH+]C1=NC(O)=C2N=CN(C3C=C(O)C(=C=O)O3)C2=N1)C1=CCCCC1
207 423.1411441281 CC(=[NH+]C1=NC(O)=C2N=CN(C3C=C(O)C(=C=O)O3)C2=N1)C1=C(C(=O)C=N)CCCC1 Intermediate Fragment 
208 364.1040303481 CC(=[NH+]C1=NC(O)=C2N=CN(C3C=C(O)C(=C=O)O3)C2=N1)C1=CC=CC=C1
209 366.1196804121 CC(=[NH+]C1=NC(O)=C2N=CN(C3C=C(O)C(=C=O)O3)C2=N1)C1=CC=CCC1
210 368.1353304761 CC(=[NH+]C1=NC(O)=C2N=CN(C3C=C(O)C(=C=O)O3)C2=N1)C1=CCCCC1
211 394.1145950321 CC(=[NH+]C1=NC(O)=C2N=CN(C3C=C(O)C(=C=O)O3)C2=N1)C1=C(C=O)C=CCC1
212 396.1302450961 CC(=[NH+]C1=NC(O)=C2N=CN(C3C=C(O)C(=C=O)O3)C2=N1)C1=C(C=O)CCCC1
213 423.1411441281 C=C(N)C(O)=C1CCCCC1=C=[NH+]C1=NC(O)=C2N=CN(C3C=C(O)C(=C=O)O3)C2=N1 Intermediate Fragment 
214 354.1196804121 O=C=C1OC(N2C=NC3=C(O)N=C([NH+]=C=C4CCCCC4)N=C32)CC1=O
215 423.1411441281 NC(=CC=[NH+]C1=NC(O)=C2N=CN(C3C=C(O)C(=C=O)O3)C2=N1)C(=O)C1=CCCCC1 Intermediate Fragment 
216 423.1411441281 NC(=C=O)CC(=[NH+]C1=NC(O)=C2N=CN(C3C=C(O)C(=C=O)O3)C2=N1)C1=CCCCC1 Intermediate Fragment 
217 393.1305794441 NC#CC(=[NH+]C1=NC(O)=C2N=CN(C3C=C(O)C(=C=O)O3)C2=N1)C1=CCCCC1
218 423.1411441281 CCCC1=C(C)C(=O)C(N)=CC1=[NH+]C1=NC(O)=C2N=CN(C3C=C(O)C(=C=O)O3)C2=N1 Intermediate Fragment 
219 397.1254940641 CC1=C(C)C(=[NH+]C2=NC(O)=C3N=CN(C4C=C(O)C(=C=O)O4)C3=N2)CC(N)C1=O
220 423.1411441281 CCC1=C(CC)C(=[NH+]C2=NC(O)=C3N=CN(C4C=C(O)C(=C=O)O4)C3=N2)C=C(N)C1=O Intermediate Fragment 
221 397.1254940641 CCC1=CC(=O)C(N)CC1=[NH+]C1=NC(O)=C2N=CN(C3C=C(O)C(=C=O)O3)C2=N1
222 281.0781499481 C#CC1=CC(=O)C(N)=CC1=[NH+]C1=NC(O)=C2N=CNC2=N1
223 397.1254940641 CCC1=CC(=O)C(N)CC1=[NH+]C1=NC(O)=C2N=CN(C(=O)C=C(O)C#CO)C2=N1 Intermediate Fragment 
224 407.1098440001 C=CC1=C(C)C(=O)C(N)=CC1=[NH+]C1=NC(O)=C2N=CN(C3C=C(O)C(=C=O)O3)C2=N1
225 293.0781499481 C#CC1=C(C)C(=O)C(N)=CC1=[NH+]C1=NC(=O)C2=NC=NC2=N1
226 295.0938000121 C=CC1=C(C)C(=O)C(N)=CC1=[NH+]C1=NC(=O)C2=NC=NC2=N1
227 407.1098440001 C=CC1=C(C)C(=[NH+]C2=NC(O)=C3N=CN(C4C=C(O)C(=C=O)O4)C3=N2)C=C(N)C1=O
228 397.1254940641 CCC1=CC(=[NH+]C2=NC(O)=C3N=CN(C4C=C(O)C(=C=O)O4)C3=N2)CC(N)C1=O
229 281.0781499481 C#CC1=CC(=[NH+]C2=NC(O)=C3N=CNC3=N2)C=C(N)C1=O
230 371.1098440001 NC1CC(=[NH+]C2=NC(O)=C3N=CN(C4C=C(O)C(=C=O)O4)C3=N2)C=CC1O
231 397.1254940641 CCC1=CC(=[NH+]C2=NC(O)=C3N=CN(C(=O)C=C(O)C#CO)C3=N2)CC(N)C1=O Intermediate Fragment 
232 395.1098440001 CCC1=CC(=[NH+]C2=NC(O)=C3N=CN(C4C=C(O)C(=C=O)O4)C3=N2)C=C(N)C1=O
233 423.1411441281 CCCC1=C(C)C(=[NH+]C2=NC(O)=C3N=CN(C4C=C(O)C(=C=O)O4)C3=N2)C=C(N)C1=O Intermediate Fragment 
234 383.1098440001 CC1=CC(=O)C(N)CC1=[NH+]C1=NC(O)=C2N=CN(C3C=C(O)C(=C=O)O3)C2=N1
235 423.1411441281 CCCCC1=CC(=[NH+]C2=NC(O)=C3N=CN(C4C=C(O)C(=C=O)O4)C3=N2)C=C(N)C1=O Intermediate Fragment 
236 369.0941939361 NC1CC(=[NH+]C2=NC(O)=C3N=CN(C4CC(=O)C(=C=O)O4)C3=N2)C=CC1=O
237 373.1254940641 NC1CC(=[NH+]C2=NC(O)=C3N=CN(C4CC(=O)C(=C=O)O4)C3=N2)CCC1O
238 379.0785438721 [CH2+]C1=CC(=NC2=NC(O)=C3N=CN(C4C=C(O)C(=C=O)O4)C3=N2)C=C(N)C1=O
239 381.0941939361 CC1=CC(=[NH+]C2=NC(O)=C3N=CN(C4C=C(O)C(=C=O)O4)C3=N2)C=C(N)C1=O
240 383.1098440001 CC1=CC(=[NH+]C2=NC(O)=C3N=CN(C4C=C(O)C(=C=O)O4)C3=N2)CC(N)C1=O
241 423.1411441281 CCCCC1=CC(=O)C(N)=CC1=[NH+]C1=NC(O)=C2N=CN(C3C=C(O)C(=C=O)O3)C2=N1 Intermediate Fragment 
