#In-silico ESI-MS/MS [M+H]+ Spectra
#PREDICTED BY CFM-ID 4.0.8
#SMILES=n1cnc2c(c1N)[n+]1c(n2[C@H]2C[C@H]([C@H](O2)CO)O)C(CC1C)O
#InChiKey=PKYJGIMLZFJZIR-JNORSNDXSA-N
energy0
208.11929 82.35 61 71 82 78 74 69 81 65 80 83 79 68 (32.161 0.32864 0.1858 0.16262 0.070173 0.049979 0.049272 0.032578 0.027214 0.019069 0.014956 0.0037825)
304.14042 37.18 121 132 104 123 128 136 115 118 139 124 116 129 117 165 127 135 119 120 109 (7.9172 4.3062 2.0471 0.30585 0.10349 0.083195 0.058618 0.025257 0.024445 0.021365 0.013093 0.010535 0.0080814 0.0075877 0.0051894 0.0045287 0.0028507 0.0025709 0.00071665)
322.15098 100.00 0 167 203 146 186 144 192 218 215 193 154 140 213 223 214 142 (36.067 1.6861 1.4541 0.31995 0.23626 0.15899 0.091862 0.076827 0.060164 0.016916 0.010221 0.0087127 0.0079191 0.003017 0.0014874 0.00089276)
energy1
99.04406 15.10 16 17 26 (2.1399 0.75349 0.62412)
188.09307 22.51 34 (5.2414)
190.10872 19.49 64 (4.5384)
206.10364 100.00 31 56 50 47 41 59 43 58 35 40 42 49 (20.568 1.7824 0.49127 0.19016 0.077036 0.074547 0.041774 0.025607 0.017536 0.0092168 0.0074659 0.0037519)
208.11929 46.07 61 78 81 74 80 69 83 82 79 71 68 65 (9.4792 0.45213 0.20657 0.15278 0.12204 0.089128 0.086957 0.053533 0.030563 0.024925 0.016808 0.015287)
292.14042 17.06 91 96 95 97 94 93 (3.8394 0.038963 0.0358 0.031257 0.025485 0.0024068)
294.15607 12.03 98 102 188 101 103 (2.7555 0.018156 0.010949 0.0098141 0.0080674)
304.14042 56.02 104 132 121 115 118 139 116 128 123 136 117 127 124 165 119 109 135 120 129 (4.3905 3.7208 3.4433 0.36495 0.19622 0.18197 0.18183 0.18081 0.088855 0.067593 0.058022 0.038699 0.033143 0.027889 0.02105 0.019698 0.015622 0.0082406 0.0075934)
322.15098 55.42 0 186 203 167 146 193 215 192 218 144 223 154 140 214 142 213 (11.527 0.30697 0.27263 0.20987 0.17041 0.13177 0.084902 0.083319 0.048068 0.031827 0.016677 0.0092281 0.0074406 0.0049345 0.0017389 0.00066582)
energy2
45.03349 5.54 19 (0.93389)
57.03349 6.98 10 (1.1771)
59.04914 20.04 11 (3.3808)
89.05971 5.85 149 15 (0.97277 0.013639)
96.04439 5.89 44 (0.99399)
96.05562 5.25 48 (0.88618)
98.06004 9.67 75 (1.6317)
99.04406 7.04 17 16 26 (0.55574 0.34826 0.28287)
111.06652 7.94 45 (1.34)
117.05462 11.53 20 13 25 18 24 (0.56016 0.51693 0.51213 0.19561 0.15956)
136.06177 19.40 54 (3.2727)
190.10872 12.71 64 (2.1444)
191.09274 14.47 66 62 77 (1.3271 0.86631 0.24703)
192.08799 7.68 63 (1.2948)
206.10364 29.30 31 43 47 35 50 59 42 56 41 58 40 49 (2.5032 0.92853 0.35247 0.31676 0.26864 0.15763 0.13491 0.068366 0.068007 0.059098 0.049214 0.035694)
208.11929 100.00 61 74 80 78 65 81 71 69 83 82 68 79 (7.1763 2.965 1.6378 1.3025 1.1181 0.6661 0.52366 0.41283 0.39674 0.29347 0.21796 0.15778)
210.13494 15.35 84 85 (2.3233 0.26547)
212.15059 17.67 86 88 87 (2.516 0.30494 0.16029)
214.10872 7.01 156 (1.1822)
216.08799 9.31 173 110 (0.9463 0.62454)
216.12437 6.03 158 (1.017)
218.10364 13.67 137 111 153 (2.1603 0.084385 0.060519)
225.09822 5.68 217 (0.95852)
232.11929 9.07 113 179 (0.93989 0.58968)
234.13494 5.34 157 160 159 (0.5988 0.16349 0.13833)
256.14042 5.00 198 (0.84412)
262.12985 59.48 125 163 138 (5.6488 4.1978 0.18701)
264.14550 11.62 164 (1.9608)
272.11420 6.69 90 (1.1286)
286.12985 7.69 166 114 106 134 108 (0.44361 0.31356 0.20667 0.1845 0.1491)

0 322.1509805401 CC1CC(O)C2=[N+]1C1=C(N)N=CN=C1N2C1CC(O)C(CO)O1
1 305.1244314441 CC1CC(O)C2N(C3=CC(O)=C(C[OH2+])O3)C3=NC=NC=C3N12
2 305.1244314441 CC1CC(O)C2N(C(O)=C=C(O)C=C[OH2+])C3=NC=NC=C3N12 Intermediate Fragment 
3 119.0702706321 OC1CCOC1C[OH2+]
4 101.0597059481 CC1OC=CC1[OH2+]
5 101.0597059481 [OH2+]CC1CC=CO1
6 119.0702706321 C=COC(CO)C[OH2+] Intermediate Fragment 
7 119.0702706321 OC=CC(O)CC[OH2+] Intermediate Fragment 
8 119.0702706321 C=CC(O)C(O)C[OH2+] Intermediate Fragment 
9 61.0284058201 OCC=[OH+]
10 57.0334912001 C#CC[OH2+]
11 59.0491412641 C=CC[OH2+]
12 101.0597059481 C#CC(O)CC[OH2+]
13 117.0546205681 OC1C=COC1C[OH2+]
14 87.0440558841 [OH2+]C1C=COC1
15 89.0597059481 [OH2+]C1CCOC1
16 99.0440558841 CC1=C([OH2+])C=CO1
17 99.0440558841 [OH2+]CC1=CC=CO1
18 117.0546205681 C=C(O)C(=C[OH2+])OC Intermediate Fragment 
19 45.0334912001 C=C[OH2+]
20 117.0546205681 C=COC(=CO)C[OH2+] Intermediate Fragment 
21 73.0284058201 OC#CC[OH2+]
22 75.0440558841 OC=CC[OH2+]
23 91.0389705041 OC=C([OH2+])CO
24 117.0546205681 OC=C=COCC[OH2+] Intermediate Fragment 
25 117.0546205681 OC=C=C(O)CC[OH2+] Intermediate Fragment 
26 99.0440558841 C#CC(O)=CC[OH2+]
27 115.0389705041 OC1=C(C[OH2+])OC=C1
28 204.0879863601 CC1C=C(O)C2=NC3=NC=NC([NH3+])=C3N21
29 186.0774216761 C=C1C=CC2=NC3=NC=NC([NH3+])=C3N12
30 204.0879863601 CC=C=C(O)C1=NC2=C([NH3+])N=CN=C2N1 Intermediate Fragment 
31 206.1036364241 CC1CC(O)C2=NC3=NC=NC([NH3+])=C3N21
32 189.0770873281 CC1C=C([OH2+])C2=NC3=NC=NC=C3N21
33 190.0723362961 [NH3+]C1=C2C(=NC=N1)N=C1C(O)=CCN12
34 188.0930717401 CC1C=CC2=NC3=NC=NC([NH3+])=C3N21
35 206.1036364241 CC1CC(O)C2NC(N=C=N)=C(C#[NH+])N12 Intermediate Fragment 
36 189.0770873281 C=[NH+]C1=C(C#N)N2C(=N1)C(O)=CC2C
37 179.0927373921 CC1CC(O)C2=NC(=[NH2+])C(=C=N)N21
38 164.0818383601 CC1CC(O)C2=NC=C(C#[NH+])N21
39 162.0661882961 CC1C=C(O)C2=NC=C(C#[NH+])N21
40 206.1036364241 CC1CC(O)C2NC(N=C=NC#[NH+])=CN12 Intermediate Fragment 
41 206.1036364241 C=NC([NH3+])=C1C(=N)N=C2C(O)=CC(C)N21 Intermediate Fragment 
42 206.1036364241 C=NC1=C(C(N)=[NH2+])N2C(=N1)C(O)=CC2C Intermediate Fragment 
43 206.1036364241 CC1=CC(O)=CN1C1=C([NH3+])N=CN=C1N Intermediate Fragment 
44 96.0443902321 C=C1C=C([OH2+])C=N1
45 111.0665226441 NC1=NC=NC([NH3+])=C1
46 189.0770873281 [CH2+]C1=CC(O)=CN1C1=C(N)N=CN=C1
47 206.1036364241 CC1C=C(O)C(NC2=NC=NC([NH3+])=C2)=N1 Intermediate Fragment 
48 96.0556236121 [NH3+]C1=CC=NC=N1
49 206.1036364241 CC1C=C(O)C(=N)N1C1=C([NH3+])N=CN=C1 Intermediate Fragment 
50 206.1036364241 CC(C=CO)N1C=NC2=NC=NC([NH3+])=C21 Intermediate Fragment 
51 176.0930717401 C=C(C)N1C=NC2=NC=NC([NH3+])=C21
52 162.0774216761 C=CN1C=NC2=NC=NC([NH3+])=C21
53 138.0774216761 [NH2+]=C1N=CN=C2NCNC12
54 136.0617716121 [NH2+]=C1N=CN=C2NCN=C12
55 134.0461215481 [NH2+]=C1N=CN=C2N=CN=C12
56 206.1036364241 CCC=C(O)C1=NC2=C([NH3+])N=CN=C2N1 Intermediate Fragment 
57 164.0566862321 [NH3+]C1=C2N=C(C=O)NC2=NC=N1
58 206.1036364241 C=C(O)C1=NC2=NC=NC([NH3+])=C2N1CC Intermediate Fragment 
59 206.1036364241 C=C(C)N1C(CO)=NC2=NC=NC([NH3+])=C21 Intermediate Fragment 
60 166.0723362961 [NH3+]C1=C2N=C(CO)NC2=NC=N1
61 208.1192864881 CC1CC(O)C2NC3=NC=NC([NH3+])=C3N12
62 191.0927373921 CC1CC([OH2+])C2=NC3=NC=NC=C3N21
63 192.0879863601 [NH3+]C1=C2C(=NC=N1)N=C1C(O)CCN12
64 190.1087218041 CC1CCC2=NC3=NC=NC([NH3+])=C3N21
65 208.1192864881 CC1CC(O)C2NC(N=C=N)=C(C=[NH2+])N12 Intermediate Fragment 
66 191.0927373921 C=[NH+]C1=C(C#N)N2C(=N1)C(O)CC2C
67 181.1083874561 CC1CC(O)C2NC(=[NH2+])C(=C=N)N12
68 208.1192864881 CC1CC(O)C2NC(N=C=NC=[NH2+])=CN12 Intermediate Fragment 
69 208.1192864881 C=NC([NH3+])=C1C(=N)N=C2C(O)CC(C)N21 Intermediate Fragment 
70 177.0770873281 CC1C=C(O)C2=NC(=[NH2+])C(=C=N)N21
71 208.1192864881 C=NC1=C(C(N)=[NH2+])N2C(=N1)C(O)CC2C Intermediate Fragment 
72 164.0818383601 C=[NH+]C1=CN2C(=N1)C(O)=CC2C
73 166.0974884241 C=[NH+]C1=CN2C(=N1)C(O)CC2C
74 208.1192864881 CC1CC(O)=CN1C1=C([NH3+])N=CN=C1N Intermediate Fragment 
75 98.0600402961 CC1C=C([OH2+])C=N1
76 113.0821727081 NC1=NC=NC([NH3+])C1
77 191.0927373921 CC1=CC(O)=CN1C1=C([NH3+])N=CN=C1
78 208.1192864881 CC1CC(O)C(NC2=NC=NC([NH3+])=C2)=N1 Intermediate Fragment 
79 208.1192864881 CC1CC(O)C(=N)N1C1=C([NH3+])N=CN=C1 Intermediate Fragment 
80 208.1192864881 CC(CCO)N1C=NC2=NC=NC([NH3+])=C21 Intermediate Fragment 
81 208.1192864881 CCCC(O)C1=NC2=C([NH3+])N=CN=C2N1 Intermediate Fragment 
82 208.1192864881 CCN1C(C(C)O)=NC2=NC=NC([NH3+])=C21 Intermediate Fragment 
83 208.1192864881 CC(C)N1C(CO)=NC2=NC=NC([NH3+])=C21 Intermediate Fragment 
84 210.1349365521 CC1CC(O)C2NC3=NC=NC([NH3+])C3N12
85 210.1349365521 CC(CCO)N1CNC2=NC=NC([NH3+])=C21 Intermediate Fragment 
86 212.1505866161 CC1CC(O)C2NC3NC=NC([NH3+])C3N12
87 212.1505866161 CC1CC(O)C(NC2=NC=NC([NH3+])C2)N1 Intermediate Fragment 
88 212.1505866161 CC(CCO)N1CNC2=NC=NC([NH3+])C21 Intermediate Fragment 
89 290.1247657921 CC1CC(O)C2N(C3=CC(O)=CO3)C3=NC=NC([NH3+])=C3N12
90 272.1142011081 CC1CC(O)=C2N(C3=CC=CO3)C3=NC=NC([NH3+])=C3N21
91 292.1404158561 CC1CC(O)C2N(C3=CC(O)CO3)C3=NC=NC([NH3+])=C3N12
92 274.1298511721 CC1CC(O)C2N(C3=CC=CO3)C3=NC=NC([NH3+])=C3N12
93 292.1404158561 CC1CC(O)C2N(C=C=C(O)CO)C3=NC=NC([NH3+])=C3N12 Intermediate Fragment 
94 292.1404158561 COC(=C=CO)N1C2=NC=NC([NH3+])=C2N2C(C)CC(O)C12 Intermediate Fragment 
95 292.1404158561 C=C(OC=CO)N1C2=NC=NC([NH3+])=C2N2C(C)CC(O)C12 Intermediate Fragment 
96 292.1404158561 CC(CCO)N1CN(C2=CC(O)=CO2)C2=NC=NC([NH3+])=C21 Intermediate Fragment 
97 292.1404158561 CCCC(O)C1=NC2=C([NH3+])N=CN=C2N1C1=CC(O)CO1 Intermediate Fragment 
98 294.1560659201 CC1CC(O)C2N1C1=C([NH3+])N=CN=C1N2C1CC(O)CO1
99 276.1455012361 CC1CC(O)C2N(C3=CCCO3)C3=NC=NC([NH3+])=C3N12
100 276.1455012361 CC1CCC2N(C3=CC(O)CO3)C3=NC=NC([NH3+])=C3N12
101 294.1560659201 CC1CC(O)C2N(C=CC(O)CO)C3=NC=NC([NH3+])=C3N12 Intermediate Fragment 
102 294.1560659201 CC1CC(O)C(N(C2=NC=NC([NH3+])=C2)C2CC(O)CO2)=N1 Intermediate Fragment 
103 294.1560659201 CC1CC(O)CN1C1=C([NH3+])N=CN=C1N=C1CC(O)CO1 Intermediate Fragment 
104 304.1404158561 CC1=C(O)C=C(N2C3=NC=NC([NH3+])=C3N3C(C)CC(O)C23)O1
105 103.0753560121 CC1OCCC1[OH2+]
106 286.1298511721 CC1=CC=C(N2C3=NC=NC([NH3+])=C3N3C2=C(O)CC3C)O1
107 288.1091157281 CC1=C(O)C=C(N2C3=NC=NC([NH3+])=C3N3CCC(O)=C32)O1
108 286.1298511721 CC1=C(O)C=C(N2C3=CCC(C)N3C3=C([NH3+])N=CN=C32)O1
109 304.1404158561 CC(=O)C(O)=C=CN1C2=NC=NC([NH3+])=C2N2C(C)CC(O)C12 Intermediate Fragment 
110 216.0879863601 [CH2+]N1C2=NC=NC(N)=C2N2C(C)=CC(O)=C12
111 218.1036364241 CC1=CC(O)=C2N(C)C3=NC=NC([NH3+])=C3N12
112 230.1036364241 C#CN1C2=NC=NC([NH3+])=C2N2C1=C(O)CC2C
113 232.1192864881 C#CN1C2=NC=NC([NH3+])=C2N2C(C)CC(O)C12
114 286.1298511721 C=C=C(O)C#CN1C2=NC=NC([NH3+])=C2N2C(C)CC(O)C12
115 304.1404158561 C=CC(O)=C=C(O)N1C2=NC=NC([NH3+])=C2N2C(C)CC(O)C12 Intermediate Fragment 
116 304.1404158561 C=COC(=C=CO)N1C2=NC=NC([NH3+])=C2N2C(C)CC(O)C12 Intermediate Fragment 
117 304.1404158561 CC1=C(O)C=C(N2CN(C(C)C=CO)C3=C([NH3+])N=CN=C32)O1 Intermediate Fragment 
118 304.1404158561 CCCC(O)C1=NC2=C([NH3+])N=CN=C2N1C1=CC(O)=C(C)O1 Intermediate Fragment 
119 304.1404158561 CC1=C(O)C=C(N(C2=NC=NC([NH3+])=C2)C2=NC(C)CC2O)O1 Intermediate Fragment 
120 304.1404158561 C=C1OC(=NC2=NC=NC([NH3+])=C2N2CC(O)CC2C)C=C1O Intermediate Fragment 
121 304.1404158561 CC1CC(O)C2N(C3=CC=C(CO)O3)C3=NC=NC([NH3+])=C3N12
122 103.0753560121 [OH2+]CC1CCCO1
123 304.1404158561 CC1CC(O)C2N(C(O)=C=C=CCO)C3=NC=NC([NH3+])=C3N12 Intermediate Fragment 
124 304.1404158561 C=C=C(OC=CO)N1C2=NC=NC([NH3+])=C2N2C(C)CC(O)C12 Intermediate Fragment 
125 262.1298511721 C=C=C(O)N1C2=NC=NC([NH3+])=C2N2C(C)CC(O)C12
126 246.1349365521 CC#CN1C2=NC=NC([NH3+])=C2N2C(C)CC(O)C12
127 304.1404158561 CC(CCO)N1CN(C2=CC=C(C=O)O2)C2=NC=NC([NH3+])=C21 Intermediate Fragment 
128 304.1404158561 CCCC(O)C1=NC2=C([NH3+])N=CN=C2N1C1=CC=C(CO)O1 Intermediate Fragment 
129 304.1404158561 CC1CC(O)CN1C1=C([NH3+])N=CN=C1N=C1C=CC(=CO)O1 Intermediate Fragment 
130 306.1196804121 [NH3+]C1=C2C(=NC=N1)N(C1=CC(O)=C(CO)O1)C1C(O)CCN21
131 306.1196804121 [NH3+]C1=C2C(=NC=N1)N(C(O)=C=C(O)C=CO)C1C(O)CCN21 Intermediate Fragment 
132 304.1404158561 CC1CCC2N(C3=CC(O)=C(CO)O3)C3=NC=NC([NH3+])=C3N12
133 194.1400219321 CC1CCC2NC3=NC=NC([NH3+])C3N12
134 286.1298511721 CC1CCC2N(C3=CC=C(C=O)O3)C3=NC=NC([NH3+])=C3N12
135 304.1404158561 CC1CCC2N(C=C=C(O)C(=O)CO)C3=NC=NC([NH3+])=C3N12 Intermediate Fragment 
136 304.1404158561 CC1CCC2N(C(O)=C=C(O)C=CO)C3=NC=NC([NH3+])=C3N12 Intermediate Fragment 
137 218.1036364241 CC1=CC=C2N(CO)C3=NC=NC([NH3+])=C3N12
138 262.1298511721 CC1CCC2N(C(O)=C=CO)C3=NC=NC([NH3+])=C3N12
139 304.1404158561 CC1CCC2N(C(=C=CO)OC=CO)C3=NC=NC([NH3+])=C3N12 Intermediate Fragment 
140 322.1509805401 CC1CC(O)C2N1C(C#[NH+])=C(N=C=N)N2C1CC(O)C(CO)O1 Intermediate Fragment 
141 280.1291824761 CC1CC(O)C2N(C3=CC(O)C(CO)O3)C=C(C#[NH+])N12
142 322.1509805401 CC1CC(O)C2N1C=C(N=C=NC#[NH+])N2C1CC(O)C(CO)O1 Intermediate Fragment 
143 253.1182834441 CC1CC(O)C2N(C3=CC(O)=C(C[OH2+])O3)C=CN12
144 322.1509805401 C=NC([NH3+])=C1C(=N)N(C2=CC(O)=C(CO)O2)C2C(O)CC(C)N12 Intermediate Fragment 
145 295.1400815081 CC1CC(O)C2N(C3=CC(O)C(CO)O3)C(=[NH2+])C(=C=N)N12
146 322.1509805401 C=C(O)C(=CO)OCN1C2=NC=NC([NH3+])=C2N2C(C)CC(O)C12 Intermediate Fragment 
147 238.1298511721 CC1CC(O)C2N(CO)C3=NC=NC([NH3+])=C3N12
148 236.1142011081 CC1CC(O)=C2N(CO)C3=NC=NC([NH3+])=C3N21
149 89.0597059481 C=C(O)CC[OH2+]
150 220.1192864881 CC1CC(O)=C2N(C)C3=NC=NC([NH3+])=C3N21
151 202.1087218041 CC1=CC=C2N(C)C3=NC=NC([NH3+])=C3N12
152 200.0930717401 [CH2+]N1C2=CC=C(C)N2C2=C(N)N=CN=C21
153 218.1036364241 C=C1C=C(O)C(N(C)C2=NC=NC([NH3+])=C2)=N1 Intermediate Fragment 
154 322.1509805401 CC1CC(O)C2N(C=C=C(O)C(O)CO)C3=NC=NC([NH3+])=C3N12 Intermediate Fragment 
155 212.0930717401 C#CN1C2=CC=C(C)N2C2=C([NH3+])N=CN=C21
156 214.1087218041 C#CN1C2=CCC(C)N2C2=C([NH3+])N=CN=C21
157 234.1349365521 C=CN1C2=NC=NC([NH3+])=C2N2C(C)CC(O)C12
158 216.1243718681 C#CN1C2=NC=NC([NH3+])=C2N2C(C)CCC12
159 234.1349365521 C=CN(C1=NC=NC([NH3+])=C1)C1=NC(C)CC1O Intermediate Fragment 
160 234.1349365521 C#CN1CN(C(C)CCO)C2=C([NH3+])N=CN=C21 Intermediate Fragment 
161 236.1505866161 CCN1C2=NC=NC([NH3+])=C2N2C(C)CC(O)C12
162 238.1662366801 CCN1C2=NC=NC([NH3+])C2N2C(C)CC(O)C12
163 262.1298511721 CC1CC(O)C2N(C#CCO)C3=NC=NC([NH3+])=C3N12
164 264.1455012361 CC1CC(O)C2N(C=CCO)C3=NC=NC([NH3+])=C3N12
165 304.1404158561 CC1CC(O)C2N(C#CC(O)=CCO)C3=NC=NC([NH3+])=C3N12
166 286.1298511721 CC1CC(O)C2N(C#CC#CCO)C3=NC=NC([NH3+])=C3N12
167 322.1509805401 CC1CC(O)C2N(C(O)=C=C(O)CCO)C3=NC=NC([NH3+])=C3N12 Intermediate Fragment 
168 91.0753560121 CC(O)CC[OH2+]
169 73.0647913281 C=C([OH2+])CC
170 232.0829009801 CC1=CC(O)=C2N(C=O)C3=NC=NC([NH3+])=C3N12
171 214.0723362961 CC1=CC=C2N(C#[O+])C3=NC=NC(N)=C3N12
172 234.0985510441 CC1=CC(O)=C2N(CO)C3=NC=NC([NH3+])=C3N12
173 216.0879863601 CC1=CC=C2N(C=O)C3=NC=NC([NH3+])=C3N12
174 77.0597059481 OCCC[OH2+]
175 55.0178411361 [CH2+]C#CO
176 246.0985510441 C=C(O)N1C2=NC=NC([NH3+])=C2N2C(C)=CC(O)=C12
177 248.1142011081 C=C(O)N1C2=NC=NC([NH3+])=C2N2C1=C(O)CC2C
178 250.1298511721 C=C(O)N1C2=NC=NC([NH3+])=C2N2C(C)CC(O)C12
179 232.1192864881 C=C(O)N1C2=CCC(C)N2C2=C([NH3+])N=CN=C21
180 252.1455012361 CC(O)N1C2=NC=NC([NH3+])=C2N2C(C)CC(O)C12
181 254.1611513001 CC(O)N1C2=NC=NC([NH3+])C2N2C(C)CC(O)C12
182 47.0491412641 CC[OH2+]
183 276.1091157281 CC1CC(O)C2N(C(O)=C=C=O)C3=NC=NC([NH3+])=C3N12
184 278.1247657921 CC1CC(O)C2N(C(O)=C=CO)C3=NC=NC([NH3+])=C3N12
185 280.1404158561 CC1CC(O)C2N(C(O)=CCO)C3=NC=NC([NH3+])=C3N12
186 322.1509805401 CC1CC(O)C2N(C(=C=CO)OCCO)C3=NC=NC([NH3+])=C3N12 Intermediate Fragment 
187 278.1247657921 CC1CC(O)C2N(COC#CO)C3=NC=NC([NH3+])=C3N12
188 294.1560659201 C=C(OCCO)N1C2=NC=NC([NH3+])=C2N2C(C)CC(O)C12
189 266.1611513001 CC1CC(O)C2N(CCCO)C3=NC=NC([NH3+])=C3N12
190 260.1142011081 CC1CC(O)C2N(C#CC=O)C3=NC=NC([NH3+])=C3N12
191 242.1036364241 CC1CC=C2N(C#CC=O)C3=NC=NC([NH3+])=C3N21
192 322.1509805401 C=C(OC(=CO)CO)N1C2=NC=NC([NH3+])=C2N2C(C)CC(O)C12 Intermediate Fragment 
193 322.1509805401 CC(CCO)N1CN(C2=CC(O)=C(CO)O2)C2=NC=NC([NH3+])=C21 Intermediate Fragment 
194 280.1404158561 CCN1CN(C2=CC(O)C(CO)O2)C2=NC=NC([NH3+])=C21
195 164.0930717401 CCN1C=NC2=NC=NC([NH3+])=C21
196 278.1247657921 CCN1CN(C2=CC(O)=C(CO)O2)C2=NC=NC([NH3+])=C21
197 276.1091157281 CCN1CN(C2=CC(O)=C(C=O)O2)C2=NC=NC([NH3+])=C21
198 256.1404158561 [NH3+]C1N=CN=C2C1NCN2C1CC(O)C(CO)O1
199 254.1247657921 [NH3+]C1=C2NCN(C3CC(O)C(CO)O3)C2=NC=N1
200 252.1091157281 [NH3+]C1=C2N=CN(C3CC(O)C(CO)O3)C2=NC=N1
201 252.1091157281 [NH3+]C1=C2N=CN(C=CC(O)C(O)CO)C2=NC=N1 Intermediate Fragment 
202 252.1091157281 [NH3+]C1=C2N=CN(C(O)=CC(O)CCO)C2=NC=N1 Intermediate Fragment 
203 322.1509805401 CCCC(O)C1=NC2=C([NH3+])N=CN=C2N1C1=CC(O)C(CO)O1 Intermediate Fragment 
204 75.0804413921 CCCC[OH2+]
205 57.0698767081 CCC=[CH3+]
206 73.0647913281 CCC=C[OH2+]
207 55.0542266441 [CH2+]#CCC
208 45.0698767081 CC[CH4+]
209 43.0542266441 CC=[CH3+]
210 41.0385765801 [CH2+]#CC
211 280.1040303481 [NH3+]C1=C2N=C(CO)N(C3=CC(O)C(CO)O3)C2=NC=N1
212 282.1196804121 [NH3+]C1=C2N=C(CO)N(C3CC(O)C(CO)O3)C2=NC=N1
213 322.1509805401 CCN1C2=C([NH3+])N=CN=C2N(C2=CC(O)=C(CO)O2)C1C(C)O Intermediate Fragment 
214 322.1509805401 CC(C)N1C2=C([NH3+])N=CN=C2N(C2=CC(O)=C(CO)O2)C1CO Intermediate Fragment 
215 322.1509805401 CC1CC(O)C(N(C2=CC(O)C(CO)O2)C2=NC=NC([NH3+])=C2)=N1 Intermediate Fragment 
216 227.1138667601 [NH3+]C1=CC(NC2CC(O)C(CO)O2)=NC=N1
217 225.0982166961 [NH3+]C1=CC(N=C2CC(O)C(CO)O2)=NC=N1
218 322.1509805401 CC1CC(O)CN1C1=C([NH3+])N=CN=C1N=C1C=C(O)C(CO)O1 Intermediate Fragment 
219 223.0825666321 [NH3+]C1=CC(N=C2C=C(O)C(CO)O2)=NC=N1
220 197.1396875841 CC1CC(O)CN1C1C=NC=NC1[NH3+]
221 193.1083874561 CC1CC(O)=CN1C1=C([NH3+])N=CN=C1
222 173.0821727081 [CH2+]C1=CC=CN1C1=C(N)N=CN=C1
223 322.1509805401 CC1CC(O)C(=NC2=CC(O)C(CO)O2)N1C1=C([NH3+])N=CN=C1 Intermediate Fragment 
224 320.1353304761 CC1CC(O)C2N(C3=CC(O)=C(CO)O3)C3=NC=NC([NH3+])=C3N12
