#In-silico ESI-MS/MS [M+H]+ Spectra
#PREDICTED BY CFM-ID 4.0.8
#SMILES=O1[C@H](CO)[C@@H](C[C@@H]1N1C=CC(=[N+](C1O)CCCC(=O)c1cccnc1)N)O
#InChiKey=VOPMMOLSEQXUSS-MWPGWRTMSA-O
energy0
69.03349 4.78 152 (1.1949)
80.04948 5.01 148 (1.2523)
120.04439 7.78 89 (1.9435)
122.06004 22.74 45 (5.6799)
148.07569 100.00 10 155 156 153 (24.292 0.53637 0.089303 0.057102)
231.12404 5.73 53 (1.4305)
261.13460 48.61 2 59 55 63 66 107 111 112 108 109 114 106 (9.3264 1.8566 0.72652 0.096274 0.044055 0.030783 0.019129 0.01722 0.0098092 0.0086065 0.0033251 0.0005483)
263.15025 51.28 4 82 56 52 70 81 78 60 74 64 86 76 67 (10.75 0.47915 0.32815 0.32785 0.23674 0.21031 0.18859 0.1253 0.073098 0.049478 0.02459 0.013383 0.00061811)
317.16082 4.86 202 203 199 (0.86533 0.33773 0.0096537)
331.17647 8.02 15 239 241 (1.1256 0.85205 0.025481)
349.18703 8.45 237 6 240 243 242 200 (1.3742 0.41949 0.1756 0.076326 0.041429 0.024309)
359.17138 9.79 7 13 196 147 184 12 16 14 (0.83163 0.47787 0.37142 0.29004 0.28856 0.08449 0.081436 0.018918)
377.18195 44.68 0 246 215 197 227 280 275 231 191 279 286 204 272 225 274 213 226 (8.4847 1.1513 0.50551 0.29505 0.20659 0.13279 0.1318 0.059337 0.041372 0.037397 0.034031 0.023441 0.021197 0.015032 0.010856 0.0076096 0.00064883)
energy1
69.03349 22.35 152 (2.7903)
80.04948 11.65 148 (1.4541)
99.04406 8.81 136 131 132 (0.85607 0.16864 0.075437)
106.02874 13.70 91 (1.7107)
108.04439 6.88 90 (0.85948)
120.04439 19.71 89 (2.461)
122.06004 39.07 45 (4.8771)
126.06619 6.92 40 (0.86371)
128.04948 8.15 158 (1.0177)
128.08184 18.53 23 (2.3139)
130.06513 16.00 150 (1.9978)
140.08184 21.05 25 (2.6276)
144.04439 7.77 88 (0.97039)
146.06004 39.42 35 (4.9215)
148.07569 100.00 10 153 155 156 (11.594 0.35012 0.31624 0.2241)
204.11314 8.37 69 (1.0452)
231.12404 19.97 53 (2.4926)
232.10805 14.57 85 77 (1.0776 0.74187)
233.13969 8.99 54 (1.1227)
244.10805 7.25 110 94 (0.57076 0.33454)
245.13969 11.62 33 50 (0.81064 0.63969)
246.12370 19.80 51 79 73 (1.2788 1.142 0.051072)
259.11895 10.23 8 123 119 117 120 121 118 122 (0.86362 0.086652 0.085002 0.082205 0.049965 0.044631 0.035032 0.029937)
261.13460 63.04 2 55 63 66 59 112 111 106 109 107 114 108 (4.2109 1.347 0.88187 0.49971 0.45 0.14776 0.12029 0.11111 0.04961 0.025389 0.013761 0.012878)
263.15025 37.50 4 82 60 76 67 52 81 56 64 78 74 70 86 (2.8207 0.38228 0.31004 0.20139 0.18182 0.14969 0.14724 0.13325 0.12744 0.078867 0.056654 0.054436 0.037661)
305.16082 8.93 193 (1.1152)
317.16082 8.65 202 203 199 (0.80371 0.17541 0.10077)
331.17647 23.38 15 239 241 (2.1062 0.75494 0.0581)
359.17138 17.42 196 184 147 7 16 13 12 14 (1.0794 0.48657 0.38304 0.13533 0.039767 0.026028 0.019293 0.0056212)
360.15540 7.43 277 190 (0.89984 0.027132)
energy2
45.03349 8.78 134 (0.83323)
80.04948 45.13 148 (4.2814)
99.04406 12.87 131 132 136 (0.89199 0.20314 0.1258)
101.05971 9.94 144 145 (0.48038 0.46289)
101.07094 9.45 102 (0.89655)
106.02874 10.30 91 (0.97699)
106.06513 9.15 172 (0.86837)
128.08184 25.13 23 (2.3839)
130.06513 21.74 150 (2.0625)
130.09749 16.84 41 (1.5975)
134.06004 8.62 38 (0.81735)
140.08184 15.56 25 (1.4763)
148.07569 17.51 10 156 153 155 (1.3209 0.14881 0.14748 0.044199)
154.09749 15.62 26 (1.4823)
156.11314 23.26 27 (2.2065)
163.08659 38.69 98 (3.67)
185.09207 23.41 230 (2.2204)
190.09749 8.67 233 (0.82286)
218.12879 22.06 72 (2.0923)
231.12404 68.13 53 (6.4629)
233.13969 23.26 54 (2.2067)
245.13969 100.00 33 50 (6.2609 3.2257)
246.12370 9.90 51 79 73 (0.8142 0.12106 0.0035587)
249.17099 8.99 18 28 (0.61509 0.23779)
289.16590 48.56 210 (4.6066)
291.18155 14.07 211 (1.3349)
331.17647 28.93 241 15 239 (1.3789 0.9796 0.38614)
345.15573 13.65 245 1 (1.2947 2.2318e-06)
347.17138 24.66 244 5 3 (2.3393 5.3807e-05 2.1751e-06)
359.17138 22.26 196 184 147 14 16 7 12 13 (1.5855 0.45392 0.072195 2.4005e-05 2.3446e-05 2.7012e-06 1.2998e-06 1.2779e-06)

0 377.1819463201 NC1=[N+](CCCC(=O)C2=CC=CN=C2)C(O)N(C2CC(O)C(CO)O2)C=C1
1 345.1557315721 [NH3+]C1C=CN(C2=CC(O)=CO2)C(=O)N1C#CC=C(O)C1CCCNC1
2 261.1346022041 [NH3+]C1=CC=NC(=O)N1C#CC=C(O)C1CCCNC1
3 347.1713816361 [NH3+]C1C=CN(C2=CC(O)=CO2)C(=O)N1C#CCC(O)C1CCCNC1
4 263.1502522681 [NH3+]C1=CC=NC(=O)N1C#CCC(O)C1CCCNC1
5 347.1713816361 [NH3+]C(=C=CN(C=O)C1=CC(O)=CO1)N=C=CCC(O)C1CCCNC1 Intermediate Fragment 
6 349.1870317001 [NH3+]C1C=CN(C2=CC(O)=CO2)C(=O)N1C=CCC(O)C1CCCNC1
7 359.1713816361 C=C1OC(N2C=CC([NH3+])N(C#CC=C(O)C3CCCNC3)C2=O)C=C1O
8 259.1189521401 [NH3+]C1=CC=NC(=O)N1C#CC=C(O)C1=CCCNC1
9 257.1033020761 [NH3+]C1=CC=NC(=O)N1C#CC=C(O)C1=CC=CNC1
10 148.0756903601 C#CC=C([OH2+])C1=CC=CNC1
11 341.1608169521 C=C1C=CC(N2C=CC([NH3+])N(C#CC=C(O)C3=CCCNC3)C2=O)O1
12 359.1713816361 C#COC(=C=CO)N1C=CC([NH3+])N(C#CCC(O)C2CCCNC2)C1=O Intermediate Fragment 
13 359.1713816361 C=C(CO)OC(=C)N1C=CC([NH3+])N(C#CC=C(O)C2=CCCNC2)C1=O Intermediate Fragment 
14 359.1713816361 C=C1OC(N(C=O)C=C=C([NH3+])N=C=C=CC(O)C2CCCNC2)C=C1O Intermediate Fragment 
15 331.1764670161 C=C1OC(=[NH+]C#CC(N)=NC=CCC(O)C2CCCNC2)C=C1O
16 359.1713816361 C=C1OC(=NC=C=C([NH3+])N(C#CCC(O)C2CCCNC2)C=O)C=C1O Intermediate Fragment 
17 267.1815523961 [NH3+]C1=CC=NC(=O)N1CCCC(O)C1CCCNC1
18 249.1709877121 [NH3+]C1=CC=NCN1C#CCC(O)C1CCCNC1
19 156.1382906161 C=CCC([OH2+])C1CCCNC1
20 154.1226405521 C#CCC([OH2+])C1CCCNC1
21 150.0913404241 C#CC=C([OH2+])C1=CCCNC1
22 136.0756903601 C#CC(=[OH+])C1=CCCNC1
23 128.0818383601 CN1C([NH3+])=CC=NC1O
24 130.1226405521 CC([OH2+])C1CCCNC1
25 140.0818383601 CCN1C(=O)N=CC=C1[NH3+]
26 154.0974884241 CCCN1C(=O)N=CC=C1[NH3+]
27 156.1131384881 CCCN1C([NH3+])=CC=NC1O
28 249.1709877121 [NH3+]C1=CC=NC(=O)N1C=CCCC1CCCNC1
29 267.1815523961 N=C=C=C([NH3+])N(C=O)CCCC(O)C1CCCNC1 Intermediate Fragment 
30 267.1815523961 [NH3+]C(=C=C=NC=O)NCCCC(O)C1CCCNC1 Intermediate Fragment 
31 267.1815523961 [NH3+]C=C=C=NC(O)=NCCCC(O)C1CCCNC1 Intermediate Fragment 
32 265.1659023321 [NH3+]C1=CC=NC(=O)N1C=CCC(O)C1CCCNC1
33 245.1396875841 [NH3+]C1=CC=NCN1C#CC=C(O)C1=CCCNC1
34 152.1069904881 C#CC=C([OH2+])C1CCCNC1
35 146.0600402961 C#CC=C([OH2+])C1=CC=CN=C1
36 112.0505382321 [NH3+]C1=CC=NC(O)=N1
37 114.0661882961 [NH3+]C1=CC=NC(O)N1
38 134.0600402961 C#CC(=[OH+])C1=CC=CNC1
39 132.0443902321 C#CC(=[OH+])C1=CC=CN=C1
40 126.0661882961 CN1C(=O)N=CC=C1[NH3+]
41 130.0974884241 CN1C([NH3+])CC=NC1O
42 132.1131384881 CN1C([NH3+])CCNC1O
43 128.1069904881 C=C([OH2+])C1CCCNC1
44 124.0756903601 C=C([OH2+])C1=CC=CNC1
45 122.0600402961 C=C([OH2+])C1=CC=CN=C1
46 138.0661882961 C=CN1C(=O)N=CC=C1[NH3+]
47 142.0974884241 CCN1C([NH3+])=CC=NC1O
48 152.0818383601 CC=CN1C(=O)N=CC=C1[NH3+]
49 158.1287885521 CCCN1C([NH3+])CC=NC1O
50 245.1396875841 [NH3+]C1=CC=NC(=O)N1C#CC=CC1CCCNC1
51 246.1237031721 OC(=CC#CN1C=CC=NC1=[OH+])C1CCCNC1
52 263.1502522681 N=C=C=C([NH3+])N(C#CCC(O)C1CCCNC1)C=O Intermediate Fragment 
53 231.1240375201 [NH+]#CC=C(N)N=C=C=C=C(O)C1CCCNC1
54 233.1396875841 [NH+]#CC=C(N)N=C=C=CC(O)C1CCCNC1
55 261.1346022041 [NH+]#CC=C(N)N(C#CC=C(O)C1CCCNC1)C=O
56 263.1502522681 [NH3+]C(=C=C=NC=O)N=C=CCC(O)C1CCCNC1 Intermediate Fragment 
57 216.1131384881 C#CC(N)=[NH+]C#CC=C(O)C1=CCCNC1
58 165.1022394561 [NH+]#CC#CC(O)C1CCCNC1
59 261.1346022041 NC(=C=C=[NH+]C=O)N=C=C=CC(O)C1CCCNC1
60 263.1502522681 [NH3+]C=C=C=NC(O)=NC#CCC(O)C1CCCNC1 Intermediate Fragment 
61 69.0447245801 [NH+]#CC=CN
62 193.0971540761 O=C=[NH+]C#CC=C(O)C1CCCNC1
63 261.1346022041 NC=C=C=[NH+]C(O)=NC#CC=C(O)C1CCCNC1
64 263.1502522681 C=C=NC(=O)N(C#CC=C(O)C1CCCNC1)C[NH3+] Intermediate Fragment 
65 192.1131384881 NC=[NH+]C#CC=C(O)C1=CCCNC1
66 261.1346022041 C=C=[NH+]C(=O)N(C#CC=C(O)C1=CCCNC1)CN
67 263.1502522681 C=NC(=O)N(C#CC=C(O)C1CCCNC1)C(=C)[NH3+] Intermediate Fragment 
68 202.0974884241 C=C(N)[NH+]=C=C=C=C(O)C1=CC=CNC1
69 204.1131384881 C=C(N)[NH+]=C=C=C=C(O)C1=CCCNC1
70 263.1502522681 C=C=C([NH3+])N(C#CC=C(O)C1CCCNC1)C(N)=O Intermediate Fragment 
71 208.1080531081 [NH3+]C(O)=NC#CC=C(O)C1=CCCNC1
72 218.1287885521 C#CC(N)=[NH+]C#CC=C(O)C1CCCNC1
73 246.1237031721 C#CC(N)[NH+](C#CC=C(O)C1=CCCNC1)C=O
74 263.1502522681 CCNCC(C)C(O)=CC#CN1C(=O)N=CC=C1[NH3+] Intermediate Fragment 
75 220.1080531081 CC(C)C(O)=CC#CN1C(=O)N=CC=C1[NH3+]
76 263.1502522681 CCC(CNC)C(O)=CC#CN1C(=O)N=CC=C1[NH3+] Intermediate Fragment 
77 232.1080531081 CC=C(C)C(O)=CC#CN1C(=O)N=CC=C1[NH3+]
78 263.1502522681 CCCC(CN)C(O)=CC#CN1C(=O)N=CC=C1[NH3+] Intermediate Fragment 
79 246.1237031721 CCC=C(C)C(O)=CC#CN1C(=O)N=CC=C1[NH3+]
80 234.1237031721 CCCCC(O)=CC#CN1C(=O)N=CC=C1[NH3+]
81 263.1502522681 CC(CCCN)C(O)=CC#CN1C(=O)N=CC=C1[NH3+] Intermediate Fragment 
82 263.1502522681 CNCCCCC(O)=CC#CN1C(=O)N=CC=C1[NH3+] Intermediate Fragment 
83 196.1080531081 CC(O)CC=CN1C(=O)N=CC=C1[NH3+]
84 222.1237031721 CCCC(O)CC#CN1C(=O)N=CC=C1[NH3+]
85 232.1080531081 CCC=CC(O)=CC#CN1C(=O)N=CC=C1[NH3+]
86 263.1502522681 CCCNCCC(O)=CC#CN1C(=O)N=CC=C1[NH3+] Intermediate Fragment 
87 243.1240375201 [NH3+]C1=CC=NCN1C#CC=C(O)C1=CC=CNC1
88 144.0443902321 [C+]#CC=C(O)C1=CC=CN=C1
89 120.0443902321 [CH+]=C(O)C1=CC=CN=C1
90 108.0443902321 [OH+]=CC1=CC=CN=C1
91 106.0287401681 [O+]#CC1=CC=CN=C1
92 243.1240375201 [NH3+]C1=CC=NC(=O)N1C#CC#CC1CCCNC1
93 182.0924030441 [NH3+]C1=CC=NC(=O)N1C=CCCO
94 244.1080531081 OC(=CC#CN1C=CC=NC1=[OH+])C1=CCCNC1
95 214.0974884241 C#CC(N)=[NH+]C#CC=C(O)C1=CC=CNC1
96 206.1287885521 C=C(N)[NH+]=C=C=C=C(O)C1CCCNC1
97 167.1178895201 [NH+]#CC=CC(O)C1CCCNC1
98 163.0865893921 [NH+]#CC#CC(=O)C1CCCNC1
99 161.0709393281 [NH+]#CC#CC(=O)C1=CCCNC1
100 159.0552892641 [NH+]#CC#CC(=O)C1=CC=CNC1
101 99.0552892641 NC=C=C=[NH+]CO
102 101.0709393281 NCC=C=[NH+]CO
103 229.1083874561 [NH+]#CC=C(N)N=C=C=C=C(O)C1=CCCNC1
104 71.0603746441 [NH+]#CCCN
105 191.0815040121 O=C=[NH+]C#CC=C(O)C1=CCCNC1
106 261.1346022041 C=NC(=O)N(C#CC=C(O)C1=CCCNC1)C(=C)[NH3+] Intermediate Fragment 
107 261.1346022041 C=C=C([NH3+])N(C#CC=C(O)C1=CCCNC1)C(N)=O Intermediate Fragment 
108 261.1346022041 C=C(CNCC)C(O)=CC#CN1C(=O)N=CC=C1[NH3+] Intermediate Fragment 
109 261.1346022041 CCC=C(CN)C(O)=CC#CN1C(=O)N=CC=C1[NH3+] Intermediate Fragment 
110 244.1080531081 CC=C=C(C)C(O)=CC#CN1C(=O)N=CC=C1[NH3+]
111 261.1346022041 CC(=CCCN)C(O)=CC#CN1C(=O)N=CC=C1[NH3+] Intermediate Fragment 
112 261.1346022041 CNCCC=CC(O)=CC#CN1C(=O)N=CC=C1[NH3+] Intermediate Fragment 
113 230.0924030441 CCC#CC(O)=CC#CN1C(=O)N=CC=C1[NH3+]
114 261.1346022041 C=CCNCCC(O)=CC#CN1C(=O)N=CC=C1[NH3+] Intermediate Fragment 
115 241.1083874561 [NH3+]C1=CC=NC(=O)N1C#CC#CC1=CCCNC1
116 242.0924030441 OC(=CC#CN1C=CC=NC1=[OH+])C1=CC=CNC1
117 259.1189521401 N=C=C=C([NH3+])N(C#CC=C(O)C1=CCCNC1)C=O Intermediate Fragment 
118 259.1189521401 [NH3+]C(=C=C=NC=O)N=C=C=C=C(O)C1CCCNC1 Intermediate Fragment 
119 259.1189521401 [NH3+]C=C=C=NC(O)=NC#CC=C(O)C1=CCCNC1 Intermediate Fragment 
120 259.1189521401 C=C=NC(=O)N(C#CC=C(O)C1=CC=CNC1)C[NH3+] Intermediate Fragment 
121 259.1189521401 CC=C=C(CN)C(O)=CC#CN1C(=O)N=CC=C1[NH3+] Intermediate Fragment 
122 259.1189521401 CC(=C=CCN)C(O)=CC#CN1C(=O)N=CC=C1[NH3+] Intermediate Fragment 
123 259.1189521401 CNCC=C=CC(O)=CC#CN1C(=O)N=CC=C1[NH3+] Intermediate Fragment 
124 111.0076703761 O=C1C=COC1=C=[OH+]
125 113.0233204401 OC1C=COC1=C=[OH+]
126 115.0389705041 OC1CCOC1=C=[OH+]
127 87.0440558841 [OH2+]C1=COCC1
128 115.0389705041 CC=C(O)C(=O)C=[OH+] Intermediate Fragment 
129 117.0546205681 OC1CCOC1=C[OH2+]
130 89.0597059481 [OH2+]C1CCOC1
131 99.0440558841 C=C1OCC=C1[OH2+]
132 99.0440558841 [OH+]=C=C1CCCO1
133 117.0546205681 OCCC(O)C#C[OH2+] Intermediate Fragment 
134 45.0334912001 C=C[OH2+]
135 89.0597059481 CC(O)C=C[OH2+]
136 99.0440558841 CC=C(O)C#C[OH2+]
137 117.0546205681 OCCCOC#C[OH2+] Intermediate Fragment 
138 117.0546205681 CCOC(=C=[OH+])CO Intermediate Fragment 
139 117.0546205681 CCC(O)C(=O)C=[OH+] Intermediate Fragment 
140 59.0491412641 CC=C[OH2+]
141 57.0334912001 CC#C[OH2+]
142 61.0284058201 OCC=[OH+]
143 119.0702706321 OC1CCOC1C[OH2+]
144 101.0597059481 C=C1OCCC1[OH2+]
145 101.0597059481 [OH2+]C=C1CCCO1
146 119.0702706321 OCCC(O)C=C[OH2+] Intermediate Fragment 
147 359.1713816361 [NH3+]C1C=CN(C2C=C(O)C(=C=O)O2)CN1C#CC=C(O)C1CCCNC1
148 80.0494756121 C1=CC=[NH+]C=C1
149 43.0542266441 CC=[CH3+]
150 130.0651256761 [CH2+]#CC#CC1=CC=CNC1
151 82.0651256761 C1=CC[NH2+]C=C1
152 69.0334912001 C#CC=C[OH2+]
153 148.0756903601 C#CC=C([OH2+])C=C=C=CNC Intermediate Fragment 
154 121.0647913281 C#CC=C([OH2+])C#CCC
155 148.0756903601 C#CC=C([OH2+])C(=C=C=C)CN Intermediate Fragment 
156 148.0756903601 C#CC=C([OH2+])CCN=C=C=C Intermediate Fragment 
157 95.0491412641 C#CC=C([OH2+])C=C
158 128.0494756121 [CH2+]#CC#CC1=CC=CN=C1
159 226.0822322841 [NH3+]C1C=CN(C2C=C(O)C(=C=O)O2)C(O)N1
160 228.0978823481 [NH3+]C1CCN(C2C=C(O)C(=C=O)O2)C(O)N1
161 230.1135324121 [NH3+]C1CCN(C2CC(O)C(=C=O)O2)C(O)N1
162 230.1135324121 [NH3+]C1CCN(C(O)C=C(O)C#CO)C(O)N1 Intermediate Fragment 
163 230.1135324121 [NH3+]C1CCN(CC=C(O)C(=O)C=O)C(O)N1 Intermediate Fragment 
164 232.1291824761 [NH3+]C1CCN(C2CC(O)C(=CO)O2)C(O)N1
165 240.0978823481 CN1C([NH3+])C=CN(C2C=C(O)C(=C=O)O2)C1O
166 242.1135324121 CN1C([NH3+])CCN(C2C=C(O)C(=C=O)O2)C1O
167 244.1291824761 CN1C([NH3+])CCN(C2CC(O)C(=C=O)O2)C1O
168 244.1291824761 CN1C([NH3+])CCN(C(O)C=C(O)C#CO)C1O Intermediate Fragment 
169 244.1291824761 CN1C([NH3+])CCN(CC=C(O)C(=O)C=O)C1O Intermediate Fragment 
170 246.1448325401 CN1C([NH3+])CCN(C2CC(O)C(=CO)O2)C1O
171 126.0913404241 C=C([OH2+])C1=CCCNC1
172 106.0651256761 [CH2+]#CC1=CC=CNC1
173 254.1135324121 CCN1C([NH3+])C=CN(C2C=C(O)C(=C=O)O2)C1O
174 256.1291824761 CCN1C([NH3+])CCN(C2C=C(O)C(=C=O)O2)C1O
175 264.0978823481 CC=CN1C(=O)N(C2C=C(O)C(=C=O)O2)C=CC1[NH3+]
176 266.1135324121 CCCN1C(=O)N(C2C=C(O)C(=C=O)O2)C=CC1[NH3+]
177 268.1291824761 CCCN1C([NH3+])C=CN(C2C=C(O)C(=C=O)O2)C1O
178 268.1291824761 CCCN1C([NH3+])C=CN(C=C=C(O)C(=O)C=O)C1O Intermediate Fragment 
179 270.1448325401 CCCN1C([NH3+])CCN(C2C=C(O)C(=C=O)O2)C1O
180 272.1604826041 CCCN1C([NH3+])CCN(C2CC(O)C(=C=O)O2)C1O
181 272.1604826041 CCCN1C([NH3+])CCN(C(O)C=C(O)C#CO)C1O Intermediate Fragment 
182 272.1604826041 CCCN1C([NH3+])CCN(CC=C(O)C(=O)C=O)C1O Intermediate Fragment 
183 272.1604826041 CCCNC([NH3+])CCN(CO)C1C=C(O)C(=C=O)O1 Intermediate Fragment 
184 359.1713816361 [NH3+]C1C=CN(C2C=C(O)C(=C=O)O2)C(=O)N1C#CCCC1CCCNC1
185 292.0927969681 [NH3+]C1C=CN(C2C=C(O)C(=C=O)O2)C(=O)N1C#CCCO
186 294.1084470321 [NH3+]C1C=CN(C2C=C(O)C(=C=O)O2)C(=O)N1C=CCCO
187 184.1080531081 [NH3+]C1=CC=NC(=O)N1CCCCO
188 296.1240970961 [NH3+]C1C=CN(C2C=C(O)C(=C=O)O2)C(=O)N1CCCCO
189 298.1397471601 [NH3+]C1C=CN(C2C=C(O)C(=C=O)O2)C(O)N1CCCCO
190 360.1553972241 O=C1N(C#CCC(O)C2CCCNC2)CC=CN1C1C=C(O)C(=C=[OH+])O1
191 377.1819463201 [NH3+]C1C=CN(C(O)=C=C(O)C#CO)C(=O)N1C=CCC(O)C1CCCNC1 Intermediate Fragment 
192 333.1557315721 [NH3+]C1C=CN(C(O)C#CO)C(=O)N1C#CC=C(O)C1CCCNC1
193 305.1608169521 C=C(O)N1C=CC([NH3+])N(C#CC=C(O)C2CCCNC2)C1=O
194 75.0440558841 OCC=C[OH2+]
195 291.1451668881 [NH3+]C1C=CN(CO)C(=O)N1C#CC=C(O)C1=CCCNC1
196 359.1713816361 [NH3+]C1C=CN(C=C=C(O)C#CO)C(=O)N1C#CCC(O)C1CCCNC1
197 377.1819463201 [NH3+]C1C=CN(C(=C=CO)OC#CO)C(=O)N1C=CCC(O)C1CCCNC1 Intermediate Fragment 
198 335.1713816361 [NH3+]C1C=CN(C(O)C#CO)C(=O)N1C#CCC(O)C1CCCNC1
199 317.1608169521 C#CC(O)N1C=CC([NH3+])N(C#CC=C(O)C2CCCNC2)C1=O
200 349.1870317001 C=C(OC#CO)N1C=CC([NH3+])N(C=CCC(O)C2CCCNC2)C1=O
201 63.0440558841 OCC[OH2+]
202 317.1608169521 [NH3+]C1C=CN(CC#CO)C(=O)N1C#CC=C(O)C1CCCNC1
203 317.1608169521 [NH3+]C(=C=CN=CC#CO)N(C#CCC(O)C1CCCNC1)C=O Intermediate Fragment 
204 377.1819463201 C=C(OC(=C=O)CO)N1C=CC([NH3+])N(C#CCC(O)C2CCCNC2)C1=O Intermediate Fragment 
205 303.1451668881 C=C(O)N1C=CC([NH3+])N(C#CC=C(O)C2=CCCNC2)C1=O
206 285.1346022041 C#CN1C=CC([NH3+])N(C#CC=C(O)C2=CCCNC2)C1=O
207 287.1502522681 C#CN1C=CC([NH3+])N(C#CC=C(O)C2CCCNC2)C1=O
208 287.1502522681 C#CN=C=C=C([NH3+])N(C#CCC(O)C1CCCNC1)C=O Intermediate Fragment 
209 259.1553376481 C#C[NH+]=C=C=C(N)N=C=CCC(O)C1CCCNC1
210 289.1659023321 C#CN1C=CC([NH3+])N(C#CCC(O)C2CCCNC2)C1=O
211 291.1815523961 C#CN1C=CC([NH3+])N(C=CCC(O)C2CCCNC2)C1=O
212 293.1972024601 C#CN1C=CC([NH3+])N(CCCC(O)C2CCCNC2)C1=O
213 377.1819463201 C=C(O)C(=C=O)OCN1C=CC([NH3+])N(C#CCC(O)C2CCCNC2)C1=O Intermediate Fragment 
214 87.0440558841 CC(O)C#C[OH2+]
215 377.1819463201 [NH3+]C1C=CN(C=C=C(O)C(=O)C=O)C(=O)N1C=CCC(O)C1CCCNC1 Intermediate Fragment 
216 321.1921170801 [NH3+]C1C=CN(CC#CO)C(=O)N1C=CCC(O)C1CCCNC1
217 319.1764670161 [NH3+]C1C=CN(CC#CO)C(=O)N1C#CCC(O)C1CCCNC1
218 319.1764670161 [NH3+]C(=C=CN=CC#CO)N(C=O)C=CCC(O)C1CCCNC1 Intermediate Fragment 
219 59.0127557561 O=C=C[OH2+]
220 41.0021910721 [CH+]=C=O
221 89.0233204401 O=CC(=[OH+])CO
222 91.0389705041 OCC(=[OH+])CO
223 93.0546205681 OCC([OH2+])CO
224 275.1502522681 CN1C=CC([NH3+])N(C#CC=C(O)C2=CCCNC2)C1=O
225 377.1819463201 C=C([NH3+])N(C#CCC(O)C1CCCNC1)C(=O)N(C)C1C=C(O)C(=C=O)O1 Intermediate Fragment 
226 377.1819463201 C=CN(C(=O)N(C#CCC(O)C1CCCNC1)C[NH3+])C1C=C(O)C(=C=O)O1 Intermediate Fragment 
227 377.1819463201 [NH3+]C=C=CN(C(O)=NC=CCC(O)C1CCCNC1)C1C=C(O)C(=C=O)O1 Intermediate Fragment 
228 215.1026333801 NCCC[NH+](CO)C1C=C(O)C(=C=O)O1
229 187.1077187601 NCCC[NH2+]C1CC(O)C(=C=O)O1
230 185.0920686961 NCCC[NH2+]C1C=C(O)C(=C=O)O1
231 377.1819463201 [NH3+]C(=C=CN(C=O)C1C=C(O)C(=C=O)O1)N=CCCC(O)C1CCCNC1 Intermediate Fragment 
232 162.0760842841 OC=C1OC([NH2+]CO)CC1O
233 190.0974884241 NC=[NH+]C#CC=C(O)C1=CC=CNC1
234 186.0760842841 CC[NH+](CO)C1C=C(O)C(=C=O)O1
235 188.0917343481 CC[NH+](CO)C1CC(O)C(=C=O)O1
236 147.0916747721 [NH+]#CC#CC=C1CCCNC1
237 349.1870317001 NC(C#C[NH+]=C1C=C(O)C(=C=O)O1)NCCCC(O)C1CCCNC1
238 332.1604826041 O=C=C1OC(=[NH+]C#CC=NCCCC(O)C2CCCNC2)C=C1O
239 331.1764670161 NC(C#C[NH+]=C1C=CC(=C=O)O1)=NCCCC(O)C1CCCNC1
240 349.1870317001 NC(=C=C=[NH+]C(O)=C=C(O)C#CO)NCCCC(O)C1CCCNC1 Intermediate Fragment 
241 331.1764670161 NC(C#C[NH+]=C=C=C(O)C#CO)=NCCCC(O)C1CCCNC1
242 349.1870317001 C=C(O)C(=C=O)OC=[NH+]C#CC(N)=NCCCC(O)C1CCCNC1 Intermediate Fragment 
243 349.1870317001 NC(C#C[NH+]=C=C=C(O)C(=O)C=O)NCCCC(O)C1CCCNC1 Intermediate Fragment 
244 347.1713816361 NC(C#C[NH+]=C1C=C(O)C(=C=O)O1)=NCCCC(O)C1CCCNC1
245 345.1557315721 NC(C#C[NH+]=C1C=C(O)C(=C=O)O1)=NC=CCC(O)C1CCCNC1
246 377.1819463201 [NH3+]C(=C=CN=C1C=C(O)C(=C=O)O1)N(C=O)CCCC(O)C1CCCNC1 Intermediate Fragment 
247 252.1706533641 C#CC(N)[NH+](C=O)C=CCC(O)C1CCCNC1
248 250.1550033001 C#CC(N)[NH+](C#CCC(O)C1CCCNC1)C=O
249 232.1444386161 C#CC(N)[NH+](C)C#CC=C(O)C1=CCCNC1
250 248.1393532361 C#CC(N)[NH+](C#CC=C(O)C1CCCNC1)C=O
251 230.1287885521 C#CC(N)[NH+](C)C#CC=C(O)C1=CC=CNC1
252 228.1131384881 C#CC(N)[NH+](C)C#CC=C(O)C1=CC=CN=C1
253 132.0655196001 [NH3+]C1CC(O)C(=CO)O1
254 114.0549549161 C=C1OC([NH3+])C=C1O
255 132.0655196001 [NH3+]C(O)CC(O)C#CO Intermediate Fragment 
256 236.1393532361 C=C(N)[NH+](C#CC=C(O)C1CCCNC1)C=O
257 142.0498695361 C[NH2+]C1C=C(O)C(=C=O)O1
258 114.0549549161 C[NH2+]C1=CC(O)=CO1
259 142.0498695361 C[NH2+]C=C=C(O)C(=O)C=O Intermediate Fragment 
260 84.0443902321 C[NH+]=CC#CO
261 144.0655196001 C[NH2+]C1CC(O)C(=C=O)O1
262 144.0655196001 C[NH2+]CC=C(O)C(=O)C=O Intermediate Fragment 
263 126.0549549161 C[NH2+]C=C=C(O)C#CO
264 56.0494756121 C#C[NH2+]C
265 146.0811696641 C[NH2+]C1CC(O)C(=CO)O1
266 128.0706049801 C[NH2+]C1CCC(=C=O)O1
267 224.1393532361 NC[NH+](C#CC=C(O)C1CCCNC1)C=O
268 222.1237031721 NC[NH+](C#CC=C(O)C1=CCCNC1)C=O
269 156.0655196001 CC[NH2+]C1C=C(O)C(=C=O)O1
270 189.1233688241 NCCC[NH2+]C1CC(O)C(=CO)O1
271 191.1390188881 NCCC[NH2+]C1CC(O)C(CO)O1
272 377.1819463201 CCNCC(C)C(O)CC#CN1C(=O)N(C2C=C(O)C(=C=O)O2)C=CC1[NH3+] Intermediate Fragment 
273 336.1553972241 CC(C)C(O)CC=CN1C(=O)N(C2C=C(O)C(=C=O)O2)C=CC1[NH3+]
274 377.1819463201 CCC(CNC)C(O)CC#CN1C(=O)N(C2C=C(O)C(=C=O)O2)C=CC1[NH3+] Intermediate Fragment 
275 377.1819463201 CCCC(CN)C(O)CC#CN1C(=O)N(C2C=C(O)C(=C=O)O2)C=CC1[NH3+] Intermediate Fragment 
276 337.1506461921 NC1C=CN(C2C=C(O)C(=C=O)O2)C(=O)N1C=CCC(O)CC[NH3+]
277 360.1553972241 CCCC(C)C(O)=CC#CN1C(=O)N(C2C=C(O)C(=C=O)O2)C=CC1[NH3+]
278 350.1710472881 CCCCC(O)CC=CN1C(=O)N(C2C=C(O)C(=C=O)O2)C=CC1[NH3+]
279 377.1819463201 CC(CCCN)C(O)CC#CN1C(=O)N(C2C=C(O)C(=C=O)O2)C=CC1[NH3+] Intermediate Fragment 
280 377.1819463201 CNCCCCC(O)CC#CN1C(=O)N(C2C=C(O)C(=C=O)O2)C=CC1[NH3+] Intermediate Fragment 
281 318.1084470321 CCC(O)=CC#CN1C(=O)N(C2C=C(O)C(=C=O)O2)C=CC1[NH3+]
282 334.1397471601 CCCC(O)CC#CN1C(=O)N(C2C=C(O)C(=C=O)O2)C=CC1[NH3+]
283 346.1397471601 CCCCC(O)=CC#CN1C(=O)N(C2C=C(O)C(=C=O)O2)C=CC1[NH3+]
284 236.1393532361 CCCCC(O)CC#CN1C(=O)N=CC=C1[NH3+]
285 348.1553972241 CCCCC(O)CC#CN1C(=O)N(C2C=C(O)C(=C=O)O2)C=CC1[NH3+]
286 377.1819463201 CCCNCCC(O)CC#CN1C(=O)N(C2C=C(O)C(=C=O)O2)C=CC1[NH3+] Intermediate Fragment 
287 347.1349961281 C[NH2+]CCC(O)=CC#CN1C(=O)N(C2C=C(O)C(=C=O)O2)C=CC1N
288 335.1349961281 NC1C=CN(C2C=C(O)C(=C=O)O2)C(=O)N1C#CCC(O)CC[NH3+]
289 320.1240970961 CCC(O)CC#CN1C(=O)N(C2C=C(O)C(=C=O)O2)C=CC1[NH3+]
