#In-silico ESI-MS/MS [M+H]+ Spectra
#PREDICTED BY CFM-ID 4.0.8
#SMILES=O1[C@H](CO)[C@@H](C[C@@H]1n1c(nc2c1nc([nH]c2=O)N)Nc1ccc2c(n1)n1c(n2)c(ccc1)C)O
#InChiKey=WSJRBAXOXGNYRR-YRGRVCCFSA-N
energy0
348.13158 33.13 7 64 75 73 81 43 58 80 76 49 67 68 38 44 70 41 69 78 72 79 (22.973 0.38092 0.15093 0.026277 0.018362 0.014762 0.012987 0.011357 0.0095035 0.0071941 0.0038415 0.0029703 0.0029316 0.0023975 0.0016398 0.0013825 0.00093297 0.00024463 0.00014782 6.6495e-05)
464.17893 100.00 0 99 239 157 167 224 220 231 159 251 247 242 187 186 184 188 166 213 221 227 245 244 183 230 246 (69.323 1.0006 0.43681 0.18458 0.10657 0.097286 0.042504 0.017815 0.016054 0.013004 0.0089118 0.0080391 0.0074485 0.0061663 0.0061135 0.0057979 0.005745 0.0041272 0.0025476 0.0017576 0.00073268 0.0003431 0.00013558 0.00010591 4.6703e-05)
energy1
331.10503 5.37 61 34 50 42 40 71 (1.7673 1.5795 0.18387 0.057556 0.030677 0.028632)
348.13158 100.00 7 64 49 58 75 67 81 68 43 73 44 38 41 70 76 80 72 69 79 78 (63.493 1.7324 0.72137 0.38844 0.31244 0.2989 0.26278 0.20018 0.11707 0.1026 0.071528 0.070236 0.057618 0.045828 0.041606 0.02405 0.015554 0.013586 0.0078878 0.0051652)
446.16836 6.77 5 149 18 28 22 15 23 89 30 27 29 26 24 91 (3.8764 0.3105 0.10751 0.084004 0.078455 0.033727 0.033398 0.030046 0.015823 0.012164 0.010333 0.0084805 0.0024542 0.0021794)
464.17893 7.57 0 99 167 159 239 157 224 220 166 231 188 251 221 242 186 227 213 183 245 244 184 187 247 230 246 (3.4704 1.2779 0.14569 0.064337 0.040125 0.034901 0.022414 0.021719 0.014328 0.010242 0.0085339 0.0083177 0.0074919 0.0033643 0.0030897 0.0026797 0.0022209 0.0013483 0.00092005 0.00091409 0.00076164 0.00070414 0.00065806 0.00013287 6.7099e-05)
energy2
43.01784 12.47 125 (1.2572)
45.03349 23.80 108 (2.4004)
55.01784 12.52 127 (1.2627)
57.03349 62.95 88 (6.3485)
71.04914 9.75 144 145 (0.68115 0.30199)
75.04406 8.19 128 178 (0.62447 0.20137)
199.09782 15.70 12 (1.5833)
276.09922 8.92 57 (0.89911)
331.10503 47.13 34 40 71 42 50 61 (4.2936 0.37755 0.037408 0.024835 0.010163 0.009654)
333.12068 7.39 136 (0.74517)
335.13633 8.77 229 238 (0.62781 0.2565)
348.12035 11.03 119 (1.1127)
348.13158 100.00 7 49 58 64 44 73 70 72 67 81 38 43 41 76 68 75 79 78 80 69 (4.0523 2.2006 0.61168 0.39608 0.29778 0.28207 0.28118 0.26358 0.23132 0.20503 0.19657 0.18368 0.17116 0.16591 0.15334 0.12031 0.087182 0.075414 0.05903 0.050708)
350.14723 8.44 6 (0.85095)
354.17853 11.33 31 (1.1424)
360.13158 7.44 131 (0.7506)
372.13158 31.72 116 (3.1993)
374.14723 67.90 162 113 (3.8092 3.0389)
376.16288 41.61 111 (4.1959)
378.17853 7.33 163 (0.73887)
380.19418 7.33 164 (0.73887)
402.14215 50.45 20 102 (5.0239 0.064345)
404.15780 91.46 21 101 (8.9318 0.29202)
405.13058 16.44 190 (1.6579)
406.17345 48.69 158 (4.9104)
418.17345 6.52 150 (0.65716)
420.14148 11.23 198 214 205 204 192 (0.75286 0.28751 0.04936 0.023656 0.019445)
428.15780 14.87 151 17 14 10 (0.89881 0.52908 0.04977 0.021683)
436.18401 8.58 4 161 223 (0.43928 0.41062 0.01559)
444.15271 15.11 156 154 155 (0.70961 0.43215 0.38206)

0 464.1789266041 Cc1cccn2c1nc1ccc(Nc3nc4c(=O)[nH]c([NH3+])nc4n3C3CC(O)C(CO)O3)nc12
1 432.1527118561 CC1=CCCN2C1=NC1=C2NC(=NC2=NC3=C(N=C([NH3+])N=C3O)N2C2=CC(O)=CO2)C=C1
2 434.1683619201 CC1CCCN2C1=NC1=C2NC(=NC2=NC3=C(N=C([NH3+])N=C3O)N2C2=CC(O)=CO2)C=C1
3 416.1577972361 CC1=CCCN2C1=NC1=C2NC(=NC2=NC3=C(N=C([NH3+])N=C3O)N2C2=CC=CO2)C=C1
4 436.1840119841 CC1CCCN2C3=C(C=CC(=NC4=NC5=C(N=C([NH3+])N=C5O)N4C4=CC(O)=CO4)N3)NC12
5 446.1683619201 C=C1OC(N2C(N=C3C=CC4=C(N3)N3CCC=C(C)C3=N4)=NC3=C2N=C([NH3+])N=C3O)C=C1O
6 350.1472325521 CC1CCCN2C1=NC1=C2NC(=NC2=NC3=NC([NH3+])=NC(=O)C3=N2)C=C1
7 348.1315824881 CC1=CCCN2C1=NC1=C2NC(=NC2=NC3=NC([NH3+])=NC(=O)C3=N2)C=C1
8 99.0440558841 C=C1OC=CC1[OH2+]
9 101.0597059481 C=C1OCCC1[OH2+]
10 428.1577972361 C=C1OC(N2C(N=C3C=CC4=C(N3)N3C=CC=C(C)C3=N4)=NC3=C2N=C([NH3+])N=C3)C=C1O
11 429.1418128241 C=C1OC(N2C([NH+]=C3C=CC4=C(N3)N3C=CC=C(C)C3=N4)=NC3=C2N=CN=C3O)C=C1O
12 199.0978227721 CC1=CC=CN2C1=NC1=C2NC(=[NH2+])C=C1
13 430.1370617921 C=C1OC(N2C(N=C3C=CC4=C(N3)N3C=CC=CC3=N4)=NC3=C2N=C([NH3+])N=C3O)C=C1O
14 428.1577972361 C=C1C=CC(N2C(N=C3C=CC4=C(N3)N3C=CC=C(C)C3=N4)=NC3=C2N=C([NH3+])N=C3O)O1
15 446.1683619201 C#CC(O)=C=C(O)N1C(N=C2C=CC3=C(N2)N2CCCC(C)C2=N3)=NC2=C1N=C([NH3+])N=C2O Intermediate Fragment 
16 420.1527118561 CC1=CCCN2C1=NC1=C2NC(=NC2=NC3=C(N=C([NH3+])N=C3O)N2C(O)C#CO)C=C1
17 428.1577972361 C#CC(O)=C=CN1C(N=C2C=CC3=C(N2)N2CCC=C(C)C2=N3)=NC2=C1N=C([NH3+])N=C2O
18 446.1683619201 C#COC(=C=CO)N1C(N=C2C=CC3=C(N2)N2CCCC(C)C2=N3)=NC2=C1N=C([NH3+])N=C2O Intermediate Fragment 
19 400.1264971081 CC1=CC=CN2C1=NC1=C2NC(=NC2=NC3=C(N=C(N)N=C3O)N2[CH+]C#CO)C=C1
20 402.1421471721 CC1=CC=CN2C1=NC1=C2NC(=NC2=NC3=C(N=C([NH3+])N=C3O)N2CC#CO)C=C1
21 404.1577972361 CC1=CCCN2C1=NC1=C2NC(=NC2=NC3=C(N=C([NH3+])N=C3O)N2CC#CO)C=C1
22 446.1683619201 C=C(CO)OC(=C)N1C(N=C2C=CC3=C(N2)N2C=CC=C(C)C2=N3)=NC2=C1N=C([NH3+])N=C2O Intermediate Fragment 
23 446.1683619201 CC(=O)C(O)=C=CN1C(N=C2C=CC3=C(N2)N2CCC=C(C)C2=N3)=NC2=C1N=C([NH3+])N=C2O Intermediate Fragment 
24 446.1683619201 C=C1OC(N2C(N=C3C=CC4=C(N3)N3CCC=C(C)C3=N4)=NC(C(=O)N=C=[NH2+])=C2N)C=C1O Intermediate Fragment 
25 404.1465638561 C=C1OC(N2C(N=C3C=CC4=C(N3)N3C=CC=C(C)C3=N4)=NC(C=O)=C2[NH3+])=CC1O
26 446.1683619201 C=C1OC(N2C(N=C3C=CC4=C(N3)N3CCC=C(C)C3=N4)=NC(C(=N)O)=C2N=C=[NH2+])C=C1O Intermediate Fragment 
27 446.1683619201 C=C1OC(N2C(N=C([NH3+])N=C=O)=CN=C2N=C2C=CC3=C(N2)N2CCC=C(C)C2=N3)C=C1O Intermediate Fragment 
28 446.1683619201 C=C1OC(N2C=C(C(O)=NC(=N)[NH3+])N=C2N=C2C=CC3=C(N2)N2C=CC=C(C)C2=N3)C=C1O Intermediate Fragment 
29 446.1683619201 C=C1OC(N2C(N=C(N)C=C=C3CN4C=CC=C(C)C4=N3)=NC3=C2N=C([NH3+])N=C3O)C=C1O Intermediate Fragment 
30 446.1683619201 [CH+]=C1OC(N2C(N=C3C=CC(N)=C(N4C=C(C)C=CC4)N3)=NC3=C2N=C(N)N=C3O)C=C1O Intermediate Fragment 
31 354.1785326801 CC1CCCN2C1NC1C=CC(=NC3=NC4=NC([NH3+])=NC(=O)C4=N3)NC12
32 352.1628826161 CC1CCCN2C3=C(C=CC(=NC4=NC5=NC([NH3+])=NC(=O)C5=N4)N3)NC12
33 330.1210178041 [CH2+]C1=CC=CN2C1=NC1=C2NC(=NC2=NC3=NC(N)=NCC3=N2)C=C1
34 331.1050333921 CC1=CC=CN2C1=NC1=C2NC(=[NH+]C2=NC3=NC=NC(=O)C3=N2)C=C1
35 150.0410361681 [NH3+]C1=NC(=O)C2=NC=NC2=N1
36 165.0519352001 NC1=NC2=NC([NH3+])=NC(=O)C2=N1
37 332.1002823601 [NH3+]C1=NC(=O)C2=NC(N=C3C=CC4=C(N3)N3C=CC=CC3=N4)=NC2=N1
38 348.1315824881 CC1=CC=CN2C1=NC1=CC=C(N=C=NC3=C(N)N=C([NH3+])N=C3O)N=C12 Intermediate Fragment 
39 140.0566862321 N=C1C(=O)N=C(N)N=C1[NH3+]
40 331.1050333921 [CH2+]C1=CC=CN2C1=NC1=CC=C(N=C=NC3=CN=C(N)N=C3O)N=C12
41 348.1315824881 CC1=CCCN2C1=NC1=CC=C(N=C=NC3=NC([NH3+])=NC(=O)C3=N)N=C12 Intermediate Fragment 
42 331.1050333921 [CH2+]C1=CC=CN2C1=NC1=CC=C(N=C=NC3=CC(O)=NC(N)=N3)N=C12
43 348.1315824881 [CH2+]C1=CC=CN2C1=NC1=C2NC(=NC(N)=NC2=CC(O)=NC(N)=N2)C=C1 Intermediate Fragment 
44 348.1315824881 CC1=CC=CN2C1=NC1=C2NC(=NC(=N)N=C2C=NC([NH3+])=NC2=O)C=C1 Intermediate Fragment 
45 125.0457872001 NC1=NC(=O)C(=[NH2+])C=N1
46 222.0774216761 [CH2+]C1=CC=CN2C1=NC1=C2NC(=NC#N)C=C1
47 224.0930717401 CC1=CC=CN2C1=NC1=C2NC(=NC#[NH+])C=C1
48 346.1159324241 [CH2+]C1=CC=CN2C1=NC1=C2NC(=NC(=N)N=C2C=NC(N)=NC2=O)C=C1
49 348.1315824881 CC1=CCCN2C1=NC1=C2NC(=NC2=NC(=N)C(C(=O)N=C=[NH2+])=N2)C=C1 Intermediate Fragment 
50 331.1050333921 [CH2+]C1=CC=CN2C1=NC1=C2NC(=NC2=NCC(C(=O)N=C=N)=N2)C=C1
51 321.1206834561 CC1=CC=CN2C1=NC1=C2NC(=NC2=NC(=[NH2+])C(C(=N)O)=N2)C=C1
52 319.1050333921 [CH2+]C1=CC=CN2C1=NC1=C2NC(=NC2=NC(=N)C(C(=N)O)=N2)C=C1
53 306.1097844241 CC1=CC=CN2C1=NC1=C2NC(=NC2=NC(=[NH2+])C(C=O)=N2)C=C1
54 304.0941343601 CC1=CC=CN2C1=NC1=C2NC(=NC2=NC(=N)C(C#[O+])=N2)C=C1
55 280.1305198681 CC1=CCCN2C1=NC1=C2NC(=NC2=NC(=[NH2+])C=N2)C=C1
56 278.1148698041 CC1=CC=CN2C1=NC1=C2NC(=NC2=NC(=[NH2+])C=N2)C=C1
57 276.0992197401 [CH2+]C1=CC=CN2C1=NC1=C2NC(=NC2=NC(=N)C=N2)C=C1
58 348.1315824881 CC1=CCCN2C1=NC1=C2NC(=NC2=NC(=NC#[NH+])C(C(=N)O)=N2)C=C1 Intermediate Fragment 
59 304.0941343601 [CH2+]C1=CC=CN2C1=NC1=CC=C(N=C3N=CC(C(=N)O)=N3)N=C12
60 306.1097844241 CC1=CC=CN2C1=NC1=CC=C(N=C3N=CC(C(=[NH2+])O)=N3)N=C12
61 331.1050333921 CC1=CC=CN2C1=NC1=C2NC(=NC2=NC(=[NH+]C#N)C(C=O)=N2)C=C1
62 305.1257688361 CC1=CCCN2C1=NC1=C2NC(=NC2=NC(=[NH+]C#N)C=N2)C=C1
63 303.1101187721 CC1=CC=CN2C1=NC1=C2NC(=NC2=NC(=[NH+]C#N)C=N2)C=C1
64 348.1315824881 CC1=CC=CN2C1=NC1=C2NC(=NC2=NC(=NC(=N)[NH3+])C(C=O)=N2)C=C1 Intermediate Fragment 
65 289.0832353281 [CH2+]C1=CC=CN2C1=NC1=C2NC(=NC2=NC(=C=O)C=N2)C=C1
66 320.1366678681 CC1=CC=CN2C1=NC1=C2NC(=NC2=NC(=[NH+]C(=N)N)C=N2)C=C1
67 348.1315824881 CC1=CC=CN2C1=NC1=C2NC(=NC2=NC(=NC([NH3+])=NC=O)C=N2)C=C1 Intermediate Fragment 
68 348.1315824881 [CH2+]C1=CC=CN2C1=NC1=C2NC(=NC2=NCC(C(O)=NC(=N)N)=N2)C=C1 Intermediate Fragment 
69 348.1315824881 C=CC(=NC1=NC2=NC([NH3+])=NC(=O)C2=N1)NC1=CN=C2C(C)=CC=CN12 Intermediate Fragment 
70 348.1315824881 CC1=CC=CN2CC(=C=CC(N)=NC3=NC4=NC([NH3+])=NC(=O)C4=N3)N=C12 Intermediate Fragment 
71 331.1050333921 CC1=CC=CN2CC(=C=C=C=NC3=NC4=NC([NH3+])=NC(=O)C4=N3)N=C12
72 348.1315824881 CC1CCCN2C(=N)C(=C=C=C=NC3=NC4=NC([NH3+])=NC(=O)C4=N3)N=C12 Intermediate Fragment 
73 348.1315824881 [CH2+]C1=CN(C2=C(N)C=CC(=NC3=NC4=NC(N)=NC(=O)C4=N3)N2)CC=C1 Intermediate Fragment 
74 255.0737332641 N=C1C=CC(=NC2=NC3=NC([NH3+])=NC(=O)C3=N2)N=C1
75 348.1315824881 CC1=CC=CN=C1NC1=CNC(=NC2=NC3=NC([NH3+])=NC(=O)C3=N2)C=C1 Intermediate Fragment 
76 348.1315824881 CC1=CC=CN(C2=CC=CC(=NC3=NC4=NC([NH3+])=NC(=O)C4=N3)N2)C1=N Intermediate Fragment 
77 242.0784842961 [NH3+]C1=NC(=O)C2=NC(N=C3C=CC=CN3)=NC2=N1
78 348.1315824881 C=CN1C(C(=C)C)=NC2=C1NC(=NC1=NC3=NC([NH3+])=NC(=O)C3=N1)C=C2 Intermediate Fragment 
79 348.1315824881 C=C=C(C)C1=NC2=C(NC(=NC3=NC4=NC([NH3+])=NC(=O)C4=N3)C=C2)N1C Intermediate Fragment 
80 348.1315824881 CC=C=C(C)C1=NC2=C(C=CC(=NC3=NC4=NC([NH3+])=NC(=O)C4=N3)N2)N1 Intermediate Fragment 
81 348.1315824881 CC=C=CCN1C=NC2=C1NC(=NC1=NC3=NC([NH3+])=NC(=O)C3=N1)C=C2 Intermediate Fragment 
82 282.0846322961 [NH3+]C1=NC(=O)C2=NC(N=C3C=CC4NC=NC4=N3)=NC2=N1
83 115.0389705041 OC1CCOC1=C=[OH+]
84 117.0546205681 OC1CCOC1=C[OH2+]
85 117.0546205681 OCCC(O)C#C[OH2+] Intermediate Fragment 
86 117.0546205681 CCC(O)C(=O)C=[OH+] Intermediate Fragment 
87 99.0440558841 CC=C(O)C#C[OH2+]
88 57.0334912001 CC#C[OH2+]
89 446.1683619201 CC1CCCN2C1=NC1=C2NC(=NC2=NC3=C(N=C([NH3+])N=C3)N2C2C=C(O)C(=C=O)O2)C=C1
90 332.1366678681 CC1=CCCN2C1=NC1=C2NC(=NC2=NC3=NC(=[NH2+])N=CC3=N2)C=C1
91 446.1683619201 CC1CCCN2C1=NC1=C2NC(=NC2=NC3=C(N=C([NH3+])N=C3)N2C=C=C(O)C(=O)C=O)C=C1 Intermediate Fragment 
92 447.1523775081 CC1CCCN2C1=NC1=C2NC(=[NH+]C2=NC3=C(N=CN=C3O)N2C2C=C(O)C(=C=O)O2)C=C1
93 447.1523775081 CC1CCCN2C1=NC1=C2NC(=[NH+]C2=NC3=C(N=CN=C3O)N2C=C=C(O)C(=O)C=O)C=C1 Intermediate Fragment 
94 205.1447729641 CC1CCCN2C3=C(C=CC(=[NH2+])N3)NC12
95 201.1134728361 CC1=CCCN2C1=NC1=C2NC(=[NH2+])C=C1
96 197.0821727081 [CH2+]C1=CC=CN2C1=NC1=C2NC(=N)C=C1
97 266.0883802841 [NH3+]C1NC2=C(N=CN2C2=CC(O)C(=C=O)O2)C(O)N1
98 448.1476264761 [NH3+]C1=NC2=C(N=C(N=C3C=CC4=C(N3)N3CCCCC3=N4)N2C2C=C(O)C(=C=O)O2)C(O)=N1
99 464.1789266041 CC1CCCN2C3=C(C=CC(=NC4=NC5=C(N=C([NH3+])N=C5O)N4C(O)=C=C(O)C#CO)N3)NC12 Intermediate Fragment 
100 422.1683619201 CC1CCCN2C1=NC1=C2NC(=NC2=NC3=C(N=C([NH3+])N=C3O)N2C(O)C#CO)C=C1
101 404.1577972361 C#CC(O)N1C(N=C2C=CC3=C(N2)N2CCC=C(C)C2=N3)=NC2=C1N=C([NH3+])N=C2O
102 402.1421471721 C#CC(O)N1C(N=C2C=CC3=C(N2)N2C=CC=C(C)C2=N3)=NC2=C1N=C([NH3+])N=C2O
103 420.1527118561 CC1=CCCN2C1=NC1=C2NC(=NC2=NC(C(=O)N=C=[NH2+])=C(N)N2C(O)C#CO)C=C1 Intermediate Fragment 
104 376.1152637281 CC1=CC=CN2C1=NC1=C2NC(=NC2=NC(C=O)=C([NH3+])N2C(=O)C#CO)C=C1
105 418.1370617921 CC1=CC=CN2C1=NC1=C2NC(=NC2=NC3=C(N=C([NH3+])N=C3O)N2C(O)C#CO)C=C1
106 47.0491412641 CC[OH2+]
107 29.0385765801 C=[CH3+]
108 45.0334912001 C=C[OH2+]
109 396.1890973641 C=C(O)N1C(N=C2C=CC3=C(N2)N2CCCC(C)C2N3)=NC2=C1N=C([NH3+])N=C2O
110 394.1734473001 C=C(O)N1C(N=C2C=CC3=C(N2)N2CCCC(C)C2=N3)=NC2=C1N=C([NH3+])N=C2O
111 376.1628826161 C#CN1C(N=C2C=CC3=C(N2)N2CCCC(C)C2=N3)=NC2=C1N=C([NH3+])N=C2O
112 392.1577972361 C=C(O)N1C(N=C2C=CC3=C(N2)N2CCC=C(C)C2=N3)=NC2=C1N=C([NH3+])N=C2O
113 374.1472325521 C#CN1C(N=C2C=CC3=C(N2)N2CCC=C(C)C2=N3)=NC2=C1N=C([NH3+])N=C2O
114 392.1577972361 C=C(O)N=C(N=C1C=CC2=C(N1)N1CCC=C(C)C1=N2)N=C1C=NC([NH3+])=NC1=O Intermediate Fragment 
115 390.1421471721 C=C(O)N1C(N=C2C=CC3=C(N2)N2C=CC=C(C)C2=N3)=NC2=C1N=C([NH3+])N=C2O
116 372.1315824881 C#CN1C(N=C2C=CC3=C(N2)N2C=CC=C(C)C2=N3)=NC2=C1N=C([NH3+])N=C2O
117 390.1421471721 C=C(O)NC1=C(N=C=NC2=CC=C3N=C4C(C)=CC=CN4C3=N2)C(O)=NC([NH3+])=N1 Intermediate Fragment 
118 390.1421471721 C=C(O)N1C(N=C2C=CC3=C(N2)N2C=CC=C(C)C2=N3)=NC(C(=O)N=C=[NH2+])=C1N Intermediate Fragment 
119 348.1203491081 C=C(O)N1C(=[NH2+])C(=C=O)N=C1N=C1C=CC2=C(N1)N1C=CC=C(C)C1=N2
120 346.1046990441 [CH+]=C(O)N1C(=N)C(=C=O)N=C1N=C1C=CC2=C(N1)N1C=CC=C(C)C1=N2
121 388.1264971081 [CH+]=C(O)N1C(N=C2C=CC3=C(N2)N2C=CC=C(C)C2=N3)=NC2=C1N=C(N)N=C2O
122 68.9971056921 [O+]#CC#CO
123 41.0021910721 [C+]#CO
124 71.0127557561 O=CC#C[OH2+]
125 43.0178411361 C#C[OH2+]
126 73.0284058201 OCC#C[OH2+]
127 55.0178411361 C#CC=[OH+]
128 75.0440558841 OCC=C[OH2+]
129 380.1577972361 CC1=CCCN2C1=NC1=C2NC(=NC2=NC3=C(N=C([NH3+])N=C3O)N2CO)C=C1
130 378.1421471721 CC1=CC=CN2C1=NC1=C2NC(=NC2=NC3=C(N=C([NH3+])N=C3O)N2CO)C=C1
131 360.1315824881 [CH2+]N1C(N=C2C=CC3=C(N2)N2C=CC=C(C)C2=N3)=NC2=C1N=C(N)N=C2O
132 378.1421471721 CC1=CC=CN2C1=NC1=C2NC(=NC(N=CO)=NC2=CN=C([NH3+])N=C2O)C=C1 Intermediate Fragment 
133 376.1264971081 CC1=CC=CN2C1=NC1=C2NC(=NC2=NC3=C(N=C([NH3+])N=C3O)N2C=O)C=C1
134 376.1264971081 CC1=CC=CN2C1=NC1=CC=C(N=C=NC3=C(N=CO)N=C([NH3+])N=C3O)N=C12 Intermediate Fragment 
135 376.1264971081 CC1=CC=CN2C1=NC1=C2NC(=NC(N=C=O)=NC2=CN=C([NH3+])N=C2O)C=C1 Intermediate Fragment 
136 333.1206834561 CC1=CC=CN2C1=NC1=CC=C(N=C=[NH+]C3=CN=C(N)N=C3O)N=C12
137 376.1264971081 CC1=CC=CN2C1=NC1=C2NC(=NC2=NC(C(=O)N=C=[NH2+])=C(N)N2C=O)C=C1 Intermediate Fragment 
138 334.1046990441 CC1=CC=CN2C1=NC1=C2NC(=NC2=NC(=C=O)C(=[NH2+])N2C=O)C=C1
139 332.0890489801 CC1=CC=CN2C1=NC1=C2NC(=NC2=NC(=C=O)C(=N)N2C#[O+])C=C1
140 374.1108470441 CC1=CC=CN2C1=NC1=C2NC(=NC2=NC3=C(N=C(N)N=C3O)N2C#[O+])C=C1
141 374.1108470441 [CH2+]C1=CC=CN2C1=NC1=C2NC(=NC(N=C=O)=NC2=CN=C(N)N=C2O)C=C1 Intermediate Fragment 
142 87.0440558841 CC(O)C#C[OH2+]
143 89.0597059481 CC(O)C=C[OH2+]
144 71.0491412641 C#CC(C)[OH2+]
145 71.0491412641 CCC#C[OH2+]
146 91.0753560121 CC(O)CC[OH2+]
147 73.0647913281 C=CC(C)[OH2+]
148 73.0647913281 CCC=C[OH2+]
149 446.1683619201 CC1CCCN2C1=NC1=C2NC(=NC2=NC3=C(N=C([NH3+])N=C3O)N2C=C=C(O)C#CO)C=C1
150 418.1734473001 C=C(O)C#CN1C(N=C2C=CC3=C(N2)N2CCCC(C)C2=N3)=NC2=C1N=C([NH3+])N=C2O
151 428.1577972361 CC1=CCCN2C1=NC1=C2NC(=NC2=NC3=C(N=C([NH3+])N=C3O)N2CC#CC#CO)C=C1
152 462.1632765401 CC1CCCN2C1=NC1=C2NC(=NC2=NC3=C(N=C([NH3+])N=C3O)N2C(O)=C=C(O)C#CO)C=C1
153 434.1683619201 C=C(O)C=C(O)N1C(N=C2C=CC3=C(N2)N2CCC=C(C)C2=N3)=NC2=C1N=C([NH3+])N=C2O
154 444.1527118561 C#CC(O)=C=C(O)N1C(N=C2C=CC3=C(N2)N2CCC=C(C)C2=N3)=NC2=C1N=C([NH3+])N=C2O
155 444.1527118561 CC1=CCCN2C1=NC1=C2NC(=NC2=NC3=C(N=C([NH3+])N=C3O)N2C(O)C#CC#CO)C=C1
156 444.1527118561 CC1=CCCN2C1=NC1=C2NC(=NC2=NC3=C(N=C([NH3+])N=C3O)N2C=C=C(O)C#CO)C=C1
157 464.1789266041 CC1CCCN2C3=C(C=CC(=NC4=NC5=C(N=C([NH3+])N=C5O)N4C(=C=CO)OC#CO)N3)NC12 Intermediate Fragment 
158 406.1734473001 CC1CCCN2C1=NC1=C2NC(=NC2=NC3=C(N=C([NH3+])N=C3O)N2CC#CO)C=C1
159 464.1789266041 C=C(OC(=C=O)CO)N1C(N=C2C=CC3=C(N2)N2CCCC(C)C2=N3)=NC2=C1N=C([NH3+])N=C2O Intermediate Fragment 
160 434.1683619201 C=C(OC#CO)N1C(N=C2C=CC3=C(N2)N2CCCC(C)C2=N3)=NC2=C1N=C([NH3+])N=C2O
161 436.1840119841 C=C(OC#CO)N1C(N=C2C=CC3=C(N2)N2CCCC(C)C2N3)=NC2=C1N=C([NH3+])N=C2O
162 374.1472325521 C#CN1C(N=C2C=CC3=C(N2)N2CCC=C(C)C2=N3)=NC(C(=O)N=C=[NH2+])=C1N Intermediate Fragment 
163 378.1785326801 C#CN1C(N=C2C=CC3=C(N2)N2CCCC(C)C2N3)=NC2=C1N=C([NH3+])N=C2O
164 380.1941827441 C#CN1C(N=C2C=CC3NC4C(C)CCCN4C3N2)=NC2=C1N=C([NH3+])N=C2O
165 462.1632765401 C=C(OC(=C=O)CO)N1C(N=C2C=CC3=C(N2)N2CCC=C(C)C2=N3)=NC2=C1N=C([NH3+])N=C2O
166 464.1789266041 C=C(O)C(=C=O)OCN1C(N=C2C=CC3=C(N2)N2CCCC(C)C2=N3)=NC2=C1N=C([NH3+])N=C2O Intermediate Fragment 
167 464.1789266041 CC1CCCN2C3=C(C=CC(=NC4=NC5=C(N=C([NH3+])N=C5O)N4C=C=C(O)C(=O)C=O)N3)NC12 Intermediate Fragment 
168 408.1890973641 CC1CCCN2C3=C(C=CC(=NC4=NC5=C(N=C([NH3+])N=C5O)N4CC#CO)N3)NC12
169 59.0127557561 O=C=C[OH2+]
170 63.0440558841 OCC[OH2+]
171 84.9920203121 O=CC(=O)C#[O+]
172 87.0076703761 O=CC(=[OH+])C=O
173 89.0233204401 O=CC(=[OH+])CO
174 91.0389705041 OCC(=[OH+])CO
175 61.0284058201 OCC=[OH+]
176 73.0284058201 CC(=[OH+])C=O
177 93.0546205681 OCC([OH2+])CO
178 75.0440558841 CC(=[OH+])CO
179 362.1472325521 CC1=CC=CN2C1=NC1=C2NC(N=C2N=C3C(=O)N=C([NH3+])N=C3N2C)C=C1
180 358.1159324241 [CH2+]N1C(=NC2=CC=C3N=C4C(C)=CC=CN4C3=N2)N=C2C(=O)N=C(N)N=C21
181 105.0546205681 CC(O)C(=[OH+])CO
182 462.1632765401 CC1CCCN2C1=NC1=C2NC(=NC2=NC3=C(N=C([NH3+])N=C3O)N2C=C=C(O)C(=O)C=O)C=C1
183 464.1789266041 CC1CCCN2C3=NC(N=CN(C4=NC([NH3+])=NC(=O)C4=N)C4C=C(O)C(=C=O)O4)=CC=C3NC12 Intermediate Fragment 
184 464.1789266041 CC1CCCN2C3NC(N=C=NC4=C(O)N=C([NH3+])N=C4N=C4C=C(O)C(=C=O)O4)=CC=C3NC12 Intermediate Fragment 
185 339.1676336481 CC1CCCN2C3=NC(N=C=[NH+]C4=CN=C(N)N=C4O)=CC=C3NC12
186 464.1789266041 CC1CCCN2C3=C(C=CC(=NC(=NC4=CN=C([NH3+])N=C4O)N=C4C=C(O)C(=C=O)O4)N3)NC12 Intermediate Fragment 
187 464.1789266041 CC1CCCN2C1=NC1=C2NC(=NC(=N)N(C2=CC(O)=NC([NH3+])=N2)C2C=C(O)C(=C=O)O2)C=C1 Intermediate Fragment 
188 464.1789266041 CC1CCCN2C3=C(C=CC(=NC4=NC(C(=O)N=C=[NH2+])=C(N)N4C4C=C(O)C(=C=O)O4)N3)NC12 Intermediate Fragment 
189 447.1523775081 CC1CCCN2C1=NC1=C2NC(=NC2=NC(C(=O)[NH+]=C=N)=CN2C2C=C(O)C(=C=O)O2)C=C1
190 405.1305794441 CC1=CCCN2C1=NC1=C2NC(=[NH+]C2=NC(C=O)=CN2C2C=C(O)C(=C=O)O2)C=C1
191 437.1680275721 CC1CCCN2C1=NC1=C2NC(=NC2=NC(C(=N)O)=C([NH3+])N2C2C=C(O)C(=C=O)O2)C=C1
192 420.1414784761 CC1=CCCN2C1=NC1=C2NC(=NC2=NC(C=O)=C([NH3+])N2C2C=C(O)C(=C=O)O2)C=C1
193 437.1680275721 CC1CCCN2C1=NC1=C2NC(=NC2=NC(C(=N)O)=C([NH3+])N2C(O)=C=C(O)C#CO)C=C1 Intermediate Fragment 
194 422.1571285401 CC1CCCN2C1=NC1=C2NC(=NC2=NC(C=O)=C([NH3+])N2C2C=C(O)C(=C=O)O2)C=C1
195 404.1465638561 CC1=CCCN2C1=NC1=C2NC(=NC2=NC(C=O)=C([NH3+])N2C2C=CC(=C=O)O2)C=C1
196 394.1622139201 CC1CCCN2C1=NC1=C2NC(=NC2=NC=C([NH3+])N2C2C=C(O)C(=C=O)O2)C=C1
197 422.1571285401 CC1CCCN2C1=NC1=C2NC(=NC2=NC(C=O)=C([NH3+])N2C(O)=C=C(O)C#CO)C=C1 Intermediate Fragment 
198 420.1414784761 CC1=CCCN2C1=NC1=C2NC(=NC2=NC(C=O)=C([NH3+])N2C(O)=C=C(O)C#CO)C=C1
199 422.1571285401 C=C(OC(=C=O)CO)N1C(N=C2C=CC3=C(N2)N2CCC=C(C)C2=N3)=NC(C=O)=C1[NH3+] Intermediate Fragment 
200 422.1571285401 CC1CCCN2C1=NC1=C2NC(=NC2=NC(C=O)=C([NH3+])N2C=C=C(O)C(=O)C=O)C=C1 Intermediate Fragment 
201 402.1309137921 C=C1OC(N2C(N=C3C=CC4=C(N3)N3C=CC=C(C)C3=N4)=NC(C#[O+])=C2N)C=C1O
202 403.1149293801 CC1=CC=CN2C1=NC1=C2NC(=[NH+]C2=NC(C=O)=CN2C2C=C(O)C(=C=O)O2)C=C1
203 392.1465638561 CC1=CCCN2C1=NC1=C2NC(=NC2=NC=C([NH3+])N2C2C=C(O)C(=C=O)O2)C=C1
204 420.1414784761 C=C(OC(=C=O)CO)N1C(N=C2C=CC3=C(N2)N2C=CC=C(C)C2=N3)=NC(C=O)=C1[NH3+] Intermediate Fragment 
205 420.1414784761 CC1=CCCN2C1=NC1=C2NC(=NC2=NC(C=O)=C([NH3+])N2C=C=C(O)C(=O)C=O)C=C1 Intermediate Fragment 
206 360.1203491081 CC1=CC=CN2C1=NC1=C2NC(=NC2=NC(C=O)=C([NH3+])N2C=C=C=O)C=C1
207 332.1254344881 C#CN1C(=[NH2+])C(C=O)N=C1N=C1C=CC2=C(N1)N1C=CC=C(C)C1=N2
208 418.1258284121 CC1=CC=CN2C1=NC1=C2NC(=NC2=NC(C=O)=C([NH3+])N2C2C=C(O)C(=C=O)O2)C=C1
209 396.1778639841 CC1CCCN2C3=C(C=CC(=NC4=NC=C([NH3+])N4C4C=C(O)C(=C=O)O4)N3)NC12
210 394.1622139201 CC1CCCN2C1=NC1=C2NC(=NC2=NC=C([NH3+])N2C(O)=C=C(O)C#CO)C=C1 Intermediate Fragment 
211 392.1465638561 CC1=CCCN2C1=NC1=C2NC(=NC2=NC=C([NH3+])N2C=C=C(O)C(=O)C=O)C=C1 Intermediate Fragment 
212 390.1309137921 CC1=CC=CN2C1=NC1=C2NC(=NC2=NC=C([NH3+])N2C2C=C(O)C(=C=O)O2)C=C1
213 464.1789266041 CC1CCCN2C3=C(C=CC(=NC4=NC(C(=N)O)=C(N=C=[NH2+])N4C4C=C(O)C(=C=O)O4)N3)NC12 Intermediate Fragment 
214 420.1414784761 CC1=CCCN2C1=NC1=C2NC(=NC2=NC(C(=[NH2+])O)=CN2C2C=C(O)C(=C=O)O2)C=C1
215 422.1571285401 CC1CCCN2C1=NC1=C2NC(=NC2=NC(C(=[NH2+])O)=CN2C2C=C(O)C(=C=O)O2)C=C1
216 379.1513148881 CC1CCCN2C1=NC1=C2NC(=[NH+]C2=NC=CN2C2C=C(O)C(=C=O)O2)C=C1
217 447.1523775081 CC1CCCN2C1=NC1=C2NC(=NC2=NC(C=O)=C([NH+]=C=N)N2C2C=C(O)C(=C=O)O2)C=C1
218 421.1731129521 CC1CCCN2C3=C(C=CC(=NC4=NC=C([NH+]=C=N)N4C4C=C(O)C(=C=O)O4)N3)NC12
219 419.1574628881 CC1CCCN2C1=NC1=C2NC(=NC2=NC=C([NH+]=C=N)N2C2C=C(O)C(=C=O)O2)C=C1
220 464.1789266041 CC1CCCN2C1=NC1=C2NC(=NC2=NC(C=O)=C(N=C(N)[NH3+])N2C2C=C(O)C(=C=O)O2)C=C1 Intermediate Fragment 
221 464.1789266041 CC1CCCN2C3=C(C=CC(=NC4=NC=C(N=C([NH3+])N=C=O)N4C4C=C(O)C(=C=O)O4)N3)NC12 Intermediate Fragment 
222 417.1418128241 CC1=CCCN2C1=NC1=C2NC(=NC2=NC=C([NH+]=C=N)N2C2C=C(O)C(=C=O)O2)C=C1
223 436.1840119841 CC1CCCN2C1=NC1=C2NC(=NC2=NC=C([NH+]=C(N)N)N2C2C=C(O)C(=C=O)O2)C=C1
224 464.1789266041 CC1CCCN2C1=NC1=C2NC(=NC2=NC(C(O)=NC(=N)[NH3+])=CN2C2C=C(O)C(=C=O)O2)C=C1 Intermediate Fragment 
225 379.1513148881 CC1CCCN2C1=NC1=C2NC(=[NH+]C2=NC=CN2C=C=C(O)C(=O)C=O)C=C1 Intermediate Fragment 
226 377.1356648241 CC1=CCCN2C1=NC1=C2NC(=[NH+]C2=NC=CN2C2C=C(O)C(=C=O)O2)C=C1
227 464.1789266041 CC1CCCN2CC(=C=CC(N)=NC3=NC4=C(N=C([NH3+])N=C4O)N3C3C=C(O)C(=C=O)O3)N=C12 Intermediate Fragment 
228 447.1523775081 CC1CCCN2CC(=C=C=C=NC3=NC4=C(N=C([NH3+])N=C4O)N3C3C=C(O)C(=C=O)O3)N=C12
229 335.1363335201 CC1CCCN2CC(=C=C=C=NC3=NC4=NC([NH3+])=NC(=O)C4=N3)N=C12
230 464.1789266041 CC1CCCN2C(N)C(=C=C=C=NC3=NC4=C(N=C([NH3+])N=C4O)N3C3C=C(O)C(=C=O)O3)NC12 Intermediate Fragment 
231 464.1789266041 CC1=CN(C2=C(N)C=CC(=NC3=NC4=C(N=C([NH3+])N=C4O)N3C3C=C(O)C(=C=O)O3)N2)CCC1 Intermediate Fragment 
232 94.0651256761 [CH4+]C1=CC=CN=C1
233 92.0494756121 [CH2+]C1=CC=CN=C1
234 369.1054273161 NC1=CNC(=NC2=NC3=C(N=C([NH3+])N=C3O)N2C2=CC(O)C(=C=O)O2)C=C1
235 371.1210773801 NC1C=CC(=NC2=NC3=C(N=C([NH3+])N=C3O)N2C2=CC(O)C(=C=O)O2)NC1
236 371.1210773801 NC1C=CC(=NC2=NC3=C(N=C([NH3+])N=C3O)N2C=C=C(O)C(=O)C=O)NC1 Intermediate Fragment 
237 447.1523775081 CC1=CN(C2=CC=CC(=NC3=NC4=C(N=C([NH3+])N=C4O)N3C3C=C(O)C(=C=O)O3)N2)CC=C1
238 335.1363335201 CC1=CN(C2=CC=CC(=NC3=NC4=NC([NH3+])=NC(=O)C4=N3)N2)CC=C1
239 464.1789266041 CC1CCCN=C1NC1=CNC(=NC2=NC3=C(N=C([NH3+])N=C3O)N2C2C=C(O)C(=C=O)O2)C=C1 Intermediate Fragment 
240 358.1258284121 [NH3+]C1=NC2=C(N=C(N=C3CCCCN3)N2C2=CC(O)C(=C=O)O2)C(O)=N1
241 356.1101783481 [NH3+]C1=NC2=C(N=C(N=C3C=CCCN3)N2C2=CC(O)C(=C=O)O2)C(O)=N1
242 464.1789266041 CC1CCCN(C2=CC=CC(=NC3=NC4=C(N=C([NH3+])N=C4O)N3C3C=C(O)C(=C=O)O3)N2)C1=N Intermediate Fragment 
243 113.1073248361 CC1CCCNC1=[NH2+]
244 464.1789266041 CCCN1C(CC)=NC2=C1NC(=NC1=NC3=C(N=C([NH3+])N=C3O)N1C1C=C(O)C(=C=O)O1)C=C2 Intermediate Fragment 
245 464.1789266041 CCN1C(C(C)C)=NC2=C1NC(=NC1=NC3=C(N=C([NH3+])N=C3O)N1C1C=C(O)C(=C=O)O1)C=C2 Intermediate Fragment 
246 464.1789266041 CCC(C)C1=NC2=C(NC(=NC3=NC4=C(N=C([NH3+])N=C4O)N3C3C=C(O)C(=C=O)O3)C=C2)N1C Intermediate Fragment 
247 464.1789266041 CCCC(C)C1=NC2=C(C=CC(=NC3=NC4=C(N=C([NH3+])N=C4O)N3C3C=C(O)C(=C=O)O3)N2)N1 Intermediate Fragment 
248 398.1319764121 [NH3+]C1=NC2=C(N=C(N=C3C=CC4NCNC4N3)N2C2=CC(O)C(=C=O)O2)C(O)=N1
249 400.1476264761 [NH3+]C1=NC2=C(N=C(N=C3CCC4NCNC4N3)N2C2=CC(O)C(=C=O)O2)C(O)=N1
250 422.1319764121 CCC1=NC2=C(C=CC(=NC3=NC4=C(N=C([NH3+])N=C4O)N3C3C=C(O)C(=C=O)O3)N2)N1
251 464.1789266041 CCCCCN1C=NC2=C1NC(=NC1=NC3=C(N=C([NH3+])N=C3O)N1C1C=C(O)C(=C=O)O1)C=C2 Intermediate Fragment 
252 410.1319764121 CN1CNC2=C1NC(=NC1=NC3=C(N=C([NH3+])N=C3O)N1C1C=C(O)C(=C=O)O1)C=C2
