#In-silico ESI-MS/MS [M+H]+ Spectra
#PREDICTED BY CFM-ID 4.0.8
#SMILES=n12c(nc3c(c1=O)ncn3[C@@H]1O[C@H](CO)[C@@H](C1)O)[nH]c(=O)cc2
#InChiKey=XDXKNMPSCQWLAC-ZXFLCMHBSA-N
energy0
204.05160 100.00 18 22 32 27 30 28 39 25 19 44 (92.533 1.826 0.18951 0.073715 0.031985 0.015709 0.010469 0.0071595 0.0070017 0.0064608)
energy1
204.05160 100.00 18 22 32 25 27 30 19 39 44 28 (82.125 3.475 0.43598 0.37272 0.16715 0.11097 0.091557 0.063299 0.050412 0.03413)
energy2
45.03349 7.06 125 (3.021)
57.03349 13.56 11 (5.8021)
71.04914 2.00 167 168 (0.5927 0.26278)
97.03964 4.27 24 (1.8265)
135.03014 3.40 199 (1.4541)
149.04579 1.82 187 (0.77945)
161.04579 10.70 41 (4.5756)
164.04545 1.75 97 99 98 104 (0.4371 0.22656 0.04384 0.039708)
176.05669 2.96 21 34 (0.6914 0.57519)
177.04070 2.20 29 (0.94168)
202.03595 2.74 16 17 31 (1.009 0.13801 0.026718)
204.05160 100.00 18 22 30 39 28 32 27 19 25 44 (17.086 14.272 2.6903 1.8293 1.6575 1.4103 1.3653 1.2339 0.84474 0.38927)
208.08290 2.28 46 (0.97354)
210.09855 4.92 47 51 55 50 49 52 54 53 (1.247 0.17862 0.17286 0.15334 0.11816 0.10081 0.070522 0.06348)
228.05160 3.51 115 130 (0.82 0.67954)
230.06725 7.23 68 (3.0928)
232.04652 3.21 133 (1.375)
244.08290 1.80 119 (0.76852)
252.10912 3.77 144 (1.6107)
260.07782 6.19 153 65 123 122 (1.6028 0.5525 0.2819 0.20923)
284.07782 2.67 116 64 62 (0.66573 0.33882 0.13852)

0 320.0989449681 O=c1ccn2c(=[OH+])c3ncn(C4CC(O)C(CO)O4)c3nc2[nH]1
1 302.0883802841 OC1=CC(N2C=NC3=C2N=C2N=C(O)CCN2C3)OC1=C=[OH+]
2 119.0702706321 OC1CCOC1C[OH2+]
3 101.0597059481 C=C1OCCC1[OH2+]
4 101.0597059481 [OH2+]C=C1CCCO1
5 119.0702706321 O=CCC(O)CC[OH2+] Intermediate Fragment 
6 117.0546205681 OC=CC(O)CC=[OH+]
7 99.0440558841 C=C1OCC=C1[OH2+]
8 99.0440558841 [OH+]=C=C1CCCO1
9 117.0546205681 CCC(O)C(=O)C=[OH+] Intermediate Fragment 
10 99.0440558841 CC=C(O)C#C[OH2+]
11 57.0334912001 CC#C[OH2+]
12 117.0546205681 OCCCOC#C[OH2+] Intermediate Fragment 
13 117.0546205681 CCOC(=C=[OH+])CO Intermediate Fragment 
14 115.0389705041 OC1CCOC1=C=[OH+]
15 111.0076703761 O=C1C=COC1=C=[OH+]
16 202.0359507881 O=C1C=CN2C(=[OH+])C3=NC=NC3=NC2=N1
17 202.0359507881 [O+]#CC1=NC=NC1=NC1=NC=CC(O)=N1 Intermediate Fragment 
18 204.0516008521 O=C1CCN2C(=[OH+])C3=NC=NC3=NC2=N1
19 204.0516008521 [O+]#CN1C=CC(O)=NC1=NC1=CN=CN1 Intermediate Fragment 
20 82.0399735481 [NH2+]=C1C=NC=N1
21 176.0566862321 OC1=NC([NH+]=C2C=NC=N2)=NC=C1
22 204.0516008521 OC1=NC(N=C2NC=NC2=C=[OH+])=NC=C1 Intermediate Fragment 
23 108.0192381041 N=C1N=CN=C1C#[O+]
24 97.0396392001 [OH2+]C1=NC=NC=C1
25 204.0516008521 N=C1N=CN=C1C(=[OH+])N1C=CC(=O)N=C1 Intermediate Fragment 
26 123.0189037561 O=C1C=CN(C#[O+])C=N1
27 204.0516008521 N=C=NC1=CC(=[OH+])N2C=CC(O)=NC2=N1 Intermediate Fragment 
28 204.0516008521 N=C=NC1=CN=C2N=C(O)C=CN2C1=[OH+] Intermediate Fragment 
29 177.0407018201 [NH2+]=C1C=NC2=NC(=O)C=CN2C1=O
30 204.0516008521 C=NC1=NC2=NC(=O)C=CN2C(=[OH+])C1=N Intermediate Fragment 
31 202.0359507881 C#[N+]C1=NC2=NC(=O)C=CN2C(=O)C1=N
32 204.0516008521 NC1=NC2=C(N=CN2)C(=[OH+])N1C=C=C=O Intermediate Fragment 
33 187.0250517561 O=C=C=[C+]N1C=NC2=C(N=CN2)C1=O
34 176.0566862321 C=CN1C(=[NH2+])N=C2N=CN=C2C1=O
35 174.0410361681 C#CN1C(=[NH2+])N=C2N=CN=C2C1=O
36 162.0410361681 [CH2+]N1C(=N)N=C2N=CN=C2C1=O
37 152.0566862321 [NH3+]C1=NC(=O)C2=NCNC2=N1
38 150.0410361681 [NH3+]C1=NC(=O)C2=NC=NC2=N1
39 204.0516008521 C=CN1C(=[OH+])C2=C(N=C1N=C=O)NC=N2 Intermediate Fragment 
40 159.0301371361 [C+]#CN1C=NC2=C(N=CN2)C1=O
41 161.0457872001 C#CN1C=NC2=C(N=CN2)C1=[OH+]
42 172.0253861041 [C+]#CN1C(=N)N=C2N=CN=C2C1=O
43 178.0359507881 O=C1N=C([NH+]=CO)N=C2N=CN=C12
44 204.0516008521 C=CC(O)=NC1=NC(=[OH+])C2=NC=NC2=N1 Intermediate Fragment 
45 206.0672509161 OC1CCN2C(=[OH+])C3=NC=NC3=NC2=N1
46 208.0829009801 OC1CCN2C(=[OH+])C3=NC=NC3=NC2N1
47 210.0985510441 OC1CCN2C(=[OH+])C3=NCNC3=NC2N1
48 192.0879863601 [OH+]=C1C2=C(N=C3NCCCN13)NC=N2
49 210.0985510441 OC1CCN=C(N=C2NCNC2=C=[OH+])N1 Intermediate Fragment 
50 210.0985510441 N=C1NC=NC1=C([OH2+])N1C=NC(O)CC1 Intermediate Fragment 
51 210.0985510441 C=NC1=C(N)N=C2NC(O)CCN2C1=[OH+] Intermediate Fragment 
52 210.0985510441 C=NC1=C(N)C(=[OH+])N2CCC(O)NC2=N1 Intermediate Fragment 
53 210.0985510441 NC1=NC2=C(N=CN2)C(=[OH+])N1CCCO Intermediate Fragment 
54 210.0985510441 CCN1C(=[OH+])C2=C(N=C1NCO)NC=N2 Intermediate Fragment 
55 210.0985510441 NC(O)CCN1C=NC2=C(N=CN2)C1=[OH+] Intermediate Fragment 
56 288.0727302201 OC1=COC(N2C=NC3=C2N=C2N=C(O)C=CN2C3=[OH+])C1
57 270.0621655361 OC1=NC2=NC3=C(N=CN3C3=CC=CO3)C(=[OH+])N2C=C1
58 290.0883802841 OC1=COC(N2C=NC3=C2N=C2N=C(O)CCN2C3=[OH+])C1
59 272.0778156001 OC1=NC2=NC3=C(N=CN3C3CC=CO3)C(=[OH+])N2C=C1
60 292.1040303481 OC1=COC(N2C=NC3=C2N=C2NC(O)CCN2C3=[OH+])C1
61 302.0883802841 C=C1OC(N2C=NC3=C2N=C2N=C(O)CCN2C3=[OH+])C=C1O
62 284.0778156001 C=C1C=CC(N2C=NC3=C2N=C2N=C(O)C=CN2C3=[OH+])O1
63 302.0883802841 CC(=O)C(O)=CCN1C=NC2=C1N=C1N=C(O)C=CN1C2=[OH+] Intermediate Fragment 
64 284.0778156001 C#CC(O)=CCN1C=NC2=C1N=C1N=C(O)C=CN1C2=[OH+]
65 260.0778156001 OC#CCN1C=NC2=C1N=C1N=C(O)CCN1C2=[OH+]
66 258.0621655361 OC#CCN1C=NC2=C1N=C1N=C(O)C=CN1C2=[OH+]
67 232.0829009801 CCN1C=NC2=C1N=C1N=C(O)C=CN1C2=[OH+]
68 230.0672509161 C=CN1C=NC2=C1N=C1N=C(O)C=CN1C2=[OH+]
69 302.0883802841 C=C(C=O)OC(C)N1C=NC2=C1N=C1N=C(O)C=CN1C2=[OH+] Intermediate Fragment 
70 248.0778156001 CC(=O)N1C=NC2=C1N=C1N=C(O)CCN1C2=[OH+]
71 302.0883802841 C#COC(C=C=O)N1C=NC2=C1N=C1NC(O)CCN1C2=[OH+] Intermediate Fragment 
72 276.0727302201 O=C(C#CO)N1C=NC2=C1N=C1NC(O)CCN1C2=[OH+]
73 302.0883802841 C#CC(O)=CC(=O)N1C=NC2=C1N=C1NC(O)CCN1C2=[OH+] Intermediate Fragment 
74 302.0883802841 C=C1OC(N2C=NC3=C2N=CN(C=CC(=N)O)C3=[OH+])C=C1O Intermediate Fragment 
75 285.0618311881 C=C1OC(N2C=NC3=C2N=CN(C=C=C=O)C3=[OH+])C=C1O
76 259.0825666321 C=CN1C=NC2=C(N=CN2C2C=C(O)C(=C)O2)C1=[OH+]
77 257.0669165681 C#CN1C=NC2=C(N=CN2C2C=C(O)C(=C)O2)C1=[OH+]
78 302.0883802841 O=C=C1OC(N2C=NC3=C2N=C2NCCCN2C3=[OH+])C=C1O
79 188.0566862321 [OH+]=C1C2=C(N=C3N=CC=CN13)NC=N2
80 302.0883802841 O=CC(=O)C(O)=CCN1C=NC2=C1N=C1N=CCCN1C2=[OH+] Intermediate Fragment 
81 302.0883802841 O=C(C=C(O)C#CO)N1C=NC2=C1N=C1NCCCN1C2=[OH+] Intermediate Fragment 
82 320.0989449681 N=C1NC(O)CCN1C(=[OH+])C1=CN(C2C=C(O)C(=C=O)O2)C=N1 Intermediate Fragment 
83 303.0723958721 O=C=C1OC(N2C=NC(C(=[OH+])N3C=NC(=O)CC3)=C2)C=C1O
84 320.0989449681 O=C=C1OC(N2C=NC=C2N=C2NC(O)CCN2C=[OH+])C=C1O Intermediate Fragment 
85 292.1040303481 O=C=C1OC(N2CN=CC2=[NH+]C2=NCCC(O)N2)C=C1O
86 292.1040303481 O=C(C=C(O)C#CO)N1CN=CC1=[NH+]C1=NCCC(O)N1 Intermediate Fragment 
87 320.0989449681 O=C=C1OC(N2C=NC(=C=[OH+])C2=NC2=NCCC(O)N2)CC1O Intermediate Fragment 
88 224.0665822201 [NH2+]=C1C(=C=O)N=CN1C1CC(O)C(=CO)O1
89 222.0509321561 [NH2+]=C1C(=C=O)N=CN1C1CC(O)C(=C=O)O1
90 320.0989449681 N=C1C(=C([OH2+])N2C=NC(O)CC2)N=CN1C1C=C(O)C(=C=O)O1 Intermediate Fragment 
91 198.0873176641 [NH2+]=C1C=NCN1C1CC(O)C(=CO)O1
92 198.0873176641 [NH2+]=C1C=NCN1C(=O)CC(O)C=CO Intermediate Fragment 
93 320.0989449681 N=CN(C1=CC(=[OH+])N2CCC(O)NC2=N1)C1C=C(O)C(=C=O)O1 Intermediate Fragment 
94 303.0723958721 C[NH+](C1=CC(=O)N2C=CC(O)=NC2=N1)C1C=C(O)C(=C=O)O1
95 293.0880459361 O=C=C1OC(=[NH+]C2=CC(=O)N3CCC(O)NC3=N2)CC1O
96 166.0611029161 OC1=NC2=NC=CC(=[OH+])N2CC1
97 164.0454528521 OC1=NC2=NC=CC(=[OH+])N2C=C1
98 164.0454528521 C=CN=C1N=C(O)C=CN1C#[O+] Intermediate Fragment 
99 164.0454528521 OC1=NC(N=C=C=C=[OH+])=NCC1 Intermediate Fragment 
100 68.0130901041 [NH+]#CC=C=O
101 112.0505382321 [NH3+]C1=NC=CC(O)=N1
102 134.0348881681 [CH+]=C=NC1=NC=CC(O)=N1
103 136.0505382321 C=C=[NH+]C1=NC=CC(O)=N1
104 164.0454528521 C=CN1C(=[OH+])C=CN=C1N=C=O Intermediate Fragment 
105 153.0294684401 [NH+]#CN=C1CC(O)C(=C=O)O1
106 320.0989449681 O=C=C1OC(N=C=NC2=CN=C3NC(O)CCN3C2=[OH+])CC1O Intermediate Fragment 
107 144.0655196001 C=[NH+]C1CC(O)C(=CO)O1
108 142.0498695361 C=[NH+]C1CC(O)C(=C=O)O1
109 320.0989449681 C=NC1=C(N=C2CC(O)C(=C=O)O2)N=C2NC(O)CCN2C1=[OH+] Intermediate Fragment 
110 191.0563518841 C=[NH+]C1=CN=C2N=C(O)C=CN2C1=O
111 189.0407018201 C#[N+]C1=CN=C2N=C(O)C=CN2C1=O
112 320.0989449681 CN(C1=C(N)C(=[OH+])N2CCC(O)=NC2=N1)C1C=C(O)C(=C=O)O1 Intermediate Fragment 
113 320.0989449681 O=CC(=O)C(O)=CCN1C=NC2=C1N=C1NC(O)CCN1C2=[OH+] Intermediate Fragment 
114 302.0883802841 OC#CC(O)=CCN1C=NC2=C1N=C1N=C(O)CCN1C2=[OH+]
115 228.0516008521 C#CN1C=NC2=C1N=C1N=C(O)C=CN1C2=[OH+]
116 284.0778156001 OC#CC#CCN1C=NC2=C1N=C1N=C(O)CCN1C2=[OH+]
117 264.1091157281 OC=CCN1C=NC2=C1N=C1NC(O)CCN1C2=[OH+]
118 262.0934656641 OC#CCN1C=NC2=C1N=C1NC(O)CCN1C2=[OH+]
119 244.0829009801 C#CCN1C=NC2=C1N=C1N=C(O)CCN1C2=[OH+]
120 242.0672509161 C#CCN1C=NC2=C1N=C1N=C(O)C=CN1C2=[OH+]
121 216.0516008521 [CH2+]N1C=NC2=C1N=C1N=C(O)C=CN1C2=O
122 260.0778156001 OC#CCN1C=NC(=C=[OH+])C1=NC1=NCCC(O)=N1 Intermediate Fragment 
123 260.0778156001 N=C(O)C=CN1C=NC2=C(N=CN2CC#CO)C1=[OH+] Intermediate Fragment 
124 63.0440558841 OCC[OH2+]
125 45.0334912001 C=C[OH2+]
126 236.1142011081 CCN1C=NC2=C1N=C1NC(O)CCN1C2=[OH+]
127 234.0985510441 CCN1C=NC2=C1N=C1N=C(O)CCN1C2=[OH+]
128 232.0829009801 CCN1C=NC(=C=[OH+])C1=NC1=NC=CC(O)=N1 Intermediate Fragment 
129 232.0829009801 C=CN1C=NC2=C1N=CN(C=CC(=N)O)C2=[OH+] Intermediate Fragment 
130 228.0516008521 [C+]#CN1C=NC2=C1N=CN(C=CC(=N)O)C2=O Intermediate Fragment 
131 91.0389705041 OCC(=[OH+])CO
132 320.0989449681 C=C(O)C(=C=O)OCN1C=NC2=C1N=C1NC(O)CCN1C2=[OH+] Intermediate Fragment 
133 232.0465154721 O=CN1C=NC2=C1N=C1N=C(O)C=CN1C2=[OH+]
134 320.0989449681 CC(OC(=C=O)C=O)N1C=NC2=C1N=C1NC(O)CCN1C2=[OH+] Intermediate Fragment 
135 75.0440558841 OCC=C[OH2+]
136 73.0284058201 OCC#C[OH2+]
137 244.0465154721 [CH2+]C(=O)N1C=NC2=C1N=C1N=C(O)C=CN1C2=O
138 246.0621655361 CC(=O)N1C=NC2=C1N=C1N=C(O)C=CN1C2=[OH+]
139 248.0778156001 CC(=O)N1C=NC(=C=[OH+])C1=NC1=NCCC(O)=N1 Intermediate Fragment 
140 152.0454528521 CC(=O)N1C=NC(=C=O)C1=[NH2+]
141 248.0778156001 CC(=O)N(C=N)C1=CC(=[OH+])N2C=CC(O)=NC2=N1 Intermediate Fragment 
142 248.0778156001 CC(=O)N1C=NC2=C1N=CN(C=CC(=N)O)C2=[OH+] Intermediate Fragment 
143 250.0934656641 CC(=O)N1C=NC2=C1N=C1NC(O)CCN1C2=[OH+]
144 252.1091157281 CC(O)N1C=NC2=C1N=C1NC(O)CCN1C2=[OH+]
145 288.0727302201 CC(OC#CO)N1C=NC2=C1N=C1N=C(O)C=CN1C2=[OH+]
146 290.0883802841 CC(OC#CO)N1C=NC2=C1N=C1N=C(O)CCN1C2=[OH+]
147 292.1040303481 CC(OC#CO)N1C=NC2=C1N=C1NC(O)CCN1C2=[OH+]
148 320.0989449681 OC#COC(C=CO)N1C=NC2=C1N=C1NC(O)CCN1C2=[OH+] Intermediate Fragment 
149 47.0491412641 CC[OH2+]
150 29.0385765801 C=[CH3+]
151 274.0570801561 O=C(C#CO)N1C=NC2=C1N=C1N=C(O)CCN1C2=[OH+]
152 278.0883802841 O=C(C=CO)N1C=NC2=C1N=C1NC(O)CCN1C2=[OH+]
153 260.0778156001 C#CC(=O)N1C=NC2=C1N=C1NC(O)CCN1C2=[OH+]
154 278.0883802841 OC#COCN1C=NC2=C1N=C1NC(O)CCN1C2=[OH+]
155 276.0727302201 OC#COCN1C=NC2=C1N=C1N=C(O)CCN1C2=[OH+]
156 274.0570801561 OC#COCN1C=NC2=C1N=C1N=C(O)C=CN1C2=[OH+]
157 320.0989449681 O=C(CC(O)C#CO)N1C=NC2=C1N=C1NC(O)CCN1C2=[OH+] Intermediate Fragment 
158 68.9971056921 [O+]#CC#CO
159 41.0021910721 [C+]#CO
160 71.0127557561 O=CC#C[OH2+]
161 43.0178411361 C#C[OH2+]
162 236.0778156001 O=CN1C=NC2=C1N=C1NC(O)CCN1C2=[OH+]
163 234.0621655361 O=CN1C=NC2=C1N=C1N=C(O)CCN1C2=[OH+]
164 230.0308654081 O=C1C2=C(N=C3N=C(O)C=CN13)N(C#[O+])C=N2
165 87.0440558841 CC(O)C#C[OH2+]
166 89.0597059481 CC(O)C=C[OH2+]
167 71.0491412641 C#CC(C)[OH2+]
168 71.0491412641 CCC#C[OH2+]
169 91.0753560121 CC(O)CC[OH2+]
170 73.0647913281 C=CC(C)[OH2+]
171 73.0647913281 CCC=C[OH2+]
172 318.0832949041 O=C(C=C(O)C#CO)N1C=NC2=C1N=C1NC(O)CCN1C2=[OH+]
173 320.0989449681 NC1=NC2=C(N=CN2C2C=C(O)C(=C=O)O2)C(=[OH+])N1CCCO Intermediate Fragment 
174 292.1040303481 CCN1C(=O)C2=C(N=C1[NH3+])N(C1CC(O)C(=C=O)O1)C=N2
175 292.1040303481 CCN1C(=O)C2=C(N=C1[NH3+])N(C(=O)CC(O)C#CO)C=N2 Intermediate Fragment 
176 278.0883802841 CN1C(=O)C2=C(N=C1[NH3+])N(C1CC(O)C(=C=O)O1)C=N2
177 320.0989449681 CCN1C(=[OH+])C2=C(N=C1NCO)N(C1C=C(O)C(=C=O)O1)C=N2 Intermediate Fragment 
178 273.0618311881 C=CN1C=NC2=C(N=CN2C2C=C(O)C(=C=O)O2)C1=[OH+]
179 275.0774812521 CCN1C=NC2=C(N=CN2C2C=C(O)C(=C=O)O2)C1=[OH+]
180 277.0931313161 CCN1C=NC2=C(N=CN2C2CC(O)C(=C=O)O2)C1=[OH+]
181 277.0931313161 CCN1C=NC2=C(N=CN2C(=O)CC(O)C#CO)C1=[OH+] Intermediate Fragment 
182 288.0727302201 C=CN1C(=O)C2=C(N=C1[NH3+])N(C1C=C(O)C(=C=O)O1)C=N2
183 290.0883802841 CCN1C(=O)C2=C(N=C1[NH3+])N(C1C=C(O)C(=C=O)O1)C=N2
184 294.0832949041 O=C=C1OC(N2C=NC3=C(O)N=C([NH2+]CO)N=C32)CC1O
185 320.0989449681 CC(O)NC1=NC2=C(N=CN2C2C=C(O)C(=C=O)O2)C(=[OH+])N1C Intermediate Fragment 
186 261.0618311881 CN1C=NC2=C(N=CN2C2C=C(O)C(=C=O)O2)C1=[OH+]
187 149.0457872001 [CH2+]N1C=NC2=C(N=CN2)C1=O
188 320.0989449681 CCC(O)NC1=NC([OH2+])=C2N=CN(C3C=C(O)C(=C=O)O3)C2=N1 Intermediate Fragment 
189 320.0989449681 NC(O)CCN1C=NC2=C(N=CN2C2C=C(O)C(=C=O)O2)C1=[OH+] Intermediate Fragment 
190 303.0723958721 O=C=C1OC(N2C=NC3=C2N=CN(CCC=O)C3=[OH+])C=C1O
191 189.0407018201 O=C=C=CN1C=NC2=C(N=CN2)C1=[OH+]
192 285.0618311881 O=C=CCN1C=NC2=C(N=CN2C2C=CC(=C=O)O2)C1=[OH+]
193 303.0723958721 O=C=CCN(C=[OH+])C=NC1=CN=CN1C1C=C(O)C(=C=O)O1 Intermediate Fragment 
194 303.0723958721 O=C=CCN1C=NC2=C(N=CN2CC=C(O)C(=O)C=O)C1=[OH+] Intermediate Fragment 
195 303.0723958721 O=CCCN1C=NC2=C(N=CN2C(=O)C=C(O)C#CO)C1=[OH+] Intermediate Fragment 
196 46.0287401681 [NH2+]=CO
197 44.0130901041 [NH+]#CO
198 251.0774812521 OC=C1OC(N2C=NC3=C([OH2+])N=CN=C32)CC1O
199 135.0301371361 [OH+]=C1N=CN=C2N=CN=C12
200 251.0774812521 O=CC(=O)C(O)CCN1C=NC2=C([OH2+])N=CN=C21 Intermediate Fragment 
201 251.0774812521 O=C(CC(O)C=CO)N1C=NC2=C([OH2+])N=CN=C21 Intermediate Fragment 
202 249.0618311881 O=C=C1OC(N2C=NC3=C([OH2+])N=CN=C32)CC1O
203 137.0457872001 [OH+]=C1N=CN=C2NCN=C12
204 247.0461811241 O=C=C1OC(N2C=NC3=C([OH2+])N=CN=C32)CC1=O
205 70.0287401681 C#CC(=[NH2+])O
206 72.0443902321 C=CC(=[NH2+])O
207 76.0756903601 CCC([NH3+])O
