#In-silico ESI-MS/MS [M+H]+ Spectra
#PREDICTED BY CFM-ID 4.0.8
#SMILES=N12C=Nc3c(C1=NC(CC2O)C(CCC)O)ncn3[C@H]1C[C@H]([C@H](O1)CO)O
#InChiKey=PRCRSVDEBKTRFF-FFCSQARISA-N
energy0
190.07234 17.31 8 171 (4.8602 4.0368e-06)
246.13494 71.51 39 3 (19.391 0.69036)
264.14550 70.57 64 77 102 78 112 119 110 74 75 104 113 114 111 72 (19.578 0.12742 0.043035 0.024426 0.014362 0.013446 0.0059745 0.003498 0.0024467 0.0018915 0.00087641 0.00036567 7.9529e-05 7.202e-05)
362.18228 34.49 34 130 1 128 53 48 47 45 52 242 251 252 250 (6.5946 2.2547 0.4619 0.26695 0.044495 0.036085 0.015626 0.0048155 0.0045158 0.002395 1.303e-05 5.9013e-06 3.4684e-07)
380.19285 100.00 0 275 136 189 201 276 253 214 196 192 132 140 199 135 198 131 197 (27.723 0.08643 0.076001 0.058444 0.033522 0.026916 0.023176 0.017645 0.009588 0.0084726 0.0047675 0.0037032 0.003631 0.0021431 0.0012629 0.00045659 0.00034134)
energy1
246.13494 100.00 39 3 (73.162 1.1556)
248.15059 11.52 40 4 (8.4242 0.13976)
energy2
43.05423 8.07 150 (0.91775)
55.05423 7.00 6 (0.79661)
67.05423 6.23 151 (0.70881)
69.06988 10.78 152 (1.2261)
83.08553 13.77 159 (1.5657)
85.10118 8.68 160 (0.98752)
134.04612 16.72 96 (1.902)
178.07234 7.57 81 174 (0.81805 0.043062)
190.07234 64.68 8 171 (6.7478 0.60876)
192.08799 70.18 9 178 (7.2053 0.77754)
194.10364 17.30 66 (1.9674)
196.11929 14.57 10 (1.657)
198.13494 6.65 67 (0.75601)
220.08290 11.66 29 256 (0.99202 0.33425)
220.11929 21.82 103 (2.4824)
222.09855 6.51 30 (0.74078)
234.09855 25.90 172 69 164 165 (1.9689 0.5764 0.24555 0.1551)
234.13494 12.76 109 (1.4518)
246.13494 100.00 39 3 (9.6982 1.676)
248.11420 10.03 232 71 (0.9945 0.14581)
248.15059 17.92 40 4 (1.7083 0.33)
252.10912 17.34 173 167 177 142 166 (0.76405 0.61671 0.33599 0.23393 0.021403)
264.14550 65.52 78 64 104 102 114 77 75 110 119 72 112 74 111 113 (3.5561 1.163 1.1509 0.52874 0.35946 0.14 0.10823 0.077632 0.077167 0.06804 0.065572 0.057214 0.054637 0.046171)
278.16115 12.02 208 (1.3671)
280.10403 6.50 49 (0.73966)
290.12477 11.95 14 20 15 129 255 (0.74493 0.30382 0.27869 0.024759 0.0071725)
292.14042 11.59 203 24 244 (0.91747 0.27829 0.12244)
294.15607 7.32 202 (0.83246)
312.16663 6.57 25 (0.74717)
344.17172 8.40 2 55 44 43 249 248 (0.63154 0.20088 0.070027 0.036877 0.010264 0.0056477)

0 380.1928453521 CCCC(O)C1CC([OH2+])N2C=Nc3c(ncn3C3CC(O)C(CO)O3)C2=N1
1 362.1822806681 CCC=C([OH2+])C1=CCN2C=NC3=C(NCN3C3CC(O)C(CO)O3)C2=N1
2 344.1717159841 CCC#CC1=CCN2C=NC3=C(NCN3C3CC(O)C(C[OH2+])O3)C2=N1
3 246.1349365521 CCC=C([OH2+])C1=CCN2C=NC3=C(NCN3)C2=N1
4 248.1505866161 CCCC([OH2+])C1=CCN2C=NC3=C(NCN3)C2=N1
5 73.0647913281 CCC=C[OH2+]
6 55.0542266441 [CH2+]#CCC
7 306.1196804121 OCC1OC(N2CNC3=C2N=CN2C(=[OH+])C=CN=C32)CC1O
8 190.0723362961 [OH+]=C1C=CN=C2C3=C(N=CN12)NCN3
9 192.0879863601 [OH2+]C1C=CN=C2C3=C(N=CN21)NCN3
10 196.1192864881 [OH2+]C1CCNC2C3=C(N=CN12)NCN3
11 288.1091157281 OCC1CCC(N2C=NC3=C2N=CN2C(=[OH+])C=CN=C32)O1
12 306.1196804121 OCCC(O)CC(O)N1C=NC2=C1N=CN1C(=[OH+])C=CN=C21 Intermediate Fragment 
13 308.1353304761 OCC1OC(N2CNC3=C2N=CN2C3=NC=CC2[OH2+])CC1O
14 290.1247657921 OC1CC(N2C=NC3=C2N=CN2CC=CN=C32)OC1C[OH2+]
15 290.1247657921 OCC1CCC(N2CNC3=C2N=CN2C(=[OH+])C=CN=C32)O1
16 308.1353304761 C=C=C([OH2+])N1C=NC2=C(NCN2C2CC(O)C(CO)O2)C1=N Intermediate Fragment 
17 308.1353304761 C=C([OH2+])N1C=NC2=C(N=CN2C2CC(O)C(CO)O2)C1=NC Intermediate Fragment 
18 308.1353304761 CC(O)C(CO)OCN1CNC2=C1N=CN1C(=[OH+])C=CN=C21 Intermediate Fragment 
19 308.1353304761 OCC(O)C(O)CCN1CNC2=C1N=CN1C(=[OH+])C=CN=C21 Intermediate Fragment 
20 290.1247657921 OCCC(O)CCN1C=NC2=C1N=CN1C(=[OH+])C=CN=C21
21 308.1353304761 OCCC(O)CC(O)N1CNC2=C1N=CN1C(=[OH+])C=CN=C21 Intermediate Fragment 
22 308.1353304761 CC(OC(CO)CO)N1CNC2=C1N=CN1C(=[OH+])C=CN=C21 Intermediate Fragment 
23 310.1509805401 OCC1OC(N2CNC3=C2N=CN2C3=NCCC2[OH2+])CC1O
24 292.1404158561 OC1CC(N2CNC3=C2N=CN2CC=CN=C32)OC1C[OH2+]
25 312.1666306041 OCC1OC(N2CNC3=C2N=CN2C([OH2+])CCNC32)CC1O
26 314.1822806681 OCC1OC(N2CNC3C4NCCC([OH2+])N4C=NC32)CC1O
27 336.1302450961 OCC1=CC(=[OH+])N2C=NC3=C(NCN3C3CC(O)C(CO)O3)C2=N1
28 338.1458951601 OCC1=CC([OH2+])N2C=NC3=C(NCN3C3CC(O)C(CO)O3)C2=N1
29 220.0829009801 OCC1=CC(=[OH+])N2C=NC3=C(NCN3)C2=N1
30 222.0985510441 OCC1=CC([OH2+])N2C=NC3=C(NCN3)C2=N1
31 350.1458951601 CC(O)C1=CC(=[OH+])N2C=NC3=C(NCN3C3CC(O)C(CO)O3)C2=N1
32 352.1615452241 CC(O)C1=CC([OH2+])N2C=NC3=C(NCN3C3CC(O)C(CO)O3)C2=N1
33 364.1615452241 CCC(O)C1=CC(=[OH+])N2C=NC3=C(NCN3C3CC(O)C(CO)O3)C2=N1
34 362.1822806681 CCCCC1=CC(=[OH+])N2C=NC3=C(NCN3C3CC(O)C(CO)O3)C2=N1
35 304.1040303481 OCC1OC(N2C=NC3=C2N=CN2C(=[OH+])C=CN=C32)CC1O
36 320.1353304761 CC1=CC(=[OH+])N2C=NC3=C(NCN3C3CC(O)C(CO)O3)C2=N1
37 322.1509805401 CC1=CC([OH2+])N2C=NC3=C(NCN3C3CC(O)C(CO)O3)C2=N1
38 244.1192864881 CCC=CC1=CC(=[OH+])N2C=NC3=C(NCN3)C2=N1
39 246.1349365521 CCCCC1=CC(=[OH+])N2C=NC3=C(NCN3)C2=N1
40 248.1505866161 CCCCC1=CC([OH2+])N2C=NC3=C(NCN3)C2=N1
41 250.1662366801 CCCCC1CC([OH2+])N2C=NC3=C(NCN3)C2=N1
42 252.1818867441 CCCCC1CC([OH2+])N2C=NC3=C(NCN3)C2N1
43 344.1717159841 CCC=CC1=CC(=[OH+])N2C=NC3=C(NCN3C3CC(O)C(C)O3)C2=N1
44 344.1717159841 CCC=CC1=CC(=[OH+])N2C=NC3=C(NCN3C3CCC(CO)O3)C2=N1
45 362.1822806681 CCCC=C=C=C([OH2+])N1C=NC2=C(NCN2C2CC(O)C(CO)O2)C1=N Intermediate Fragment 
46 250.0934656641 [NH3+]C1=C2N=CN(C3=CC(O)C(CO)O3)C2=NC=N1
47 362.1822806681 C=C([OH2+])N1C=NC2=C(NCN2C2CC(O)C(CO)O2)C1=NC#CCCC Intermediate Fragment 
48 362.1822806681 C=C(C=CCC)N=C1C2=C(N=CN1C=[OH+])N(C1CC(O)C(CO)O1)CN2 Intermediate Fragment 
49 280.1040303481 [NH2+]=C1C2=C(N=CN1C=O)N(C1CC(O)C(CO)O1)C=N2
50 282.1196804121 [NH2+]=C1C2=C(N=CN1C=O)N(C1CC(O)C(CO)O1)CN2
51 334.1873660481 CCC=CC(C)=[NH+]C1=C2NCN(C3CC(O)C(CO)O3)C2=NC=N1
52 362.1822806681 CCC=CC1=CC(=[OH+])N2C=NC3=C(NCN3COC(CO)C(C)O)C2=N1 Intermediate Fragment 
53 362.1822806681 CCC=CC1=CC(=[OH+])N2C=NC3=C(NCN3C(O)CC(O)CCO)C2=N1 Intermediate Fragment 
54 290.1611513001 CCCCC1=CC(=[OH+])N2C=NC3=C(NCN3C(C)O)C2=N1
55 344.1717159841 CCC#CC1=CC(=[OH+])N2C=NC3=C(NCN3CCC(O)CCO)C2=N1
56 119.0702706321 OC1CCOC1C[OH2+]
57 117.0546205681 OC1C=COC1C[OH2+]
58 99.0440558841 CC1=C([OH2+])C=CO1
59 117.0546205681 C=COC(=CO)C[OH2+] Intermediate Fragment 
60 45.0334912001 C=C[OH2+]
61 117.0546205681 OC=C=C(O)CC[OH2+] Intermediate Fragment 
62 115.0389705041 OC1=C(C[OH2+])OC=C1
63 262.1298511721 CCCC(O)C1=CC(=[OH+])N2C=NC3=C(NCN3)C2=N1
64 264.1455012361 CCCC(O)C1=CC([OH2+])N2C=NC3=C(NCN3)C2=N1
65 75.0804413921 CCCC[OH2+]
66 194.1036364241 [OH2+]C1CCN=C2C3=C(N=CN21)NCN3
67 198.1349365521 [OH2+]C1CCNC2C3NCNC3N=CN12
68 224.1142011081 OCC1CC([OH2+])N2C=NC3=C(NCN3)C2=N1
69 234.0985510441 CC(O)C1=CC(=[OH+])N2C=NC3=C(NCN3)C2=N1
70 236.1142011081 CC(O)C1=CC([OH2+])N2C=NC3=C(NCN3)C2=N1
71 248.1142011081 CCC(O)C1=CC(=[OH+])N2C=NC3=C(NCN3)C2=N1
72 264.1455012361 CCC=C(O)C1=NC(=C2NCNC2=N)N(C)C([OH2+])=C1 Intermediate Fragment 
73 262.1298511721 CC=C=C(O)C1=NC(=C2NCNC2=[NH2+])N(C)C(O)=C1
74 264.1455012361 CCCC(O)C1=CC(=[OH+])N(C=N)C(C2=CNCN2)=N1 Intermediate Fragment 
75 264.1455012361 CCCC(O)C1=CC(=[OH+])N(C=NC2=CNCN2)C=N1 Intermediate Fragment 
76 171.1128041401 CCCC(O)C1=CC([OH2+])NC=N1
77 264.1455012361 C=NC1=C(C2=NC(C(O)CCC)=CC(=[OH+])N2)NCN1 Intermediate Fragment 
78 264.1455012361 CCCC(O)C=C=C([OH2+])N1C=NC2=C(NCN2)C1=N Intermediate Fragment 
79 182.1036364241 CC(O)N1C=NC2=C(NCN2)C1=[NH2+]
80 180.0879863601 C=C(O)N1C=NC2=C(NCN2)C1=[NH2+]
81 178.0723362961 C=C(O)N1C=NC2=C(N=CN2)C1=[NH2+]
82 176.0566862321 [CH+]=C(O)N1C=NC2=C(N=CN2)C1=N
83 83.0491412641 C=C([OH2+])C#CC
84 85.0647913281 C=C([OH2+])C=CC
85 87.0804413921 C=C([OH2+])CCC
86 170.1036364241 [NH3+]C1C2=C(N=CN1CO)NCN2
87 168.0879863601 [NH2+]=C1C2=C(N=CN1CO)NCN2
88 164.0566862321 [NH2+]=C1C2=C(N=CN1C=O)NC=N2
89 97.0647913281 C#CC([OH2+])=CCC
90 99.0804413921 C#CC([OH2+])CCC
91 101.0960914561 C=CC([OH2+])CCC
92 103.1117415201 CCCC([OH2+])CC
93 140.0930717401 [NH3+]C1N=CN=C2NCNC21
94 138.0774216761 [NH2+]=C1N=CN=C2NCNC12
95 136.0617716121 [NH2+]=C1N=CN=C2NCN=C12
96 134.0461215481 [NH2+]=C1N=CN=C2N=CN=C12
97 125.0597059481 CCC=C(O)C#CC=[OH+]
98 127.0753560121 CCCC(O)C#CC=[OH+]
99 129.0910060761 CCCC(O)C#CC[OH2+]
100 131.1066561401 CCCC(O)C=CC[OH2+]
101 262.1298511721 CCCC(O)C#CC(=O)N1C=NC2=C(NCN2)C1=[NH2+]
102 264.1455012361 C=C([OH2+])N1C=NC2=C(NCN2)C1=NC=C(O)CCC Intermediate Fragment 
103 220.1192864881 CCCC(O)=C=[NH+]C1=C2NCNC2=NC=N1
104 264.1455012361 C=C(N=C1C2=C(N=CN1C=[OH+])NCN2)C(O)CCC Intermediate Fragment 
105 118.1226405521 CCCC(O)C(C)[NH3+]
106 116.1069904881 CCCC(O)C(C)=[NH2+]
107 114.0913404241 CCC=C(O)C(C)=[NH2+]
108 236.1505866161 CCCC(O)C(C)=[NH+]C1=C2NCNC2=NC=N1
109 234.1349365521 CCC=C(O)C(C)=[NH+]C1=C2NCNC2=NC=N1
110 264.1455012361 CCCC(O)C(C=C[OH2+])=NC1=C2NCNC2=NC=N1 Intermediate Fragment 
111 264.1455012361 CCC=C(O)C(=N)C=C([OH2+])N1C=NC2=C(C1)NCN2 Intermediate Fragment 
112 264.1455012361 CCCC(O)C1=CC(=[OH+])N2C=NC(NCN)=CC2=N1 Intermediate Fragment 
113 264.1455012361 CCCC(O)C1=CC(=[OH+])N2C=NC=C(NCN)C2=N1 Intermediate Fragment 
114 264.1455012361 CCCC(O)C1=CC(=[OH+])N2C=NC(N)=C(NC)C2=N1 Intermediate Fragment 
115 235.1189521401 CCCC(O)C1=CC(=O)N2C=NC([NH3+])=CC2=N1
116 237.1346022041 CCCC(O)C1=CC(O)N2C=NC([NH3+])=CC2=N1
117 247.1189521401 CCC=C(O)C1=CC(=O)N2C=NC=C([NH2+]C)C2=N1
118 262.1298511721 CCC=C(O)C1=CC(=O)N2C=NC(N)=C([NH2+]C)C2=N1
119 264.1455012361 CCCC(O)C1=CC(=[OH+])N2C=NC(NC)=C(N)C2=N1 Intermediate Fragment 
120 266.1611513001 CCCC(O)C1CC([OH2+])N2C=NC3=C(NCN3)C2=N1
121 266.1611513001 CCCC(O)C=CC([OH2+])N1C=NC2=C(NCN2)C1=N Intermediate Fragment 
122 268.1768013641 CCCC(O)C1CC([OH2+])N2C=NC3=C(NCN3)C2N1
123 200.1505866161 [OH2+]C1CCNC2C3NCNC3NCN12
124 268.1768013641 CCCC(O)CCC([OH2+])N1C=NC2=C(NCN2)C1=N Intermediate Fragment 
125 270.1924514281 CCCC(O)C1CC([OH2+])N2C=NC3NCNC3C2N1
126 348.1666306041 CCCC(O)C1=CC(=[OH+])N2C=NC3=C(NCN3C3CC(O)CO3)C2=N1
127 350.1822806681 CCCC(O)C1=CC([OH2+])N2C=NC3=C(NCN3C3CC(O)CO3)C2=N1
128 362.1822806681 CCCC(O)C1=CC(=[OH+])N2C=NC3=C(NCN3C3CC(O)C(C)O3)C2=N1
129 290.1247657921 CC1OC(N2CNC3=C2N=CN2C(=[OH+])C=CN=C32)CC1O
130 362.1822806681 CCCC(O)C1=CC(=[OH+])N2C=NC3=C(NCN3C3CCC(CO)O3)C2=N1
131 380.1928453521 CCC=C(O)C1=NC(=C2NCN(C3CC(O)C(CO)O3)C2=N)N(C)C([OH2+])=C1 Intermediate Fragment 
132 380.1928453521 CCCC(O)C1=CC(=[OH+])N(C=N)C(C2=CN(C3CC(O)C(CO)O3)CN2)=N1 Intermediate Fragment 
133 353.1819463201 CCCC(O)C1=CC(=[OH+])NC(C2=CN(C3CC(O)C(CO)O3)CN2)=N1
134 335.1713816361 CCC=CC1=CC(=[OH+])NC(C2=CN(C3CC(O)C(CO)O3)CN2)=N1
135 380.1928453521 CCCC(O)C1=CC(=[OH+])N(C=NC2=CNCN2C2CC(O)C(CO)O2)C=N1 Intermediate Fragment 
136 380.1928453521 C=NC1=C(C2=NC(C(O)CCC)=CC(=[OH+])N2)NCN1C1CC(O)C(CO)O1 Intermediate Fragment 
137 210.0873176641 C=[NH+]C1=CN=CN1C1=CC(O)C(CO)O1
138 94.0399735481 C#[N+]C1=CN=CN1
139 212.1029677281 C=[NH+]C1=CN=CN1C1CC(O)C(CO)O1
140 380.1928453521 CCCC(O)C=C=C([OH2+])N1C=NC2=C(NCN2C2CC(O)C(CO)O2)C1=N Intermediate Fragment 
141 298.1509805401 CC(O)N1C=NC2=C(NCN2C2CC(O)C(CO)O2)C1=[NH2+]
142 252.1091157281 [NH3+]C1=C2N=CN(C3CC(O)C(CO)O3)C2=NC=N1
143 296.1353304761 C=C(O)N1C=NC2=C(NCN2C2CC(O)C(CO)O2)C1=[NH2+]
144 278.1247657921 C#CN1C=NC2=C(NCN2C2CC(O)C(CO)O2)C1=[NH2+]
145 294.1196804121 C=C(O)N1C=NC2=C(N=CN2C2CC(O)C(CO)O2)C1=[NH2+]
146 294.1196804121 C=C(O)N1C=NC2=C(N=CN2C=CC(O)C(O)CO)C1=[NH2+] Intermediate Fragment 
147 276.1091157281 C=C(O)N1C=NC2=C(N=CN2C#CC(O)CCO)C1=[NH2+]
148 294.1196804121 C=C(O)N1C=NC2=C(N=CN2C(O)=CC(O)CCO)C1=[NH2+] Intermediate Fragment 
149 292.1040303481 C=C(O)N1C=NC2=C(N=CN2C2=CC(O)C(CO)O2)C1=[NH2+]
150 43.0542266441 CC=[CH3+]
151 67.0542266441 [CH2+]#CC=CC
152 69.0698767081 [CH2+]#CCCC
153 89.0960914561 CCCC(C)[OH2+]
154 71.0855267721 CCCC=[CH3+]
155 286.1509805401 [NH3+]C1C2=C(N=CN1CO)N(C1CC(O)C(CO)O1)CN2
156 284.1353304761 [NH2+]=C1C2=C(N=CN1CO)N(C1CC(O)C(CO)O1)CN2
157 81.0698767081 C#[CH+]C=CCC
158 73.0647913281 C=CC(C)[OH2+]
159 83.0855267721 C#[CH+]CCCC
160 85.1011768361 C=[CH2+]CCCC
161 256.1404158561 [NH3+]C1N=CN=C2C1NCN2C1CC(O)C(CO)O1
162 254.1247657921 [NH3+]C1=C2NCN(C3CC(O)C(CO)O3)C2=NC=N1
163 142.1087218041 [NH3+]C1N=CNC2NCNC12
164 234.0985510441 CC1OC(N2C=NC3=C([NH3+])N=CN=C32)=CC1O
165 234.0985510441 [NH3+]C1=C2N=CN(C3=CCC(CO)O3)C2=NC=N1
166 252.1091157281 C=C(O)C(CO)OCN1C=NC2=C([NH3+])N=CN=C21 Intermediate Fragment 
167 252.1091157281 [NH3+]C1=C2N=CN(C=CC(O)C(O)CO)C2=NC=N1 Intermediate Fragment 
168 91.0389705041 OC=C([OH2+])CO
169 160.0617716121 C#CN1C=NC2=C([NH3+])N=CN=C21
170 162.0774216761 C=CN1C=NC2=C([NH3+])N=CN=C21
171 190.0723362961 [NH3+]C1=C2N=CN(C#CCO)C2=NC=N1
172 234.0985510441 [NH3+]C1=C2N=CN(C#CC(O)CCO)C2=NC=N1
173 252.1091157281 [NH3+]C1=C2N=CN(C(O)=CC(O)CCO)C2=NC=N1 Intermediate Fragment 
174 178.0723362961 C=C(O)N1C=NC2=C([NH3+])N=CN=C21
175 206.0672509161 [NH3+]C1=C2N=CN(C(O)=C=CO)C2=NC=N1
176 208.0829009801 [NH3+]C1=C2N=CN(C(O)=CCO)C2=NC=N1
177 252.1091157281 [NH3+]C1=C2N=CN(C(=CCO)OCCO)C2=NC=N1 Intermediate Fragment 
178 192.0879863601 [NH3+]C1=C2N=CN(C=CCO)C2=NC=N1
179 232.0829009801 CC1=C(O)C=C(N2C=NC3=C([NH3+])N=CN=C32)O1
180 250.0934656641 [NH3+]C1=C2N=CN(C=C=C(O)C(O)CO)C2=NC=N1 Intermediate Fragment 
181 232.0829009801 [NH3+]C1=C2N=CN(C#CC(O)=CCO)C2=NC=N1
182 250.0934656641 [NH3+]C1=C2N=CN(C(O)=C=C(O)CCO)C2=NC=N1 Intermediate Fragment 
183 250.0934656641 [NH3+]C1=C2N=CN(C(=C=CO)OCCO)C2=NC=N1 Intermediate Fragment 
184 248.0778156001 [NH3+]C1=C2N=CN(C3=CC(O)=C(CO)O3)C2=NC=N1
185 109.0647913281 CC#CC([OH2+])=C=CC
186 109.0647913281 CCC=CC#CC=[OH+]
187 111.0804413921 CC#CC([OH2+])=CCC
188 133.1223062041 CCCC(O)CCC[OH2+]
189 380.1928453521 C=C([OH2+])N1C=NC2=C(NCN2C2CC(O)C(CO)O2)C1=NC=C(O)CCC Intermediate Fragment 
190 338.1822806681 CCCC(O)C=[NH+]C1=C2NCN(C3CC(O)C(CO)O3)C2=NC=N1
191 336.1666306041 CCCC(O)=C=[NH+]C1=C2NCN(C3CC(O)C(CO)O3)C2=NC=N1
192 380.1928453521 C=C(N=C1C2=C(N=CN1C=[OH+])N(C1CC(O)C(CO)O1)CN2)C(O)CCC Intermediate Fragment 
193 98.0964258041 CCC=CC(C)=[NH2+]
194 352.1979307321 CCCC(O)C(C)=[NH+]C1=C2NCN(C3CC(O)C(CO)O3)C2=NC=N1
195 350.1822806681 CCC=C(O)C(C)=[NH+]C1=C2NCN(C3CC(O)C(CO)O3)C2=NC=N1
196 380.1928453521 CCCC(O)C(C=C[OH2+])=NC1=C2NCN(C3CC(O)C(CO)O3)C2=NC=N1 Intermediate Fragment 
197 380.1928453521 CCC=C(O)C(=N)C=C([OH2+])N1C=NC2=C(C1)NCN2C1CC(O)C(CO)O1 Intermediate Fragment 
198 380.1928453521 CCCC(O)C1=CC(=[OH+])N2C=NC(N(CN)C3CC(O)C(CO)O3)=CC2=N1 Intermediate Fragment 
199 380.1928453521 CCCC(O)C1=CC(=[OH+])N2C=NC(NC3CC(O)C(CO)O3)=C(NC)C2=N1 Intermediate Fragment 
200 249.1346022041 CCCC(O)C1=CC(=O)N2C=NC=C([NH2+]C)C2=N1
201 380.1928453521 CCCC(O)C1=CC(=[OH+])N2C=NC3=C(NCN3COC(CO)C(C)O)C2=N1 Intermediate Fragment 
202 294.1560659201 CCCC(O)C1=CC([OH2+])N2C=NC3=C(NCN3CO)C2=N1
203 292.1404158561 CCCC(O)C1=CC(=[OH+])N2C=NC3=C(NCN3CO)C2=N1
204 87.0440558841 C=C(O)C=C[OH2+]
205 89.0597059481 C=C(O)CC[OH2+]
206 282.1924514281 CCCC(O)C1CC([OH2+])N2C=NC3=C(NCN3C)C2N1
207 280.1768013641 CCCC(O)C1CC([OH2+])N2C=NC3=C(NCN3C)C2=N1
208 278.1611513001 CCCC(O)C1=CC([OH2+])N2C=NC3=C(NCN3C)C2=N1
209 276.1455012361 CCCC(O)C1=CC(=[OH+])N2C=NC3=C(NCN3C)C2=N1
210 258.1349365521 CCC=CC1=CC(=[OH+])N2C=NC3=C(NCN3C)C2=N1
211 276.1455012361 CCCC(O)=C=C=C([OH2+])N1C=NC2=C(NCN2C)C1=N Intermediate Fragment 
212 274.1298511721 CCC=C(O)C1=CC(=[OH+])N2C=NC3=C(NCN3C)C2=N1
213 256.1192864881 CCC#CC1=CC(=[OH+])N2C=NC3=C(NCN3C)C2=N1
214 380.1928453521 CCCC(O)C1=CC(=[OH+])N2C=NC3=C(NCN3CCC(O)C(O)CO)C2=N1 Intermediate Fragment 
215 105.0546205681 C=C(O)C([OH2+])CO
216 93.0546205681 OCC([OH2+])CO
217 61.0284058201 OCC=[OH+]
218 73.0284058201 OC#CC[OH2+]
219 73.0284058201 CC([OH2+])=C=O
220 89.0233204401 O=CC([OH2+])=CO
221 288.1455012361 CCC=C(O)C1=CC(=[OH+])N2C=NC3=C(NCN3CC)C2=N1
222 270.1349365521 CCC#CC1=CC(=[OH+])N2C=NC3=C(NCN3CC)C2=N1
223 290.1611513001 CCCC(O)C1=CC(=[OH+])N2C=NC3=C(NCN3CC)C2=N1
224 272.1505866161 CCC=CC1=CC(=[OH+])N2C=NC3=C(NCN3CC)C2=N1
225 292.1768013641 CCCC(O)C1=CC([OH2+])N2C=NC3=C(NCN3CC)C2=N1
226 274.1662366801 CCCCC1=CC(=[OH+])N2C=NC3=C(NCN3CC)C2=N1
227 294.1924514281 CCCC(O)C1CC([OH2+])N2C=NC3=C(NCN3CC)C2=N1
228 296.2081014921 CCCC(O)C1CC([OH2+])N2C=NC3=C(NCN3CC)C2N1
229 63.0440558841 OCC[OH2+]
230 318.1560659201 CCC=C(O)C1=CC(=[OH+])N2C=NC3=C(NCN3CCCO)C2=N1
231 246.0985510441 OCCCN1C=NC2=C1N=CN1C(=[OH+])C=CN=C21
232 248.1142011081 OCCCN1CNC2=C1N=CN1C(=[OH+])C=CN=C21
233 300.1455012361 CCC#CC1=CC(=[OH+])N2C=NC3=C(NCN3CCCO)C2=N1
234 320.1717159841 CCCC(O)C1=CC(=[OH+])N2C=NC3=C(NCN3CCCO)C2=N1
235 302.1611513001 CCC=CC1=CC(=[OH+])N2C=NC3=C(NCN3CCCO)C2=N1
236 320.1717159841 CCCC(O)=C=C=C([OH2+])N1C=NC2=C(NCN2CCCO)C1=N Intermediate Fragment 
237 320.1717159841 C=C([OH2+])N1C=NC2=C(NCN2CCCO)C1=NC=C(O)C=CC Intermediate Fragment 
238 322.1873660481 CCCC(O)C1=CC([OH2+])N2C=NC3=C(NCN3CCCO)C2=N1
239 304.1768013641 CCCCC1=CC(=[OH+])N2C=NC3=C(NCN3CCCO)C2=N1
240 322.1873660481 CCCC(O)C=C=C([OH2+])N1C=NC2=C(NCN2CCCO)C1=N Intermediate Fragment 
241 324.2030161121 CCCC(O)C1CC([OH2+])N2C=NC3=C(NCN3CCCO)C2=N1
242 362.1822806681 CCC=C(O)C1=CC(=[OH+])N2C=NC3=C(NCN3CCC(O)CCO)C2=N1
243 288.1091157281 OCCC(O)C=CN1C=NC2=C1N=CN1C(=[OH+])C=CN=C21
244 292.1404158561 OCCC(O)CCN1CNC2=C1N=CN1C(=[OH+])C=CN=C21
245 103.0753560121 C=CC(O)CC[OH2+]
246 101.0597059481 C#CC(O)CC[OH2+]
247 316.1404158561 CC=C=C(O)C1=CC(=[OH+])N2C=NC3=C(NCN3CCCO)C2=N1
248 344.1717159841 CC=C=C(O)C1=CC(=[OH+])N2C=NC3=C(NCN3CCC(O)CC)C2=N1
249 344.1717159841 CC=C=C(O)C1=CC(=[OH+])N2C=NC3=C(NCN3CCCCCO)C2=N1
250 362.1822806681 CC=CC(O)=C=C=C([OH2+])N1C=NC2=C(NCN2CCC(O)CCO)C1=N Intermediate Fragment 
251 362.1822806681 C=C([OH2+])N1C=NC2=C(NCN2CCC(O)CCO)C1=NC=C(O)C#CC Intermediate Fragment 
252 362.1822806681 CCC=C(O)C(C=C=[OH+])=NC1=C2NCN(CCC(O)CCO)C2=NC=N1 Intermediate Fragment 
253 380.1928453521 CCCC(O)C1=CC(=[OH+])N2C=NC3=C(NCN3C(O)CC(O)CCO)C2=N1 Intermediate Fragment 
254 91.0753560121 CC(O)CC[OH2+]
255 290.1247657921 CCC=C(O)C1=CC(=[OH+])N2C=NC3=C(NCN3CO)C2=N1
256 220.0829009801 OCN1CNC2=C1N=CN1C(=[OH+])C=CN=C21
257 272.1142011081 CCC#CC1=CC(=[OH+])N2C=NC3=C(NCN3CO)C2=N1
258 296.1717159841 CCCC(O)C1CC([OH2+])N2C=NC3=C(NCN3CO)C2=N1
259 77.0597059481 OCCC[OH2+]
260 59.0491412641 CC=C[OH2+]
261 75.0440558841 OC=CC[OH2+]
262 57.0334912001 C#CC[OH2+]
263 55.0178411361 [CH2+]C#CO
264 304.1404158561 CCC=C(O)C1=CC(=[OH+])N2C=NC3=C(NCN3C(C)O)C2=N1
265 286.1298511721 CCC#CC1=CC(=[OH+])N2C=NC3=C(NCN3C(C)O)C2=N1
266 306.1560659201 CCCC(O)C1=CC(=[OH+])N2C=NC3=C(NCN3C(C)O)C2=N1
267 288.1455012361 CCC=CC1=CC(=[OH+])N2C=NC3=C(NCN3C(C)O)C2=N1
268 308.1717159841 CCCC(O)C1=CC([OH2+])N2C=NC3=C(NCN3C(C)O)C2=N1
269 310.1873660481 CCCC(O)C1CC([OH2+])N2C=NC3=C(NCN3C(C)O)C2=N1
270 312.2030161121 CCCC(O)C1CC([OH2+])N2C=NC3=C(NCN3C(C)O)C2N1
271 334.1509805401 CCC=C(O)C1=CC(=[OH+])N2C=NC3=C(NCN3C(O)CCO)C2=N1
272 336.1666306041 CCCC(O)C1=CC(=[OH+])N2C=NC3=C(NCN3C(O)CCO)C2=N1
273 338.1822806681 CCCC(O)C1=CC([OH2+])N2C=NC3=C(NCN3C(O)CCO)C2=N1
274 378.1771952881 CCC=C(O)C1=CC(=[OH+])N2C=NC3=C(NCN3C(O)CC(O)CCO)C2=N1
275 380.1928453521 CCCC(O)C1=CC(=[OH+])N2C=NC3=C(NCN3C(CCO)OCCO)C2=N1 Intermediate Fragment 
276 380.1928453521 CCCC(O)C1=CC(=[OH+])N2C=NC3=C(NCN3C(C)OC(CO)CO)C2=N1 Intermediate Fragment 
