#In-silico ESI-MS/MS [M+H]+ Spectra
#PREDICTED BY CFM-ID 4.0.8
#SMILES=[nH]1c(nc2c(c1=O)nc(n2[C@@H]1O[C@H](CO)[C@@H](C1)O)Nc1cc2c(cc1)c1c(cc2)cccc1)N
#InChiKey=LNZCLSRHPHZVRV-GUDVDZBRSA-N
energy0
343.13019 33.20 11 54 24 31 57 35 56 58 18 32 37 44 48 55 52 46 53 51 49 41 50 (22.969 0.087692 0.0405 0.031125 0.026681 0.016973 0.010014 0.0099259 0.0099229 0.0072216 0.0060906 0.0056985 0.0042449 0.0039527 0.0038355 0.0019612 0.0016265 0.0015746 0.0011593 0.0010868 0.00013167)
459.17753 100.00 0 175 137 215 172 234 98 236 135 104 122 123 219 207 161 218 229 159 206 136 202 125 132 223 208 200 204 205 (68.432 0.98775 0.21132 0.097622 0.093578 0.036482 0.029056 0.014519 0.011906 0.010117 0.0092094 0.0086565 0.007984 0.0074811 0.0074052 0.0072098 0.0060306 0.0056711 0.0038113 0.003704 0.0020793 0.0012888 0.0012558 0.0011988 0.00071346 0.00068302 0.00058009 2.7693e-05)
energy1
326.10364 5.30 17 19 40 34 (2.9351 0.54446 0.061647 0.010946)
341.11454 2.96 10 30 43 47 45 (1.9431 0.031719 0.0042675 0.0015308 0.00089832)
343.13019 100.00 11 24 18 31 58 56 57 54 41 48 32 46 55 35 52 44 53 37 50 51 49 (63.529 0.92031 0.54429 0.4039 0.31705 0.21338 0.17549 0.17234 0.14619 0.12676 0.1202 0.088742 0.075692 0.074063 0.036708 0.024132 0.023435 0.01856 0.0089682 0.0084226 0.0051663)
441.16696 5.06 65 138 83 80 1 71 76 84 72 75 (2.5138 0.55818 0.083154 0.081119 0.067073 0.027911 0.022486 0.019808 0.015952 0.00059107)
459.17753 7.06 0 175 137 104 161 122 159 123 172 215 202 98 234 219 229 236 135 200 218 208 223 207 132 125 136 206 205 204 (3.2043 1.1799 0.16405 0.040969 0.03473 0.023843 0.013229 0.012727 0.010625 0.010132 0.0080068 0.0067083 0.0063317 0.0033904 0.00338 0.0033185 0.0020578 0.0012738 0.0012171 0.0010271 0.00084302 0.00060607 0.00052371 0.00026604 0.00013719 6.38e-05 6.2703e-05 5.7874e-05)
energy2
43.01784 3.83 184 (0.80974)
45.03349 9.24 149 (1.9535)
55.01784 4.55 185 (0.96251)
73.06479 3.73 197 196 (0.39777 0.39032)
75.04406 29.21 118 (6.1737)
89.05971 9.52 160 (2.0115)
125.04579 4.53 39 (0.95759)
150.04104 4.95 14 (1.0455)
152.05669 4.20 93 (0.88796)
179.08553 4.89 15 (1.0336)
194.09643 24.80 13 89 (4.7551 0.48625)
326.10364 6.78 17 40 19 34 (1.3598 0.046292 0.018692 0.0093199)
341.11454 11.08 10 45 30 47 43 (2.1753 0.065433 0.046122 0.033215 0.022131)
343.13019 100.00 11 24 32 18 44 37 41 46 31 35 48 54 50 58 56 53 57 55 52 51 49 (11.394 3.4482 1.2049 1.015 0.80547 0.74363 0.45804 0.37913 0.22062 0.21974 0.1831 0.14054 0.12784 0.1175 0.10896 0.10831 0.10697 0.10518 0.089326 0.087395 0.07412)
347.16149 3.87 60 (0.81824)
367.13019 13.04 152 153 (1.7003 1.0564)
369.14584 46.23 81 (9.7717)
371.12510 6.04 188 189 190 (0.70489 0.35387 0.21703)
372.13427 4.45 102 (0.94043)
381.14584 5.15 142 (1.088)
385.14075 9.42 162 163 164 (0.92584 0.55748 0.50778)
389.17205 4.40 167 (0.93067)
391.18770 4.40 168 (0.93067)
399.15640 28.10 78 144 145 174 146 (1.9701 1.4163 0.96818 0.85467 0.73042)
415.15131 4.05 85 (0.85581)
417.15573 3.38 100 (0.71544)
423.15640 3.75 77 68 66 (0.71308 0.057581 0.021201)
429.16696 4.18 63 170 (0.63043 0.2522)
439.15131 4.56 199 (0.96438)
457.16188 10.17 121 131 158 198 (1.5283 0.36317 0.17236 0.085192)

0 459.1775296361 Nc1nc2c(nc([NH2+]c3ccc4c(ccc5ccccc54)c3)n2C2CC(O)C(CO)O2)c(=O)[nH]1
1 441.1669649521 NC1=NC=C2N=C([NH+]=C3C=C4C=CC5=C(CCCC5)C4=CC3)N(C3C=C(O)C(=C=O)O3)C2=N1
2 327.1352709001 N=C1N=C2N=C([NH+]=C3C=C4C=CC5=C(C=CC=C5)C4=CC3)N=C2CN1
3 119.0702706321 OC1CCOC1C[OH2+]
4 117.0546205681 OC1CCOC1=C[OH2+]
5 99.0440558841 C=C1OCC=C1[OH2+]
6 117.0546205681 CCC(O)C(=O)C=[OH+] Intermediate Fragment 
7 99.0440558841 CC=C(O)C#C[OH2+]
8 117.0546205681 O=CCC(O)C=C[OH2+] Intermediate Fragment 
9 115.0389705041 OC1CCOC1=C=[OH+]
10 341.1145354561 NC1=NC(=O)C2=NC([NH+]=C3C=C4C=CC5=C(C=CC=C5)C4=CC3)=NC2=N1
11 343.1301855201 NC1=NC(=O)C2=NC([NH+]=C3C=C4C=CC5=C(CCC=C5)C4=CC3)=NC2=N1
12 325.1196208361 N=C1N=CC2=NC([NH+]=C3C=C4C=CC5=C(C=CC=C5)C4=CC3)=NC2=N1
13 194.0964258041 [NH2+]=C1C=C2C=CC3=C(C=CC=C3)C2=CC1
14 150.0410361681 [NH3+]C1=NC(=O)C2=NC=NC2=N1
15 179.0855267721 C1=CC2=C(C=C1)C1=C(C=C2)C=[CH2+]C=C1
16 165.0519352001 NC1=NC(=O)C2=NC([NH3+])=NC2=N1
17 326.1036364241 O=C1N=CN=C2N=C([NH+]=C3C=C4C=CC5=C(C=CC=C5)C4=CC3)N=C12
18 343.1301855201 N=C(N)N=C1NC([NH+]=C2C=C3C=CC4=C(C=CC=C4)C3=CC2)=NC1=C=O Intermediate Fragment 
19 326.1036364241 N=C=NC1=C(C#[O+])N=C(N=C2C=C3C=CC4=C(C=CC=C4)C3=CC2)N1
20 301.1083874561 [NH2+]=C1N=C(N=C2C=C3C=CC4=C(C=CC=C4)C3=CC2)N=C1C=O
21 299.0927373921 N=C1N=C(N=C2C=C3C=CC4=C(C=CC=C4)C3=CC2)N=C1C#[O+]
22 284.0818383601 [O+]#CC1=NC(=NC2=CC3=C(C=C2)C2=C(C=CC=C2)C=C3)N=C1
23 315.1352709001 NC(=[NH2+])N=C1C=NC(N=C2C=C3C=CC4=C(C=CC=C4)C3=CC2)=N1
24 343.1301855201 NC(=NC=O)N=C1C=NC([NH+]=C2C=C3C=CC4=C(C=CC=C4)C3=CC2)=N1 Intermediate Fragment 
25 300.1243718681 N=C=[NH+]C1C=NC(N=C2C=C3C=CC4=C(C=CC=C4)C3=CC2)=N1
26 298.1087218041 N=C=[N+]=C1C=NC(N=C2C=C3C=CC4=C(C=CC=C4)C3=CC2)=N1
27 275.1291229001 [NH2+]=C1C=NC(N=C2C=C3C=CC4=C(CCC=C4)C3=CC2)=N1
28 273.1134728361 [NH2+]=C1C=NC(N=C2C=C3C=CC4=C(C=CC=C4)C3=CC2)=N1
29 258.1025738041 C1=CC2=C(C=C1)C1=C(C=C2)C=C([NH+]=C2N=CC=N2)C=C1
30 341.1145354561 NC(=NC#[O+])N=C1C=NC(N=C2C=C3C=CC4=C(C=CC=C4)C3=CC2)=N1
31 343.1301855201 NC(N)=NC(=O)C1=NC(=[NH+]C2=CC3=C(C=C2)C2=C(C=CC=C2)C=C3)N=C1 Intermediate Fragment 
32 343.1301855201 N=C=NC(O)=C1N=C([NH+]=C2C=C3C=CC4=C(C=CC=C4)C3=CC2)NC1=N Intermediate Fragment 
33 316.1192864881 N=C1N=C(N=C2C=C3C=CC4=C(C=CC=C4)C3=CC2)N=C1C([NH3+])=O
34 326.1036364241 N=C=[NH+]C(=O)C1=NC(=NC2=CC3=C(C=C2)C2=C(C=CC=C2)C=C3)N=C1
35 343.1301855201 N=C=NC1=C(C(N)=O)N=C([NH+]=C2C=C3C=CC4=C(C=CC=C4)C3=CC2)N1 Intermediate Fragment 
36 301.1083874561 [NH3+]C(=O)C1=NC(=NC2=CC3=C(C=C2)C2=C(C=CC=C2)C=C3)N=C1
37 343.1301855201 N=C(N=C1C=NC(N)=NC1=O)[NH+]=C1C=C2C=CC3=C(C=CC=C3)C2=CC1 Intermediate Fragment 
38 219.0916747721 [NH+]#CN=C1C=C2C=CC3=C(C=CC=C3)C2=CC1
39 125.0457872001 NC1=NC(=O)C(=[NH2+])C=N1
40 326.1036364241 NC1=NC(=O)C(=[N+]=C=NC2=CC3=C(C=C2)C2=C(C=CC=C2)C=C3)C=N1
41 343.1301855201 NC1=NC(O)=C(N=C=[NH+]C2=CC3=C(C=C2)C2=C(C=CC=C2)C=C3)C(N)=N1 Intermediate Fragment 
42 140.0566862321 NC1=NC(=O)C(=[NH2+])C(N)=N1
43 341.1145354561 NC1=NC(=O)C(=[N+]=C=NC2=CC3=C(C=C2)C2=C(C=CC=C2)C=C3)C(N)=N1
44 343.1301855201 NC1=NC(O)=C(N)C(N=C=[NH+]C2=CC3=C(C=C2)C2=C(C=CC=C2)C=C3)=N1 Intermediate Fragment 
45 341.1145354561 NC1=NC(=O)C(=[NH2+])C(N=C=NC2=CC3=C(C=C2)C2=C(C=CC=C2)C=C3)=N1
46 343.1301855201 CC(C=CC1=CC=CC2=C1C=CC=C2)=[NH+]C1=NC2=NC(N)=NC(=O)C2=N1 Intermediate Fragment 
47 341.1145354561 [CH2+]C(C#CC1=CC=CC2=C1C=CC=C2)=NC1=NC2=C(O)N=C(N)N=C2N1
48 343.1301855201 C=CC(C=C1C=C2C=CC=CC2=CC1)=[NH+]C1=NC2=NC(N)=NC(=O)C2=N1 Intermediate Fragment 
49 343.1301855201 C=C1C(=CC(C)=[NH+]C2=NC3=NC(N)=NC(=O)C3=N2)C=CC2=C1C=CC=C2 Intermediate Fragment 
50 343.1301855201 C=C=C1C(=C=C=[NH+]C2=NC3=C(O)N=C(N)N=C3N2)C=CC2=C1CCC=C2 Intermediate Fragment 
51 343.1301855201 C=C1C=CC2=C(C=CC=C2)C1=C=CC=[NH+]C1=NC2=C(O)N=C(N)N=C2N1 Intermediate Fragment 
52 343.1301855201 C=C1C=CC=CC1=C1C=CC(=[NH+]C2=NC3=NC(N)=NC(=O)C3=N2)C=C1C Intermediate Fragment 
53 343.1301855201 C=CC1=C(C2=CCC(=[NH+]C3=NC4=NC(N)=NC(=O)C4=N3)C=C2)C=CC=C1 Intermediate Fragment 
54 343.1301855201 NC1=NC(=O)C2=NC([NH+]=C3C=C(C=CC4=CC=CC=C4)C=CC3)=NC2=N1 Intermediate Fragment 
55 343.1301855201 C=C=CC1=C(C)C=CC2=CC(=[NH+]C3=NC4=NC(N)=NC(=O)C4=N3)CC=C21 Intermediate Fragment 
56 343.1301855201 C=C=CC1=C(C)C2=CCC(=[NH+]C3=NC4=NC(N)=NC(=O)C4=N3)C=C2C=C1 Intermediate Fragment 
57 343.1301855201 C=C=C=CC1=CC2=CCC(=[NH+]C3=NC4=C(O)N=C(N)N=C4N3)C=C2C=C1 Intermediate Fragment 
58 343.1301855201 C=C=C=CC1=CC=CC2=CC(=[NH+]C3=NC4=C(O)N=C(N)N=C4N3)CC=C12 Intermediate Fragment 
59 345.1458355841 NC1=NC(=O)C2=NC([NH+]=C3C=C4C=CC5=C(CCCC5)C4=CC3)=NC2=N1
60 347.1614856481 NC1=NC(=O)C2=NC([NH+]=C3C=C4CCC5=C(CCCC5)C4=CC3)=NC2=N1
61 349.1771357121 NC1=NC(=O)C2=NC([NH+]=C3C=C4CCC5CCCCC5C4=CC3)=NC2=N1
62 427.1513148881 NC1=NC(O)=C2N=C([NH+]=C3C=C4C=CC5=C(C=CC=C5)C4=CC3)N(C3CC(O)=CO3)C2=N1
63 429.1669649521 NC1=NC(O)=C2N=C([NH+]=C3C=C4C=CC5=C(CCC=C5)C4=CC3)N(C3CC(O)=CO3)C2=N1
64 431.1826150161 NC1=NC(O)=C2N=C([NH+]=C3C=C4C=CC5=C(CCCC5)C4=CC3)N(C3CC(O)=CO3)C2=N1
65 441.1669649521 C=C1OC(N2C([NH+]=C3C=C4C=CC5=C(CCC=C5)C4=CC3)=NC3=C(O)N=C(N)N=C32)C=C1O
66 423.1564002681 C=C1OC(N2C([NH+]=C3C=C4C=CC5=C(C=CC=C5)C4=CC3)=NC3=CN=C(N)N=C32)C=C1O
67 101.0597059481 C=C1OCCC1[OH2+]
68 423.1564002681 C=C1C=CC(N2C([NH+]=C3C=C4C=CC5=C(C=CC=C5)C4=CC3)=NC3=C(O)N=C(N)N=C32)O1
69 248.0778156001 C=C1OC(N2C=NC3=C(O)N=C([NH3+])N=C32)CC1=O
70 424.1404158561 C=C1OC(N2C([NH+]=C3C=C4C=CC5=C(C=CC=C5)C4=CC3)=NC3=C(O)N=CN=C32)C=C1O
71 441.1669649521 C=C1OC(N2C([NH+]=C3C=C4C=CC5=C(CCC=C5)C4=CC3)=NC(=C=O)C2=NC(=N)N)C=C1O Intermediate Fragment 
72 441.1669649521 C=C1OC(N2C(=NC(N)=NC=O)C=NC2=[NH+]C2=CC3=C(C=C2)C2=C(C=CCC2)C=C3)C=C1O Intermediate Fragment 
73 398.1611513001 C=C1OC(N2C([NH+]=CN)=CN=C2N=C2C=C3C=CC4=C(C=CC=C4)C3=CC2)C=C1O
74 371.1502522681 C=C1OC(N2C(=[NH2+])C=NC2=NC2=CC3=C(C=C2)C2=C(C=CCC2)C=C3)C=C1O
75 441.1669649521 C=C1OC(N(C(=N)[NH+]=C2C=C3C=CC4=C(C=CC=C4)C3=CC2)C2=NC(N)=NC(O)=C2)C=C1O Intermediate Fragment 
76 441.1669649521 CC(=O)C(O)=CCN1C([NH+]=C2C=C3C=CC4=C(C=CC=C4)C3=CC2)=NC2=C(O)N=C(N)N=C21 Intermediate Fragment 
77 423.1564002681 C#CC(O)=CCN1C([NH+]=C2C=C3C=CC4=C(C=CC=C4)C3=CC2)=NC2=C(O)N=C(N)N=C21
78 399.1564002681 NC1=NC(O)=C2N=C([NH+]=C3C=C4C=CC5=C(CCC=C5)C4=CC3)N(CC#CO)C2=N1
79 397.1407502041 NC1=NC(O)=C2N=C([NH+]=C3C=C4C=CC5=C(C=CC=C5)C4=CC3)N(CC#CO)C2=N1
80 441.1669649521 C=C(C=O)OC(C)N1C([NH+]=C2C=C3C=CC4=C(C=CC=C4)C3=CC2)=NC2=C(O)N=C(N)N=C21 Intermediate Fragment 
81 369.1458355841 C=CN1C([NH+]=C2C=C3C=CC4=C(C=CC=C4)C3=CC2)=NC2=C(O)N=C(N)N=C21
82 371.1614856481 CCN1C([NH+]=C2C=C3C=CC4=C(C=CC=C4)C3=CC2)=NC2=C(O)N=C(N)N=C21
83 441.1669649521 C#COC(C=C=O)N1C([NH+]=C2C=C3C=CC4=C(CCCC4)C3=CC2)=NC2=C(O)N=C(N)N=C21 Intermediate Fragment 
84 441.1669649521 C#CC(O)=CC(=O)N1C([NH+]=C2C=C3C=CC4=C(CCCC4)C3=CC2)=NC2=C(O)N=C(N)N=C21 Intermediate Fragment 
85 415.1513148881 NC1=NC(O)=C2N=C([NH+]=C3C=C4C=CC5=C(CCCC5)C4=CC3)N(C(=O)C#CO)C2=N1
86 200.1433759961 [NH2+]=C1C=C2CCC3=C(CCCC3)C2=CC1
87 198.1277259321 [NH2+]=C1C=C2C=CC3=C(CCCC3)C2=CC1
88 196.1120758681 [NH2+]=C1C=C2C=CC3=C(CCC=C3)C2=CC1
89 194.0964258041 C=C1C=CC2=C(CCC=C2)C1=C=CC#[NH+] Intermediate Fragment 
90 167.0855267721 C=C=C1C(=[CH3+])C=CC2=C1C=CC=C2
91 260.0414300921 [NH3+]C1=NC(O)=C2N=CN(C3=CC(=O)C(=C=O)O3)C2=N1
92 264.0727302201 [NH3+]C1=NC(O)=C2N=CN(C3CC(O)C(=C=O)O3)C2=N1
93 152.0566862321 [NH3+]C1=NC(=O)C2=NCNC2=N1
94 266.0883802841 [NH3+]C1=NC(O)=C2N=CN(C3CC(O)C(=CO)O3)C2=N1
95 185.1324769641 C1=CC2=C(C=[CH2+]1)CCC1=C2CCCC1
96 281.0992793161 NC1=NC(O)=C2N=C([NH3+])N(C3CC(O)C(=CO)O3)C2=N1
97 442.1509805401 O=C=C1OC(N2C([NH+]=C3C=C4C=CC5=C(CCCC5)C4=CC3)=NC3=C(O)N=CN=C32)C=C1O
98 459.1775296361 N=C(N)N=C1C(=C=O)N=C([NH+]=C2C=C3CCC4=C(CCCC4)C3=CC2)N1C1C=C(O)C(=C=O)O1 Intermediate Fragment 
99 442.1509805401 NC=[NH+]C1=C(C=O)N=C(N=C2C=C3C=CC4=C(CCC=C4)C3=CC2)N1C1C=C(O)C(=C=O)O1
100 417.1557315721 [NH2+]=C1C(=C=O)N=C(N=C2C=C3CCC4=C(CCCC4)C3=CC2)N1C1C=C(O)C(=C=O)O1
101 400.1291824761 O=C=C1OC(N2C=C(C=O)N=C2[NH+]=C2C=C3C=CC4=C(CCC=C4)C3=CC2)C=C1O
102 372.1342678561 O=C=C1OC(N2C=CN=C2[NH+]=C2C=C3C=CC4=C(CCC=C4)C3=CC2)CC1=O
103 431.1826150161 NC(=[NH2+])N=C1C=NC(=NC2=CC3=C(C=C2)C2=C(CCCC2)CC3)N1C1C=C(O)C(=C=O)O1
104 459.1775296361 NC(=NC=O)N=C1C=NC(=[NH+]C2=CC3=C(C=C2)C2=C(CCCC2)CC3)N1C1C=C(O)C(=C=O)O1 Intermediate Fragment 
105 416.1717159841 NC=[NH+]C1=CN=C(N=C2C=C3C=CC4=C(CCCC4)C3=CC2)N1C1C=C(O)C(=C=O)O1
106 389.1608169521 [NH2+]=C1C=NC(=NC2=CC3=C(C=C2)C2=C(CCCC2)CC3)N1C1C=C(O)C(=C=O)O1
107 416.1717159841 NC=[NH+]C1=CN=C(N=C2C=C3C=CC4=C(CCC=C4)C3=CC2)N1CC=C(O)C(=O)C=O Intermediate Fragment 
108 416.1717159841 NC=[NH+]C1=CN=C(N=C2C=C3C=CC4=C(CCCC4)C3=CC2)N1C(=O)C=C(O)C#CO Intermediate Fragment 
109 414.1560659201 NC=[NH+]C1=CN=C(N=C2C=C3C=CC4=C(CCC=C4)C3=CC2)N1C1C=C(O)C(=C=O)O1
110 414.1560659201 NC=[NH+]C1=CN=C(N=C2C=C3C=CC4=C(C=CC=C4)C3=CC2)N1CC=C(O)C(=O)C=O Intermediate Fragment 
111 412.1404158561 NC=[NH+]C1=CN=C(N=C2C=C3C=CC4=C(C=CC=C4)C3=CC2)N1C1C=C(O)C(=C=O)O1
112 391.1764670161 [NH2+]=C1C=NC(=NC2=CC3=C(C=C2)C2CCCCC2CC3)N1C1C=C(O)C(=C=O)O1
113 279.1604230281 [NH2+]=C1C=NC(N=C2C=C3CCC4=C(CCCC4)C3=CC2)=N1
114 371.1502522681 [NH2+]=C1C=NC(=NC2=CC3=C(C=C2)C2=C(C=C3)CCCC2)N1C1C=CC(=C=O)O1
115 389.1608169521 [NH2+]=C1C=NC(=NC2=CC3=C(C=C2)C2=C(C=C3)CCCC2)N1CC=C(O)C(=O)C=O Intermediate Fragment 
116 389.1608169521 [NH2+]=C1C=NC(=NC2=CC3=C(C=C2)C2=C(CCCC2)CC3)N1C(=O)C=C(O)C#CO Intermediate Fragment 
117 345.1346022041 [NH2+]=C1C=NC(=NC2=CC3=C(C=C2)C2=C(C=C3)CCCC2)N1C(=O)C#CO
118 75.0440558841 OCC=C[OH2+]
119 387.1451668881 [NH2+]=C1C=NC(=NC2=CC3=C(C=C2)C2=C(C=C3)CCCC2)N1C1C=C(O)C(=C=O)O1
120 374.1499179201 O=C=C1OC(N2C=CN=C2[NH+]=C2C=C3C=CC4=C(CCCC4)C3=CC2)CC1=O
121 457.1618795721 NC(N=C1C=NC(=NC2=CC3=C(C=C2)C2=C(C=C3)CCCC2)N1C1C=C(O)C(=C=O)O1)=[NH+]C=O
122 459.1775296361 NC(N)=NC(=O)C1=CN(C2C=C(O)C(=C=O)O2)C([NH+]=C2C=C3C=CC4=C(CCCC4)C3=CC2)=N1 Intermediate Fragment 
123 459.1775296361 N=C1C(=C(O)N=CN)N=C([NH+]=C2C=C3C=CC4=C(CCCC4)C3=CC2)N1C1C=C(O)C(=C=O)O1 Intermediate Fragment 
124 415.1400815081 [NH2+]=C1C(=C=O)N=C(N=C2C=C3C=CC4=C(CCCC4)C3=CC2)N1C1C=C(O)C(=C=O)O1
125 459.1775296361 N=C([NH+]=C1C=C2C=CC3=C(CCCC3)C2=CC1)N(C1=NC(N)=NC(O)=C1)C1C=C(O)C(=C=O)O1 Intermediate Fragment 
126 442.1509805401 NC1=NC(O)=CC([NH+](C=NC2=CC3=C(C=C2)C2=C(C=CCC2)C=C3)C2C=C(O)C(=C=O)O2)=N1
127 221.1073248361 [NH+]#CN=C1C=C2C=CC3=C(CCC=C3)C2=CC1
128 344.1029677281 [NH2+]=C(N=C1C=C2C=CC3=C(C=CC=C3)C2=CC1)N=C1C=C(O)C(=C=O)O1
129 346.1186177921 [NH2+]=C(N=C1C=C2C=CC3=C(CCC=C3)C2=CC1)N=C1C=C(O)C(=C=O)O1
130 348.1342678561 [NH2+]=C(N=C1C=C2C=CC3=C(CCCC3)C2=CC1)N=C1C=C(O)C(=C=O)O1
131 457.1618795721 NC1=NC(O)=CC(N(C(=[NH2+])N=C2C=C3C=CC4=C(CCC=C4)C3=CC2)C2C=C(O)C(=C=O)O2)=N1
132 459.1775296361 NC1=NC(O)=C(N=C(N=C2C=C(O)C(=C=O)O2)[NH+]=C2C=C3CCC4=C(CCCC4)C3=CC2)C=N1 Intermediate Fragment 
133 335.1390188881 O=C=C1OC([NH+]=C=NC2=CC3=C(C=C2)C2=C(CCCC2)CC3)C=C1O
134 127.0614372641 NC1=NC(=O)C([NH3+])C=N1
135 459.1775296361 NC1=NC(O)=C(N=C=[NH+]C2=CC3=C(C=C2)C2CCCCC2CC3)C(N=C2C=C(O)C(=C=O)O2)=N1 Intermediate Fragment 
136 459.1775296361 NC1=NC(O)=C(N)C(N(C=[NH+]C2=CC3=C(C=C2)C2=C(C=C3)CCCC2)C2C=C(O)C(=C=O)O2)=N1 Intermediate Fragment 
137 459.1775296361 NC1=NC(O)=C2N=C([NH+]=C3C=C4C=CC5=C(CCCC5)C4=CC3)N(CC=C(O)C(=O)C=O)C2=N1 Intermediate Fragment 
138 441.1669649521 NC1=NC(O)=C2N=C([NH+]=C3C=C4C=CC5=C(CCC=C5)C4=CC3)N(CC=C(O)C#CO)C2=N1
139 403.1877003961 NC1=NC(O)=C2N=C([NH+]=C3C=C4CCC5=C(CCCC5)C4=CC3)N(CC#CO)C2=N1
140 401.1720503321 NC1=NC(O)=C2N=C([NH+]=C3C=C4C=CC5=C(CCCC5)C4=CC3)N(CC#CO)C2=N1
141 383.1614856481 C#CCN1C([NH+]=C2C=C3C=CC4=C(CCC=C4)C3=CC2)=NC2=C(O)N=C(N)N=C21
142 381.1458355841 C#CCN1C([NH+]=C2C=C3C=CC4=C(C=CC=C4)C3=CC2)=NC2=C(O)N=C(N)N=C21
143 355.1301855201 CN1C2=NC(N)=NC(=O)C2=NC1=[NH+]C1=CC2=C(C=C1)C1=C(C=CC=C1)C=C2
144 399.1564002681 NC(=NC=O)N=C1C=NC(=[NH+]C2=CC3=C(C=C2)C2=C(C=CCC2)C=C3)N1CC#CO Intermediate Fragment 
145 399.1564002681 N=C([NH+]=C1C=C2C=CC3=C(C=CC=C3)C2=CC1)N(CC#CO)C1=NC(N)=NC(O)=C1 Intermediate Fragment 
146 399.1564002681 NC1=NC(O)=C(N=C(N=CC#CO)[NH+]=C2C=C3C=CC4=C(CCC=C4)C3=CC2)C=N1 Intermediate Fragment 
147 397.1407502041 N=C(N=C1C=C2C=CC3=C(C=CC=C3)C2=CC1)N([CH+]C#CO)C1=NC(N)=NC(O)=C1 Intermediate Fragment 
148 63.0440558841 OCC[OH2+]
149 45.0334912001 C=C[OH2+]
150 375.1927857761 CCN1C([NH+]=C2C=C3C=CC4=C(CCCC4)C3=CC2)=NC2=C(O)N=C(N)N=C21
151 373.1771357121 CCN1C([NH+]=C2C=C3C=CC4=C(CCC=C4)C3=CC2)=NC2=C(O)N=C(N)N=C21
152 367.1301855201 C#CN1C([NH+]=C2C=C3C=CC4=C(C=CC=C4)C3=CC2)=NC2=C(O)N=C(N)N=C21
153 367.1301855201 [C+]#CN(C(=N)N=C1C=C2C=CC3=C(C=CC=C3)C2=CC1)C1=NC(N)=NC(O)=C1 Intermediate Fragment 
154 91.0389705041 OCC(=[OH+])CO
155 73.0284058201 OCC#C[OH2+]
156 93.0546205681 OCC([OH2+])CO
157 353.1145354561 [CH2+]N1C(=NC2=CC3=C(C=C2)C2=C(C=CC=C2)C=C3)N=C2C(=O)N=C(N)N=C21
158 457.1618795721 NC1=NC(O)=C2N=C([NH+]=C3C=C4C=CC5=C(CCC=C5)C4=CC3)N(CC=C(O)C(=O)C=O)C2=N1
159 459.1775296361 C=C(O)C(=C=O)OCN1C([NH+]=C2C=C3C=CC4=C(CCCC4)C3=CC2)=NC2=C(O)N=C(N)N=C21 Intermediate Fragment 
160 89.0597059481 CC(O)C=C[OH2+]
161 459.1775296361 CC(OC(=C=O)C=O)N1C([NH+]=C2C=C3C=CC4=C(CCCC4)C3=CC2)=NC2=C(O)N=C(N)N=C21 Intermediate Fragment 
162 385.1407502041 CC(=O)N1C([NH+]=C2C=C3C=CC4=C(C=CC=C4)C3=CC2)=NC2=C(O)N=C(N)N=C21
163 385.1407502041 CC(=O)N1C(=NC(N)=NC=O)C=NC1=[NH+]C1=CC2=C(C=C1)C1=C(C=CC=C1)C=C2 Intermediate Fragment 
164 385.1407502041 [CH2+]C(=O)N(C(=N)N=C1C=C2C=CC3=C(C=CC=C3)C2=CC1)C1=NC(N)=NC(O)=C1 Intermediate Fragment 
165 387.1564002681 CC(=O)N1C([NH+]=C2C=C3C=CC4=C(CCC=C4)C3=CC2)=NC2=C(O)N=C(N)N=C21
166 387.1564002681 CC(=O)N1C=C(C(=O)N=C(N)N)N=C1[NH+]=C1C=C2C=CC3=C(C=CC=C3)C2=CC1 Intermediate Fragment 
167 389.1720503321 CC(=O)N1C([NH+]=C2C=C3C=CC4=C(CCCC4)C3=CC2)=NC2=C(O)N=C(N)N=C21
168 391.1877003961 CC(=O)N1C([NH+]=C2C=C3CCC4=C(CCCC4)C3=CC2)=NC2=C(O)N=C(N)N=C21
169 427.1513148881 CC(OC#CO)N1C([NH+]=C2C=C3C=CC4=C(C=CC=C4)C3=CC2)=NC2=C(O)N=C(N)N=C21
170 429.1669649521 CC(OC#CO)N1C([NH+]=C2C=C3C=CC4=C(CCC=C4)C3=CC2)=NC2=C(O)N=C(N)N=C21
171 431.1826150161 CC(OC#CO)N1C([NH+]=C2C=C3C=CC4=C(CCCC4)C3=CC2)=NC2=C(O)N=C(N)N=C21
172 459.1775296361 NC1=NC(O)=C2N=C([NH+]=C3C=C4CCC5=C(CCCC5)C4=CC3)N(C(C=C=O)OC#CO)C2=N1 Intermediate Fragment 
173 417.1669649521 NC1=NC(O)=C2N=C([NH+]=C3C=C4CCC5=C(CCCC5)C4=CC3)N(C(=O)C#CO)C2=N1
174 399.1564002681 C#CC(=O)N1C([NH+]=C2C=C3C=CC4=C(CCCC4)C3=CC2)=NC2=C(O)N=C(N)N=C21
175 459.1775296361 NC1=NC(O)=C2N=C([NH+]=C3C=C4CCC5=C(CCCC5)C4=CC3)N(C(=O)C=C(O)C#CO)C2=N1 Intermediate Fragment 
176 413.1356648241 NC1=NC(O)=C2N=C([NH+]=C3C=C4C=CC5=C(CCC=C5)C4=CC3)N(C(=O)C#CO)C2=N1
177 395.1251001401 NC1=NC(O)=C2N=C(N=C3C=C4C=CC5=C(C=CC=C5)C4=CC3)N([CH+]C#CO)C2=N1
178 47.0491412641 CC[OH2+]
179 29.0385765801 C=[CH3+]
180 383.1251001401 [CH2+]C(=O)N1C(N=C2C=C3C=CC4=C(C=CC=C4)C3=CC2)=NC2=C(O)N=C(N)N=C21
181 68.9971056921 [O+]#CC#CO
182 41.0021910721 [C+]#CO
183 71.0127557561 O=CC#C[OH2+]
184 43.0178411361 C#C[OH2+]
185 55.0178411361 C#CC=[OH+]
186 375.1564002681 NC1=NC(O)=C2N=C([NH+]=C3C=C4C=CC5=C(CCCC5)C4=CC3)N(C=O)C2=N1
187 373.1407502041 NC1=NC(O)=C2N=C([NH+]=C3C=C4C=CC5=C(CCC=C5)C4=CC3)N(C=O)C2=N1
188 371.1251001401 NC1=NC(O)=C2N=C([NH+]=C3C=C4C=CC5=C(C=CC=C5)C4=CC3)N(C=O)C2=N1
189 371.1251001401 NC(=NC=O)N=C1C=NC(=[NH+]C2=CC3=C(C=C2)C2=C(C=CC=C2)C=C3)N1C=O Intermediate Fragment 
190 371.1251001401 N=C(N=C1C=C2C=CC3=C(C=CC=C3)C2=CC1)N(C#[O+])C1=NC(N)=NC(O)=C1 Intermediate Fragment 
191 369.1094500761 NC1=NC(O)=C2N=C(N=C3C=C4C=CC5=C(C=CC=C5)C4=CC3)N(C#[O+])C2=N1
192 369.1094500761 NC1=NC(O)=C(N=C=[NH+]C2=CC3=C(C=C2)C2=C(C=CC=C2)C=C3)C(N=C=O)=N1 Intermediate Fragment 
193 87.0440558841 CC(O)C#C[OH2+]
194 69.0334912001 C=CC#C[OH2+]
195 91.0753560121 CC(O)CC[OH2+]
196 73.0647913281 C=CC(C)[OH2+]
197 73.0647913281 CCC=C[OH2+]
198 457.1618795721 NC1=NC(O)=C2N=C([NH+]=C3C=C4C=CC5=C(CCCC5)C4=CC3)N(C(=O)C=C(O)C#CO)C2=N1
199 439.1513148881 NC1=NC(O)=C2N=C([NH+]=C3C=C4C=CC5=C(C=CC=C5)C4=CC3)N(CC=C(O)C#CO)C2=N1
200 459.1775296361 CC(C=CC1=CC=CC2=C1CCCC2)=[NH+]C1=NC2=C(O)N=C(N)N=C2N1C1C=C(O)C(=C=O)O1 Intermediate Fragment 
201 443.1462295081 NC1=NC(O)=C2N=C([NH+]=CC#CC3=CC=CC4=C3CCCC4)N(C3C=C(O)C(=C=O)O3)C2=N1
202 459.1775296361 C=CC(C=C1C=C2CCCCC2=CC1)=[NH+]C1=NC2=C(O)N=C(N)N=C2N1C1C=C(O)C(=C=O)O1 Intermediate Fragment 
203 433.1618795721 NC1=NC(O)=C2N=C([NH+]=C=C=C3C=C4CCCCC4CC3)N(C3C=C(O)C(=C=O)O3)C2=N1
204 459.1775296361 C=C1C(=CC(C)=[NH+]C2=NC3=C(O)N=C(N)N=C3N2C2C=C(O)C(=C=O)O2)C=CC2=C1CCCC2 Intermediate Fragment 
205 459.1775296361 C=C=C1C(=C=C=[NH+]C2=NC3=C(O)N=C(N)N=C3N2C2C=C(O)C(=C=O)O2)CCC2CCCCC12 Intermediate Fragment 
206 459.1775296361 C=C1CCC2=C(CCCC2)C1=C=CC=[NH+]C1=NC2=C(O)N=C(N)N=C2N1C1C=C(O)C(=C=O)O1 Intermediate Fragment 
207 459.1775296361 CC1=CC(=[NH+]C2=NC3=C(O)N=C(N)N=C3N2C2C=C(O)C(=C=O)O2)CC=C1C1=C(C)C=CCC1 Intermediate Fragment 
208 459.1775296361 C=CC1=C(C2=CCC(=[NH+]C3=NC4=C(O)N=C(N)N=C4N3C3C=C(O)C(=C=O)O3)C=C2)CCCC1 Intermediate Fragment 
209 355.1149293801 NC1=NC(O)=C2N=C([NH+]=C3C=CCCC3)N(C3CC(=O)C(=C=O)O3)C2=N1
210 429.1305794441 NC1=NC(O)=C2N=C([NH+]=C3C=CC(C4=CC=CC=C4)=CC3)N(C3C=C(O)C(=C=O)O3)C2=N1
211 431.1462295081 NC1=NC(O)=C2N=C([NH+]=C3C=CC(C4=CC=CCC4)=CC3)N(C3C=C(O)C(=C=O)O3)C2=N1
212 317.1145354561 NC1=NC(=O)C2=NC([NH+]=C3C=CC(C4=CC=CC=C4)=CC3)=NC2=N1
213 433.1618795721 NC1=NC(O)=C2N=C([NH+]=C3C=CC(C4=CCCCC4)=CC3)N(C3C=C(O)C(=C=O)O3)C2=N1
214 433.1618795721 NC1=NC(O)=C2N=C([NH+]=C3C=CC(C4=CCCCC4)=CC3)N(C(=O)C=C(O)C#CO)C2=N1 Intermediate Fragment 
215 459.1775296361 NC1=NC(O)=C2N=C([NH+]=C3C=C(C=CC4=CCCCC4)C=CC3)N(C3C=C(O)C(=C=O)O3)C2=N1 Intermediate Fragment 
216 377.0992793161 C#CC1=CC(=[NH+]C2=NC3=C(O)N=C(N)N=C3N2C2C=C(O)C(=C=O)O2)CC=C1
217 357.1305794441 NC1=NC(O)=C2N=C([NH+]=C3CCCCC3)N(C3CC(=O)C(=C=O)O3)C2=N1
218 459.1775296361 C=CC1=CC(=[NH+]C2=NC3=C(O)N=C(N)N=C3N2C2C=C(O)C(=C=O)O2)CC=C1C1=CCCCC1 Intermediate Fragment 
219 459.1775296361 CCCC1=C(C)C=CC2=CC(=[NH+]C3=NC4=C(O)N=C(N)N=C4N3C3C=C(O)C(=C=O)O3)CC=C21 Intermediate Fragment 
220 431.1462295081 CC1=C(C)C2=CCC(=[NH+]C3=NC4=C(O)N=C(N)N=C4N3C3C=C(O)C(=C=O)O3)C=C2C=C1
221 429.1305794441 [CH2+]C1=C(C)C2=CCC(=NC3=NC4=C(O)N=C(N)N=C4N3C3C=C(O)C(=C=O)O3)C=C2C=C1
222 417.1305794441 CC1=CC2=CCC(=[NH+]C3=NC4=C(O)N=C(N)N=C4N3C3C=C(O)C(=C=O)O3)C=C2C=C1
223 459.1775296361 CCC1=C(CC)C2=CCC(=[NH+]C3=NC4=C(O)N=C(N)N=C4N3C3C=C(O)C(=C=O)O3)C=C2C=C1 Intermediate Fragment 
224 433.1618795721 CCC1=CCCC2=CC(=[NH+]C3=NC4=C(O)N=C(N)N=C4N3C3C=C(O)C(=C=O)O3)CC=C12
225 407.1462295081 NC1=NC(O)=C2N=C([NH+]=C3C=C4CCCCC4=CC3)N(C3C=C(O)C(=C=O)O3)C2=N1
226 405.1305794441 NC1=NC(O)=C2N=C([NH+]=C3C=C4CCC=CC4=CC3)N(C3C=C(O)C(=C=O)O3)C2=N1
227 433.1618795721 CCC1=CCCC2=CC(=[NH+]C3=NC4=C(O)N=C(N)N=C4N3C(=O)C=C(O)C#CO)CC=C12 Intermediate Fragment 
228 433.1618795721 CCC1=CC2=CCC(=[NH+]C3=NC4=C(O)N=C(N)N=C4N3C3C=C(O)C(=C=O)O3)C=C2CC1
229 459.1775296361 CCCC1=C(C)C2=CCC(=[NH+]C3=NC4=C(O)N=C(N)N=C4N3C3C=C(O)C(=C=O)O3)C=C2C=C1 Intermediate Fragment 
230 415.1149293801 [CH2+]C1=CC=CC2=CC(=NC3=NC4=C(O)N=C(N)N=C4N3C3C=C(O)C(=C=O)O3)CC=C12
231 419.1462295081 CC1=CCCC2=CC(=[NH+]C3=NC4=C(O)N=C(N)N=C4N3C3C=C(O)C(=C=O)O3)CC=C12
232 433.1618795721 CC1=C(C)C2=CCC(=[NH+]C3=NC4=C(O)N=C(N)N=C4N3C3C=C(O)C(=C=O)O3)C=C2CC1
233 433.1618795721 CC1=C(C)C2=CCC(=[NH+]C3=NC4=C(O)N=C(N)N=C4N3C(=O)C=C(O)C#CO)C=C2CC1 Intermediate Fragment 
234 459.1775296361 CCCCC1=CC2=CCC(=[NH+]C3=NC4=C(O)N=C(N)N=C4N3C3C=C(O)C(=C=O)O3)C=C2C=C1 Intermediate Fragment 
235 431.1462295081 CCC1=CC2=CCC(=[NH+]C3=NC4=C(O)N=C(N)N=C4N3C3C=C(O)C(=C=O)O3)C=C2C=C1
236 459.1775296361 CCCCC1=CC=CC2=CC(=[NH+]C3=NC4=C(O)N=C(N)N=C4N3C3C=C(O)C(=C=O)O3)CC=C21 Intermediate Fragment 
