#In-silico ESI-MS/MS [M+H]+ Spectra
#PREDICTED BY CFM-ID 4.0.8
#SMILES=[nH]1c(nc2c(c1=O)ncn2[C@@H]1O[C@H](CO)[C@@H](C1)O)Nc1c2c3c(c4c1cccc4)c1c(cc3C(=O)N2)OCO1
#InChiKey=XAVCFDAGCGOBQN-FVQBIDKESA-N
energy0
413.09928 100.00 20 67 73 68 69 64 38 29 61 57 66 48 40 71 51 54 47 74 59 75 63 43 76 60 (91.533 0.61305 0.54999 0.46201 0.22988 0.1321 0.11709 0.091359 0.080085 0.072322 0.070555 0.057282 0.048064 0.044326 0.028782 0.023789 0.02032 0.01821 0.015787 0.015434 0.011609 0.006655 0.0027183 0.0018503)
energy1
413.09928 100.00 20 29 67 38 54 71 73 48 57 68 66 69 61 43 64 51 76 47 40 75 59 60 63 74 (79.447 1.4947 0.53796 0.40144 0.36839 0.34643 0.30886 0.24831 0.20971 0.17322 0.15675 0.1511 0.089617 0.069177 0.053572 0.046446 0.029252 0.02444 0.02332 0.019703 0.01385 0.0066116 0.0054429 0.0036726)
energy2
45.03349 6.35 157 (2.3752)
47.04914 4.16 168 (1.5554)
57.03349 18.08 14 (6.7652)
71.04914 2.65 189 190 (0.68661 0.30441)
144.06552 1.96 137 (0.73216)
277.06077 10.05 23 94 (3.2122 0.54835)
279.07642 16.86 22 100 93 91 99 95 96 98 97 (5.2584 0.21546 0.17086 0.1381 0.12653 0.10877 0.10609 0.098827 0.085078)
283.10772 1.98 89 (0.74148)
285.12337 1.98 88 (0.74148)
289.06077 1.75 44 (0.65343)
373.09313 1.89 130 (0.70758)
385.10436 2.98 36 65 (0.78766 0.3263)
386.08838 7.09 55 52 (1.8294 0.82459)
395.08871 3.97 21 28 (1.2153 0.27121)
396.07273 9.45 53 30 49 41 (3.1607 0.20404 0.1035 0.066091)
411.08363 2.78 19 37 56 (0.39017 0.35749 0.29103)
413.09928 100.00 54 20 29 57 43 51 73 38 47 40 71 48 69 67 61 68 66 60 64 59 76 63 75 74 (15.961 10.146 3.5639 0.99566 0.93559 0.91416 0.62294 0.60633 0.57833 0.47857 0.36584 0.32784 0.28573 0.26704 0.26299 0.24598 0.16021 0.15214 0.14324 0.11033 0.089006 0.069186 0.067669 0.065494)
415.11493 3.95 77 (1.4795)
419.14623 3.85 79 (1.4389)
439.11493 3.98 144 160 (1.1733 0.31669)
459.14114 2.45 163 (0.91655)
461.15679 2.45 164 (0.91655)
469.12549 3.59 172 148 (1.1562 0.18839)

0 529.1466234321 O=C1Nc2c([NH2+]c3nc4c(ncn4C4CC(O)C(CO)O4)c(=O)[nH]3)c3ccccc3c3c4c(cc1c23)OCO4
1 511.1360587481 O=C=C1OC(N2C=NC3=CN=C([NH+]=C4C5=CC=CCC5=C5C6=C(CC7C5=C4NC7O)OCO6)N=C32)C=C1O
2 397.1043646961 O=C1N=C2C3=C(C4=C(C=C13)OCO4)C1CC=CC=C1C2[NH+]=C1N=CC2=NC=NC2=N1
3 119.0702706321 OC1CCOC1C[OH2+]
4 101.0597059481 C=C1OCCC1[OH2+]
5 101.0597059481 [OH2+]C=C1CCCO1
6 119.0702706321 O=CCC(O)CC[OH2+] Intermediate Fragment 
7 117.0546205681 OC=CC(O)CC=[OH+]
8 89.0597059481 [OH2+]C1CCOC1
9 99.0440558841 C=C1OCC=C1[OH2+]
10 99.0440558841 [OH+]=C=C1CCCO1
11 117.0546205681 CCC(O)C(=O)C=[OH+] Intermediate Fragment 
12 99.0440558841 CC=C(O)C#C[OH2+]
13 59.0491412641 CC=C[OH2+]
14 57.0334912001 CC#C[OH2+]
15 61.0284058201 OCC=[OH+]
16 117.0546205681 OCCCOC#C[OH2+] Intermediate Fragment 
17 117.0546205681 CCOC(=C=[OH+])CO Intermediate Fragment 
18 115.0389705041 OC1CCOC1=C=[OH+]
19 411.0836292521 O=C1N=C([NH+]=C2C3=CC=CCC3=C3C4=C(C=C5C(=O)NC2=C53)OCO4)N=C2N=CN=C12
20 413.0992793161 O=C1N=C([NH+]=C2C3=CC=CCC3=C3C4=C(C=C5C3=C2NC5O)OCO4)N=C2N=CN=C12
21 395.0887146321 O=C1N=C2C(=[NH+]C3=NC=C4N=CNC4=N3)C3=CC=CC=C3C3=C2C1=CC1=C3OCO1
22 279.0764186321 [NH2+]=C1C2=CC=CCC2C2=C3C(=CC4=C2OCO4)C(=O)N=C13
23 277.0607685681 [NH2+]=C1C2=NC(=O)C3=CC4=C(OCO4)C(=C32)C2=C1C=CC=C2
24 135.0301371361 [OH+]=C1N=CN=C2N=CN=C12
25 137.0457872001 [OH+]=C1N=CN=C2NCN=C12
26 264.0655196001 [OH+]=C1NC2=CC3=C(C=CC=C3)C3=C2C1=CC1=C3OCO1
27 150.0410361681 [NH3+]C1=NC(=O)C2=NC=NC2=N1
28 395.0887146321 O=C1N=C([NH+]=C2C3=CC=CCC3=C3C4=C(C=C5C=NC2=C53)OCO4)N=C2N=CN=C12
29 413.0992793161 N=C(N=C1NC=NC1=C=O)[NH+]=C1C2=CC=CCC2=C2C3=C(C=C4C(=O)NC1=C42)OCO3 Intermediate Fragment 
30 396.0727302201 O=C1NC2=C(N=C=NC3=C(C#[O+])N=CN3)C3=CC=CC=C3C3=C2C1=CC1=C3OCO1
31 302.0560175361 [NH+]#CN=C1C2=NC(=O)C3=CC4=C(OCO4)C(=C32)C2=C1C=CC=C2
32 304.0716676001 [NH+]#CN=C1C2=CC=CCC2C2=C3C(=CC4=C2OCO4)C(=O)N=C13
33 306.0873176641 [NH+]#CN=C1C2=CC=CCC2C2=C3C(=CC4=C2OCO4)C(=O)NC13
34 319.0825666321 NC(=[NH2+])N=C1C2=NC(=O)C3=CC4=C(OCO4)C(=C32)C2=C1C=CC=C2
35 383.0887146321 [NH2+]=C(N=C1C=NC=N1)N=C1C2=CC=CC=C2C2=C3C(=CC4=C2OCO4)C(=O)N=C13
36 385.1043646961 [NH2+]=C(N=C1C=NC=N1)N=C1C2=CC=CCC2C2=C3C(=CC4=C2OCO4)C(=O)N=C13
37 411.0836292521 N=C(N=C1N=CN=C1C#[O+])N=C1C2=CC=CCC2=C2C3=C(C=C4C(=O)NC1=C42)OCO3
38 413.0992793161 O=CN=C(N=C1C=NC=N1)[NH+]=C1C2=CC=CCC2=C2C3=C(C=C4C(=O)NC1=C42)OCO3 Intermediate Fragment 
39 368.0778156001 O=C1N=C2C(=[N+]=C=NC3=CN=CN3)C3=CC=CC=C3C3=C2C1=CC1=C3OCO1
40 413.0992793161 NC(=NC(=O)C1=CNC=N1)[NH+]=C1C2=CC=CC=C2C2=C3C(=CC4=C2OCO4)C(=O)N=C13 Intermediate Fragment 
41 396.0727302201 O=C(N=C=[N+]=C1C2=CC=CC=C2C2=C3C(=CC4=C2OCO4)C(=O)N=C13)C1=CNC=N1
42 345.0618311881 NC(=NC#[O+])N=C1C2=NC(=O)C3=CC4=C(OCO4)C(=C32)C2=C1C=CC=C2
43 413.0992793161 N=C1NC=NC1=C(O)N=C=[NH+]C1=C2NC(=O)C3=CC4=C(OCO4)C(=C32)C2=CC=CC=C21 Intermediate Fragment 
44 289.0607685681 C#[N+]C1=C2NC(=O)C3=CC4=C(OCO4)C(=C32)C2=C1C=CC=C2
45 332.0665822201 O=C[NH+]=C=NC1=C2NC(=O)C3=CC4=C(OCO4)C(=C32)C2=C1C=CC=C2
46 330.0509321561 O=C1NC2=C(N=C=NC#[O+])C3=C(C=CC=C3)C3=C2C1=CC1=C3OCO1
47 413.0992793161 NC(=O)C1=C(N=C=[NH+]C2=C3NC(=O)C4=CC5=C(OCO5)C(=C43)C3=CC=CC=C32)NC=N1 Intermediate Fragment 
48 413.0992793161 N=C=NC1=NC([NH+]=C2C3=CC=CCC3=C3C4=C(C=C5C(=O)NC2=C53)OCO4)=NC(O)=C1 Intermediate Fragment 
49 396.0727302201 C#[N+]C1=NC(N=C2C3=CC=CC=C3C3=C4C(=CC5=C3OCO5)C(=O)N=C24)=NC(O)=C1
50 371.0774812521 O=C1N=C2C(=[NH+]C3=NC(O)=CC=N3)C3=CC=CC=C3C3=C2C1=CC1=C3OCO1
51 413.0992793161 N=C=NC1=C(O)N=C([NH+]=C2C3=CC=CCC3=C3C4=C(C=C5C(=O)NC2=C53)OCO4)N=C1 Intermediate Fragment 
52 386.0883802841 [NH2+]=C1C=NC(N=C2C3=CC=CCC3C3=C4C(=CC5=C3OCO5)C(=O)N=C24)=NC1=O
53 396.0727302201 C#[N+]C1=C(O)N=C(N=C2C3=CC=CC=C3C3=C4C(=CC5=C3OCO5)C(=O)N=C24)N=C1
54 413.0992793161 C=NC1=C(O)N=C([NH+]=C2C3=CC=CC=C3C3=C4C(=CC5=C3OCO5)C(=O)N=C24)N=C1N Intermediate Fragment 
55 386.0883802841 [NH3+]C1=NC(N=C2C3=CC=CC=C3C3=C4C(=CC5=C3OCO5)C(=O)N=C24)=NC(O)=C1
56 411.0836292521 C#[N+]C1=C(O)N=C(N=C2C3=CC=CC=C3C3=C4C(=CC5=C3OCO5)C(=O)N=C24)N=C1N
57 413.0992793161 C=NC1=NC([NH+]=C2C3=CC=CCC3=C3C4=C(C=C5C(=O)NC2=C53)OCO4)=NC(=O)C1=N Intermediate Fragment 
58 384.0727302201 [NH2+]=C1C=NC(N=C2C3=CC=CC=C3C3=C4C(=CC5=C3OCO5)C(=O)N=C24)=NC1=O
59 413.0992793161 C=C=CC1=C2C3=C(C=C4C(=O)NC(=C42)C(=[NH+]C2=NC(O)=C4N=CNC4=N2)C1=C)OCO3 Intermediate Fragment 
60 413.0992793161 C=C=C1C(=[NH+]C2=NC(O)=C3N=CNC3=N2)C2=C3C(=CC4=C(OCO4)C3=C1C=C)C(=O)N2 Intermediate Fragment 
61 413.0992793161 O=C1N=C([NH+]=C2C3=CC=CCC3=CC3=C2NC(=O)C3=CC2=COCO2)N=C2N=CN=C12 Intermediate Fragment 
62 341.0781499481 C=C1C(=O)N=C2C1=CC1=C(C=CC=C1)C2=[NH+]C1=NC(=O)C2=NC=NC2=N1
63 413.0992793161 C=C1C(=O)NC2=C1C(C1=COCO1)=C1CC=CC=C1C2=[NH+]C1=NC(=O)C2=NC=NC2=N1 Intermediate Fragment 
64 413.0992793161 O=C=NC1=C2C=CC3=C(OCO3)C2=C2CC=CC=C2C1=[NH+]C1=NC(O)=C2N=CNC2=N1 Intermediate Fragment 
65 385.1043646961 N=C1C(=[NH+]C2=NC(=O)C3=NC=NC3=N2)C2=CC=CCC2C2=C1C=CC1=C2OCO1
66 413.0992793161 NC(=O)C1=CC2=C(OCO2)C2=C3CC=CC=C3C(=[NH+]C3=NC(=O)C4=NC=NC4=N3)C=C12 Intermediate Fragment 
67 413.0992793161 NC1=C2C(C#[O+])=CC3=C(OCO3)C2=C2CC=CC=C2C1=NC1=NC(O)=C2N=CNC2=N1 Intermediate Fragment 
68 413.0992793161 O=COC1=CC=C2C(=O)NC3=C2C1=C1CC=CC=C1C3=[NH+]C1=NC(O)=C2N=CNC2=N1 Intermediate Fragment 
69 413.0992793161 O=COC1=CC2=C3CC=CC=C3C(=[NH+]C3=NC(O)=C4N=CNC4=N3)C3=C2C(=C1)C(=O)N3 Intermediate Fragment 
70 383.0887146321 O=C1N=C2C(=[NH+]C3=NC(=O)C4=NC=NC4=N3)C3=CC=CCC3C3=C2C1=CC(O)=C3
71 413.0992793161 COC1=C(O)C2=C3CC=CC=C3C(=[NH+]C3=NC(=O)C4=NC=NC4=N3)C3=C2C(=C1)C(=O)N3 Intermediate Fragment 
72 397.0679791881 O=C1C=C2C(=O)NC3=C2C(=C2CC=CC=C2C3=[NH+]C2=NC(=O)C3=NC=NC3=N2)C1=O
73 413.0992793161 COC1=C(O)C=C2C(=O)NC3=C2C1=C1CC=CC=C1C3=[NH+]C1=NC(=O)C2=NC=NC2=N1 Intermediate Fragment 
74 413.0992793161 O=C1NC(=C=[NH+]C2=NC(O)=C3N=CNC3=N2)C2=C1C=C1OCOC1=C2C1=CC=CC=C1 Intermediate Fragment 
75 413.0992793161 O=C1N=C([NH+]=C(C2=CC=CC=C2)C2=C3C=C4OCOC4=CC3=C(O)N2)N=C2N=CN=C12 Intermediate Fragment 
76 413.0992793161 O=C1NC=C2C1=CC1=C(OCO1)C2=C1CC=CC=C1C#[N+]C1=NC(O)=C2N=CNC2=N1 Intermediate Fragment 
77 415.1149293801 O=C1N=C([NH+]=C2C3=CC=CCC3=C3C4=C(CC5C3=C2NC5O)OCO4)N=C2N=CN=C12
78 417.1305794441 O=C1N=C([NH+]=C2C3=CC=CCC3=C3C4=C2NC(O)C4CC2OCOC32)N=C2N=CN=C12
79 419.1462295081 O=C1N=C([NH+]=C2C3=CCCCC3=C3C4=C2NC(O)C4CC2OCOC32)N=C2N=CN=C12
80 497.1204086841 O=C1NC2=C3C1=CC1=C(OCO1)C3=C1CC=CC=C1C2=[NH+]C1=NC(O)=C2N=CN(C3CC(O)=CO3)C2=N1
81 499.1360587481 OC1=COC(N2C=NC3=C(O)N=C([NH+]=C4C5=CC=CCC5=C5C6=C(C=C7C5=C4NC7O)OCO6)N=C32)C1
82 501.1517088121 OC1=COC(N2C=NC3=C(O)N=C([NH+]=C4C5=CC=CCC5=C5C6=C(CC7C5=C4NC7O)OCO6)N=C32)C1
83 511.1360587481 C=C1OC(N2C=NC3=C(O)N=C([NH+]=C4C5=CC=CCC5=C5C6=C(C=C7C5=C4NC7O)OCO6)N=C32)C=C1O
84 493.1254940641 C=C1C=CC(N2C=NC3=C(O)N=C([NH+]=C4C5=CC=CCC5=C5C6=C(C=C7C(=O)NC4=C75)OCO6)N=C32)O1
85 511.1360587481 CC(=O)C(O)=CCN1C=NC2=C(O)N=C([NH+]=C3C4=CC=CCC4=C4C5=C(C=C6C(=O)NC3=C64)OCO5)N=C21 Intermediate Fragment 
86 511.1360587481 C=C(C=O)OC(C)N1C=NC2=C(O)N=C([NH+]=C3C4=CC=CCC4=C4C5=C(C=C6C(=O)NC3=C64)OCO5)N=C21 Intermediate Fragment 
87 511.1360587481 C#COC(C=C=O)N1C=NC2=C(O)N=C([NH+]=C3C4=CC=CCC4=C4C5=C(CC6C4=C3NC6O)OCO5)N=C21 Intermediate Fragment 
88 285.1233688241 [NH2+]=C1C2=CC=CCC2C2=C3C1NC(O)C3CC1=C2OCO1
89 283.1077187601 [NH2+]=C1C2=CC=CCC2C2=C3C(=CC4=C2OCO4)C(O)NC13
90 281.0920686961 [NH2+]=C1C2=CC=CCC2C2=C3C(=CC4=C2OCO4)C(=O)NC13
91 279.0764186321 [NH+]#CC1=C2C(=CC3=C(OCO3)C2=C2C=CC=CC2)C(=O)N1 Intermediate Fragment 
92 252.0655196001 [OH+]=C1N=CC2=C(C3=CC=CC=C3)C3=C(C=C12)OCO3
93 279.0764186321 [NH+]#CC1=CC=CCC1=C1C2=CNC(=O)C2=CC2=C1OCO2 Intermediate Fragment 
94 277.0607685681 [NH+]#CC1=C(C2=C3C=NC(=O)C3=CC3=C2OCO3)C=CC=C1
95 279.0764186321 [NH2+]=C1C2=NC(=O)C(=CC3=COCO3)C2=CC2=C1C=CC=C2 Intermediate Fragment 
96 279.0764186321 N=C1C2=CC=CCC2=C2C3=C(C=C(C#[O+])C2=C1N)OCO3 Intermediate Fragment 
97 279.0764186321 [NH2+]=C1C2=CC=CCC2=C2C(OC=O)=CC=C3C(=O)NC1=C32 Intermediate Fragment 
98 279.0764186321 [NH2+]=C1C2=CC=CCC2=C2C=C(OC=O)C=C3C(=O)NC1=C32 Intermediate Fragment 
99 279.0764186321 COC1=CC2=C3C(=NC2=O)C(=[NH2+])C2=CC=CCC2=C3C1=O Intermediate Fragment 
100 279.0764186321 COC1=C(O)C=C2C(=O)N=C3C(=[NH2+])C4=C(C=CC=C4)C1=C23 Intermediate Fragment 
101 249.0618311881 O=C=C1OC(N2C=NC3=C([OH2+])N=CN=C32)CC1O
102 251.0774812521 OC=C1OC(N2C=NC3=C([OH2+])N=CN=C32)CC1O
103 253.0931313161 OCC1OC(N2C=NC3=C([OH2+])N=CN=C32)CC1O
104 266.0811696641 [OH2+]C1NC2=CC3=C(C=CC=C3)C3=C2C1=CC1=C3OCO1
105 529.1466234321 N=C(N=C1C(=C=O)N=CN1C1C=C(O)C(=C=O)O1)[NH+]=C1C2=CC=CCC2=C2C3=C1NC(O)C3CC1OCOC21 Intermediate Fragment 
106 501.1517088121 [NH2+]=C(N=C1C2=CC=CCC2=C2C3=C(CC4C2=C1NC4O)OCO3)N=C1C=NCN1C1C=C(O)C(=C=O)O1
107 501.1517088121 [NH2+]=C(N=C1C2=CC=CCC2=C2C3=C(CC4C2=C1NC4O)OCO3)N=C1C=NCN1C(=O)C=C(O)C#CO Intermediate Fragment 
108 529.1466234321 O=C=C1OC(N2CN=CC2=NC(=NC=O)[NH+]=C2C3=CC=CCC3=C3C4=C(CC5C3=C2NC5O)OCO4)C=C1O Intermediate Fragment 
109 486.1408097801 O=C=C1OC(N2C=NC=C2[NH+]=C=NC2=C3NC(O)C4CC5OCOC5C(=C34)C3=CC=CC=C32)C=C1O
110 370.0934656641 O=C1N=C2C3=C(C4=CC=CC=C4C2N=C=[NH+]C2=CN=CN2)C2=C(C=C13)OCO2
111 486.1408097801 O=CC(=O)C(O)=CCN1C=NC=C1[NH+]=C=NC1=C2NC(O)C3CC4=C(OCO4)C(=C23)C2=CC=CC=C21 Intermediate Fragment 
112 486.1408097801 O=C(C=C(O)C#CO)N1C=NC=C1[NH+]=C=NC1=C2NC(O)C3CC4OCOC4C(=C23)C2=CC=CC=C21 Intermediate Fragment 
113 484.1251597161 O=C=C1OC(N2C=NC=C2[NH+]=C=NC2=C3NC(O)C4CC5=C(OCO5)C(=C34)C3=CC=CC=C32)C=C1O
114 482.1095096521 O=C=C1OC(N2C=NC=C2[NH+]=C=NC2=C3NC(O)C4=CC5=C(OCO5)C(=C43)C3=CC=CC=C32)C=C1O
115 198.0873176641 [NH2+]=C1C=NCN1C1CC(O)C(=CO)O1
116 183.0764186321 OC1CC(N2C=CN=C2)OC1=C[OH2+]
117 181.0607685681 OC1CC(N2C=CN=C2)OC1=C=[OH+]
118 181.0607685681 O=C(C=[OH+])C(O)=CCN1C=CN=C1 Intermediate Fragment 
119 179.0451185041 O=C1CC(N2C=CN=C2)OC1=C=[OH+]
120 499.1360587481 [NH2+]=C(N=C1C2=CC=CCC2=C2C3=C(C=C4C2=C1NC4O)OCO3)N=C1C=NCN1C1C=C(O)C(=C=O)O1
121 529.1466234321 NC(=NC(=O)C1=CN(C2C=C(O)C(=C=O)O2)C=N1)[NH+]=C1C2=CC=CCC2=C2C3=C(CC4C2=C1NC4O)OCO3 Intermediate Fragment 
122 529.1466234321 N=C1C(=C(O)N=C=[NH+]C2=C3NC(O)C4CC5OCOC5C(=C34)C3=CC=CC=C32)N=CN1C1C=C(O)C(=C=O)O1 Intermediate Fragment 
123 291.0764186321 C=[NH+]C1=C2NC(=O)C3=CC4=C(OCO4)C(=C32)C2=C1C=CC=C2
124 226.0822322841 [NH2+]=C1C(=C=O)N=CN1C1CC(O)C(CO)O1
125 529.1466234321 NC(=O)C1=C(N=C=[NH+]C2=C3NC(O)C4CC5OCOC5C(=C34)C3=CC=CC=C32)N(C2C=C(O)C(=C=O)O2)C=N1 Intermediate Fragment 
126 529.1466234321 N=CN(C1=NC([NH+]=C2C3=CC=CCC3=C3C4=C(CC5C3=C2NC5O)OCO4)=NC(O)=C1)C1C=C(O)C(=C=O)O1 Intermediate Fragment 
127 512.1200743361 C[NH+](C1=NC(N=C2C3=CC=CCC3=C3C4=C(C=C5C(=O)NC2=C53)OCO4)=NC(O)=C1)C1C=C(O)C(=C=O)O1
128 502.1357244001 O=C=C1OC(=[NH+]C2=NC(N=C3C4=CC=CCC4=C4C5=C3NC(O)C5CC3OCOC43)=NC(O)=C2)C=C1O
129 502.1357244001 OC#CC(O)=CC(O)=[NH+]C1=NC(N=C2C3=CC=CCC3=C3C4=C(CC5C3=C2NC5O)OCO4)=NC(O)=C1 Intermediate Fragment 
130 373.0931313161 O=C1N=C2C(=[NH+]C3=NC(O)=CC=N3)C3=CC=CCC3C3=C2C1=CC1=C3OCO1
131 159.0764186321 [NH+]#CNC1CC(O)C(CO)O1
132 142.0498695361 C=[NH+]C1CC(O)C(=C=O)O1
133 159.0764186321 [NH+]#CN=C(O)CC(O)CCO Intermediate Fragment 
134 159.0764186321 CC(=NC#[NH+])OC(CO)CO Intermediate Fragment 
135 159.0764186321 CC(O)C(CO)OC=NC#[NH+] Intermediate Fragment 
136 529.1466234321 O=C=C1OC(N=C=NC2=C(O)N=C([NH+]=C3C4=CC=CCC4=C4C5=C3NC(O)C5CC3OCOC43)N=C2)C=C1O Intermediate Fragment 
137 144.0655196001 C=[NH+]C1CC(O)C(=CO)O1
138 529.1466234321 C=NC1=C(O)N=C([NH+]=C2C3=CC=CCC3=C3C4=C2NC(O)C4CC2OCOC32)N=C1N=C1C=C(O)C(=C=O)O1 Intermediate Fragment 
139 398.0883802841 C=[NH+]C1=C(O)N=C(N=C2C3=CC=CC=C3C3=C4C(=CC5=C3OCO5)C(=O)N=C24)N=C1
140 529.1466234321 O=CC(=O)C(O)=CCN1C=NC2=C(O)N=C([NH+]=C3C4=CC=CCC4=C4C5=C(CC6C4=C3NC6O)OCO5)N=C21 Intermediate Fragment 
141 511.1360587481 OC#CC(O)=CCN1C=NC2=C(O)N=C([NH+]=C3C4=CC=CCC4=C4C5=C(C=C6C4=C3NC6O)OCO5)N=C21
142 493.1254940641 C#CC(O)=CCN1C=NC2=C(O)N=C([NH+]=C3C4=CC=CCC4=C4C5=C(C=C6C(=O)NC3=C64)OCO5)N=C21
143 467.1098440001 O=C1NC2=C3C1=CC1=C(OCO1)C3=C1CC=CC=C1C2=[NH+]C1=NC(O)=C2N=CN(CC#CO)C2=N1
144 439.1149293801 C=CN1C=NC2=C(O)N=C([NH+]=C3C4=CC=CCC4=C4C5=C(C=C6C(=O)NC3=C64)OCO5)N=C21
145 473.1567941921 OC#CCN1C=NC2=C(O)N=C([NH+]=C3C4=CC=CCC4=C4C5=C3NC(O)C5CC3OCOC43)N=C21
146 471.1411441281 OC#CCN1C=NC2=C(O)N=C([NH+]=C3C4=CC=CCC4=C4C5=C(CC6C4=C3NC6O)OCO5)N=C21
147 453.1305794441 C#CCN1C=NC2=C(O)N=C([NH+]=C3C4=CC=CCC4=C4C5=C(C=C6C4=C3NC6O)OCO5)N=C21
148 469.1254940641 OC#CCN1C=NC2=C(O)N=C([NH+]=C3C4=CC=CCC4=C4C5=C(C=C6C4=C3NC6O)OCO5)N=C21
149 445.1618795721 CCN1C=NC2=C(O)N=C([NH+]=C3C4=CC=CCC4=C4C5=C(CC6C4=C3NC6O)OCO5)N=C21
150 443.1462295081 CCN1C=NC2=C(O)N=C([NH+]=C3C4=CC=CCC4=C4C5=C(C=C6C4=C3NC6O)OCO5)N=C21
151 441.1305794441 CCN1C=NC2=C(O)N=C([NH+]=C3C4=CC=CCC4=C4C5=C(C=C6C(=O)NC3=C64)OCO5)N=C21
152 437.0992793161 C#CN1C=NC2=C(O)N=C([NH+]=C3C4=CC=CCC4=C4C5=C(C=C6C(=O)NC3=C64)OCO5)N=C21
153 529.1466234321 C=C(O)C(=C=O)OCN1C=NC2=C(O)N=C([NH+]=C3C4=CC=CCC4=C4C5=C(CC6C4=C3NC6O)OCO5)N=C21 Intermediate Fragment 
154 529.1466234321 CC(OC(=C=O)C=O)N1C=NC2=C(O)N=C([NH+]=C3C4=CC=CCC4=C4C5=C(CC6C4=C3NC6O)OCO5)N=C21 Intermediate Fragment 
155 75.0440558841 OCC=C[OH2+]
156 73.0284058201 OCC#C[OH2+]
157 45.0334912001 C=C[OH2+]
158 455.1098440001 CC(=O)N1C=NC2=C(O)N=C([NH+]=C3C4=CC=CCC4=C4C5=C(C=C6C(=O)NC3=C64)OCO5)N=C21
159 457.1254940641 CC(=O)N1C=NC2=C(O)N=C([NH+]=C3C4=CC=CCC4=C4C5=C(C=C6C4=C3NC6O)OCO5)N=C21
160 439.1149293801 CC(=O)N1C=NC2=CN=C([NH+]=C3C4=CC=CCC4=C4C5=C(C=C6C(=O)NC3=C64)OCO5)N=C21
161 457.1254940641 CC(=O)N(C=N)C1=NC([NH+]=C2C3=CC=CCC3=C3C4=C(C=C5C(=O)NC2=C53)OCO4)=NC(O)=C1 Intermediate Fragment 
162 440.0989449681 C=[N+](C(C)=O)C1=NC(N=C2C3=CC=CC=C3C3=C4C(=CC5=C3OCO5)C(=O)N=C24)=NC(O)=C1
163 459.1411441281 CC(=O)N1C=NC2=C(O)N=C([NH+]=C3C4=CC=CCC4=C4C5=C(CC6C4=C3NC6O)OCO5)N=C21
164 461.1567941921 CC(=O)N1C=NC2=C(O)N=C([NH+]=C3C4=CC=CCC4=C4C5=C3NC(O)C5CC3OCOC43)N=C21
165 499.1360587481 CC(OC#CO)N1C=NC2=C(O)N=C([NH+]=C3C4=CC=CCC4=C4C5=C(C=C6C4=C3NC6O)OCO5)N=C21
166 501.1517088121 CC(OC#CO)N1C=NC2=C(O)N=C([NH+]=C3C4=CC=CCC4=C4C5=C(CC6C4=C3NC6O)OCO5)N=C21
167 529.1466234321 O=C=CC(OC#CO)N1C=NC2=C(O)N=C([NH+]=C3C4=CC=CCC4=C4C5=C3NC(O)C5CC3OCOC43)N=C21 Intermediate Fragment 
168 47.0491412641 CC[OH2+]
169 483.1047586201 O=C(C#CO)N1C=NC2=C(O)N=C([NH+]=C3C4=CC=CCC4=C4C5=C(C=C6C4=C3NC6O)OCO5)N=C21
170 485.1204086841 O=C(C#CO)N1C=NC2=C(O)N=C([NH+]=C3C4=CC=CCC4=C4C5=C(CC6C4=C3NC6O)OCO5)N=C21
171 487.1360587481 O=C(C#CO)N1C=NC2=C(O)N=C([NH+]=C3C4=CC=CCC4=C4C5=C3NC(O)C5CC3OCOC43)N=C21
172 469.1254940641 C#CC(=O)N1C=NC2=C(O)N=C([NH+]=C3C4=CC=CCC4=C4C5=C(CC6C4=C3NC6O)OCO5)N=C21
173 487.1360587481 OC#COCN1C=NC2=C(O)N=C([NH+]=C3C4=CC=CCC4=C4C5=C(CC6C4=C3NC6O)OCO5)N=C21
174 485.1204086841 OC#COCN1C=NC2=C(O)N=C([NH+]=C3C4=CC=CCC4=C4C5=C(C=C6C4=C3NC6O)OCO5)N=C21
175 529.1466234321 O=C(C=C(O)C#CO)N1C=NC2=C(O)N=C([NH+]=C3C4=CC=CCC4=C4C5=C3NC(O)C5CC3OCOC43)N=C21 Intermediate Fragment 
176 453.0941939361 [CH2+]C(=O)N1C=NC2=C(O)N=C(N=C3C4=CC=CCC4=C4C5=C(C=C6C(=O)NC3=C64)OCO5)N=C21
177 68.9971056921 [O+]#CC#CO
178 41.0021910721 [C+]#CO
179 71.0127557561 O=CC#C[OH2+]
180 43.0178411361 C#C[OH2+]
181 445.1254940641 O=CN1C=NC2=C(O)N=C([NH+]=C3C4=CC=CCC4=C4C5=C(CC6C4=C3NC6O)OCO5)N=C21
182 443.1098440001 O=CN1C=NC2=C(O)N=C([NH+]=C3C4=CC=CCC4=C4C5=C(C=C6C4=C3NC6O)OCO5)N=C21
183 425.0992793161 [CH2+]N1C=NC2=C(O)N=C(N=C3C4=CC=CCC4=C4C5=C(C=C6C(=O)NC3=C64)OCO5)N=C21
184 441.0941939361 O=CN1C=NC2=C(O)N=C([NH+]=C3C4=CC=CCC4=C4C5=C(C=C6C(=O)NC3=C64)OCO5)N=C21
185 439.0785438721 O=C1NC2=C3C1=CC1=C(OCO1)C3=C1CC=CC=C1C2=NC1=NC(O)=C2N=CN(C#[O+])C2=N1
186 87.0440558841 CC(O)C#C[OH2+]
187 69.0334912001 C=CC#C[OH2+]
188 89.0597059481 CC(O)C=C[OH2+]
189 71.0491412641 C#CC(C)[OH2+]
190 71.0491412641 CCC#C[OH2+]
191 91.0753560121 CC(O)CC[OH2+]
192 73.0647913281 C=CC(C)[OH2+]
193 73.0647913281 CCC=C[OH2+]
194 529.1466234321 C=C=C1C(=[NH+]C2=NC(O)=C3N=CN(C4C=C(O)C(=C=O)O4)C3=N2)C2=C3C(=C1C=C)C1OCOC1CC3C(O)N2 Intermediate Fragment 
195 529.1466234321 O=C=C1OC(N2C=NC3=C(O)N=C([NH+]=C4C5=CC=CCC5=CC5=C4NC(O)C5CC4=COCO4)N=C32)C=C1O Intermediate Fragment 
196 457.1254940641 C=C1C2=C(NC1O)C(=[NH+]C1=NC(O)=C3N=CN(C4C=C(O)C(=C=O)O4)C3=N1)C1=CC=CCC1=C2
197 455.1098440001 C=C1C(=O)NC2=C1C=C1CC=CC=C1C2=[NH+]C1=NC(O)=C2N=CN(C3C=C(O)C(=C=O)O3)C2=N1
198 343.0938000121 C=C1C(=O)N=C2C1=CC1CC=CC=C1C2=[NH+]C1=NC(=O)C2=NC=NC2=N1
199 529.1466234321 CC1C2=C(NC1O)C(=[NH+]C1=NC(O)=C3N=CN(C4C=C(O)C(=C=O)O4)C3=N1)C1=CC=CCC1=C2C1=COCO1 Intermediate Fragment 
200 529.1466234321 O=C=C1OC(N2C=NC3=C(O)N=C([NH+]=C4C5=CC=CCC5=C5C(=C4NCO)CCC4=C5OCO4)N=C32)C=C1O Intermediate Fragment 
201 501.1517088121 NC1=C2CCC3OCOC3C2=C2CC=CC=C2C1=[NH+]C1=NC(O)=C2N=CN(C3C=C(O)C(=C=O)O3)C2=N1
202 529.1466234321 NC(O)C1CC2=C(OCO2)C2=C3CC=CC=C3C(=[NH+]C3=NC(O)=C4N=CN(C5C=C(O)C(=C=O)O5)C4=N3)C=C21 Intermediate Fragment 
203 529.1466234321 NC1=C2C(=C3CC=CC=C3C1=[NH+]C1=NC(O)=C3N=CN(C4C=C(O)C(=C=O)O4)C3=N1)C1=C(CC2CO)OCO1 Intermediate Fragment 
204 529.1466234321 O=C=C1OC(N2C=NC3=C(O)N=C([NH+]=C4C5=CC=CCC5=C5C(OCO)=CCC6C5=C4NC6O)N=C32)C=C1O Intermediate Fragment 
205 499.1360587481 O=C=C1OC(N2C=NC3=C(O)N=C([NH+]=C4C5=CC=CCC5=C5C(O)=CCC6C5=C4NC6O)N=C32)C=C1O
206 529.1466234321 O=C=C1OC(N2C=NC3=C(O)N=C([NH+]=C4C5=CC=CCC5=C5C=C(OCO)CC6C5=C4NC6O)N=C32)C=C1O Intermediate Fragment 
207 499.1360587481 O=C=C1OC(N2C=NC3=C(O)N=C([NH+]=C4C5=CC=CCC5=C5C=C(O)CC6C5=C4NC6O)N=C32)C=C1O
208 529.1466234321 COC1=C(O)C2=C3CC=CC=C3C(=[NH+]C3=NC(O)=C4N=CN(C5C=C(O)C(=C=O)O5)C4=N3)C3=C2C(C1)C(O)N3 Intermediate Fragment 
209 497.1204086841 O=C=C1OC(N2C=NC3=C(O)N=C([NH+]=C4C5=CC=CCC5=C5C(O)=CC=C6C5=C4NC6O)N=C32)C=C1O
210 383.0887146321 O=C1C=CC2C(=O)N=C3C(=[NH+]C4=NC(=O)C5=NC=NC5=N4)C4=CC=CCC4=C1C32
211 513.1153233041 O=C=C1OC(N2C=NC3=C(O)N=C([NH+]=C4C5=CC=CCC5=C5C(O)=C(O)C=C6C5=C4NC6O)N=C32)C=C1O
212 399.0836292521 O=C1N=C([NH+]=C2C3=CC=CC=C3C3=C4C(=CC(=O)C3O)C(=O)NC24)N=C2N=CN=C12
213 511.1360587481 COC1=CC2=C3CC=CC=C3C(=[NH+]C3=NC(O)=C4N=CN(C5C=C(O)C(=C=O)O5)C4=N3)C3=C2C(=C1)C(O)N3
214 529.1466234321 COC1=C(O)CC2C3=C(NC2O)C(=[NH+]C2=NC(O)=C4N=CN(C5C=C(O)C(=C=O)O5)C4=N2)C2=CC=CCC2=C13 Intermediate Fragment 
215 529.1466234321 O=C=C1OC(N2C=NC3=C(O)N=C([NH+]=C=C4NC(O)C5CC6OCOC6C(C6=CC=CC=C6)=C45)N=C32)C=C1O Intermediate Fragment 
216 529.1466234321 O=C=C1OC(N2C=NC3=C(O)N=C([NH+]=CC4=CC=CCC4=C4C5=CNC(O)C5CC5=C4OCO5)N=C32)C=C1O Intermediate Fragment 
