#In-silico ESI-MS/MS [M+H]+ Spectra
#PREDICTED BY CFM-ID 4.0.8
#SMILES=O1[C@H](CO)[C@@H](C[C@@H]1n1ccc2n(c1=O)ccn2)O
#InChiKey=UFLBVEMEAYZXKY-NQMVMOMDSA-N
energy0
136.05054 100.00 2 39 34 52 54 48 (53.66 2.9849 1.7505 0.50159 0.41233 0.016235)
252.09788 49.10 0 132 79 120 152 174 124 131 183 182 187 148 185 151 (27.859 0.51361 0.33187 0.19215 0.083294 0.071366 0.030088 0.017521 0.017456 0.0074074 0.0072507 0.00083478 0.00026562 2.3001e-05)
energy1
81.04472 2.92 17 (1.7922)
99.04406 3.69 69 7 65 (1.4784 0.64704 0.1343)
108.05562 12.13 30 (7.4376)
109.03964 4.32 56 36 (1.6013 1.0444)
136.05054 100.00 2 34 39 54 52 48 (49.601 5.0252 3.1368 1.5178 1.4032 0.62439)
162.06619 5.42 92 127 (3.2211 0.10303)
192.07675 2.59 118 81 (0.9657 0.62158)
energy2
40.01818 6.07 55 (2.1157)
45.03349 5.90 67 (2.0581)
57.03349 6.67 71 (2.3248)
68.01309 2.96 45 (1.034)
69.04472 5.34 44 (1.8612)
71.04914 6.80 113 114 (1.644 0.72888)
81.04472 16.12 17 (5.6224)
91.02907 9.68 40 (3.3765)
93.04472 21.55 29 (7.515)
99.04406 4.23 7 65 69 (1.0801 0.23918 0.15538)
108.05562 18.67 30 (6.5138)
109.03964 6.36 56 36 (2.2112 0.0073052)
119.02399 3.71 57 35 (1.2266 0.068418)
134.03489 3.88 47 38 53 58 51 (0.54802 0.30421 0.29086 0.18348 0.025461)
136.05054 100.00 39 2 54 48 34 52 (16.274 7.8219 4.8663 2.8392 2.2357 0.84344)
142.04987 3.62 150 (1.2625)
148.05054 4.98 103 (1.7363)
194.09240 2.87 123 (0.99985)

0 252.0978823481 O=c1n(C2CC(O)C(C[OH2+])O2)ccc2nccn12
1 220.0716676001 OC1=COC(N2C=CC3NC=CN3C2=[OH+])=C1
2 136.0505382321 [OH+]=C1N=CC=C2NC=CN12
3 222.0873176641 OC1=COC(N2C=CC3NCCN3C2=[OH+])=C1
4 224.1029677281 OC1=COC(N2C=CC3NCCN3C2[OH2+])=C1
5 234.0873176641 C=C1OC(N2C=CC3NC=CN3C2=[OH+])C=C1O
6 138.0661882961 [OH+]=C1N=CC=C2NCCN12
7 99.0440558841 C=C1OC=CC1[OH2+]
8 216.0767529801 C=C1C=CC(N2C=CC3=NC=CN3C2=[OH+])O1
9 234.0873176641 C#COC(=C=CO)N1C=CC2NCCN2C1=[OH+] Intermediate Fragment 
10 234.0873176641 C=C(C=O)OC(=C)N1C=CC2NC=CN2C1=[OH+] Intermediate Fragment 
11 234.0873176641 C=C1OC(=NC=C=C2NCCN2C=[OH+])C=C1O Intermediate Fragment 
12 142.0974884241 [OH2+]C1N=CCC2NCCN12
13 142.0974884241 N=C=CC1NCCN1C[OH2+] Intermediate Fragment 
14 142.0974884241 [OH2+]CN=C=CC1NCCN1 Intermediate Fragment 
15 142.0974884241 C=C=NC([OH2+])N1CCNC1 Intermediate Fragment 
16 142.0974884241 C=NC([OH2+])N1CCNC1=C Intermediate Fragment 
17 81.0447245801 [CH3+]=C1N=CC=N1
18 85.0760247081 [CH3+]=C1NCCN1
19 87.0916747721 [CH4+]C1NCCN1
20 111.0552892641 C=C1NC=CN1C=[OH+]
21 142.0974884241 NCCN1C=CC=NC1[OH2+] Intermediate Fragment 
22 44.0494756121 C=C[NH3+]
23 142.0974884241 CNC1=CC=NC([OH2+])N1C Intermediate Fragment 
24 140.0818383601 [OH2+]C1N=CC=C2NCCN21
25 140.0818383601 C=NC(=[OH+])N1CCNC1=C Intermediate Fragment 
26 140.0818383601 NCCN1C=CC=NC1=[OH+] Intermediate Fragment 
27 138.0661882961 [OH+]=CN=C=C=C1NCCN1 Intermediate Fragment 
28 95.0603746441 [CH2+]#CC1=NCCN1
29 93.0447245801 [CH2+]#CC1=NC=CN1
30 108.0556236121 [NH+]#CC=C1N=CCN1
31 138.0661882961 C=NC(=[OH+])N1C=CNC1=C Intermediate Fragment 
32 83.0603746441 [CH3+]=C1N=CCN1
33 138.0661882961 NC=CN1C=CC=NC1=[OH+] Intermediate Fragment 
34 136.0505382321 N=C=C=C1NC=CN1C=[OH+] Intermediate Fragment 
35 119.0239891361 C#CC1=NC=CN1C#[O+]
36 109.0396392001 C=C1NC=CN1C#[O+]
37 106.0399735481 [NH+]#CC=C1N=CC=N1
38 134.0348881681 N#CC=C1NC=CN1C#[O+]
39 136.0505382321 [OH+]=CN=C=C=C1N=CCN1 Intermediate Fragment 
40 91.0290745161 [C+]#CC1=NC=CN1
41 44.0130901041 [NH2+]=C=O
42 79.0290745161 [CH+]=C1N=CC=N1
43 56.0130901041 C#[N+]C=O
44 69.0447245801 C1=C[NH+]=CN1
45 68.0130901041 C#C[NH+]=C=O
46 104.0243234841 N#C[C+]=C1N=CC=N1
47 134.0348881681 O=C[NH+]=C=C=C1N=CC=N1
48 136.0505382321 C=C=NC(=[OH+])N1C=CN=C1 Intermediate Fragment 
49 42.0338255481 CC#[NH+]
50 95.0239891361 [O+]#CN1C=CN=C1
51 134.0348881681 [CH+]=C=NC(=O)N1C=CN=C1
52 136.0505382321 C=C=NC1=CC=NC([OH2+])=N1 Intermediate Fragment 
53 134.0348881681 [C+]#CNC1=CC=NC(O)=N1
54 136.0505382321 N=C=CN1C=CC=NC1=[OH+] Intermediate Fragment 
55 40.0181754841 [C+]#CN
56 109.0396392001 [CH2+]N1C=CC=NC1=O
57 119.0239891361 [C+]#CN1C=CC=NC1=O
58 134.0348881681 N=C=[C+]N1C=CC=NC1=O
59 113.0233204401 OC1C=COC1=C=[OH+]
60 115.0389705041 OC1CCOC1=C=[OH+]
61 87.0440558841 [OH2+]C1=COCC1
62 115.0389705041 CC=C(O)C(=O)C=[OH+] Intermediate Fragment 
63 117.0546205681 OC1CCOC1=C[OH2+]
64 89.0597059481 [OH2+]C1CCOC1
65 99.0440558841 [OH+]=C=C1CCCO1
66 117.0546205681 OCCC(O)C#C[OH2+] Intermediate Fragment 
67 45.0334912001 C=C[OH2+]
68 89.0597059481 CC(O)C=C[OH2+]
69 99.0440558841 CC=C(O)C#C[OH2+]
70 117.0546205681 OCCCOC#C[OH2+] Intermediate Fragment 
71 57.0334912001 CC#C[OH2+]
72 117.0546205681 CCOC(=C=[OH+])CO Intermediate Fragment 
73 91.0389705041 OCC(=[OH+])CO
74 117.0546205681 COC(=C=[OH+])C(C)O Intermediate Fragment 
75 117.0546205681 CCC(O)C(=O)C=[OH+] Intermediate Fragment 
76 59.0491412641 CC=C[OH2+]
77 61.0284058201 OCC=[OH+]
78 29.0385765801 C=[CH3+]
79 252.0978823481 OC(=C=C(O)N1C=CC2NCCN2C1O)C#C[OH2+] Intermediate Fragment 
80 210.0873176641 O=C1N(C([OH2+])C#CO)C=CC2NCCN12
81 192.0767529801 C#CC([OH2+])N1C=CC2NC=CN2C1=O
82 208.0716676001 O=C1N(C([OH2+])C#CO)C=CC2NC=CN12
83 190.0611029161 C#CC(=[OH+])N1C=CC2NC=CN2C1=O
84 208.0716676001 O=CN(C=C=C1N=CCN1)C([OH2+])C#CO Intermediate Fragment 
85 206.0560175361 O=C1N(C(=[OH+])C#CO)C=CC2NC=CN12
86 178.0611029161 C=C([OH2+])N1C=CC2=NC=CN2C1=O
87 188.0454528521 C#CC(=[OH+])N1C=CC2=NC=CN2C1=O
88 47.0491412641 CC[OH2+]
89 184.1080531081 C=C([OH2+])N1C=CC2NCCN2C1O
90 182.0924030441 C=C([OH2+])N1C=CC2NCCN2C1=O
91 180.0767529801 C=C([OH2+])N1C=CC2NC=CN2C1=O
92 162.0661882961 C#CN1C=CC2NC=CN2C1=[OH+]
93 178.0611029161 C=C([OH2+])N=C=C=C1NC=CN1C=O Intermediate Fragment 
94 176.0454528521 [CH+]=C(O)N1C=CC2=NC=CN2C1=O
95 68.9971056921 [O+]#CC#CO
96 71.0127557561 O=CC#C[OH2+]
97 73.0284058201 OCC#C[OH2+]
98 55.0178411361 C#CC=[OH+]
99 75.0440558841 OCC=C[OH2+]
100 168.0767529801 O=C1N(C[OH2+])C=CC2NC=CN12
101 150.0661882961 CN1C=CC2=NC=CN2C1=[OH+]
102 166.0611029161 O=C1N(C=[OH+])C=CC2NC=CN12
103 148.0505382321 [CH2+]N1C=CC2=NC=CN2C1=O
104 164.0454528521 O=C1N(C=[OH+])C=CC2=NC=CN12
105 164.0454528521 O=CN1C=CNC1=C=CN=C=[OH+] Intermediate Fragment 
106 164.0454528521 O=CN(C=[OH+])C=C=C1N=CC=N1 Intermediate Fragment 
107 162.0298027881 O=C1N(C#[O+])C=CC2=NC=CN12
108 162.0298027881 O=C=NC=C=C1NC=CN1C#[O+] Intermediate Fragment 
109 87.0440558841 CC(O)C#C[OH2+]
110 69.0334912001 C#CC(=C)[OH2+]
111 43.0178411361 C#C[OH2+]
112 69.0334912001 C=CC#C[OH2+]
113 71.0491412641 C#CC(C)[OH2+]
114 71.0491412641 CCC#C[OH2+]
115 91.0753560121 CC(O)CC[OH2+]
116 73.0647913281 C=CC(C)[OH2+]
117 234.0873176641 O=C1N(C=C=C(O)C#C[OH2+])C=CC2NCCN12
118 192.0767529801 OC#CCN1C=CC2NC=CN2C1=[OH+]
119 250.0822322841 O=C1N(C([OH2+])=C=C(O)C#CO)C=CC2NCCN12
120 252.0978823481 OC=C=C(OC#C[OH2+])N1C=CC2NCCN2C1O Intermediate Fragment 
121 224.1029677281 C=C([OH+]C#CO)N1C=CC2NCCN2C1O
122 63.0440558841 OCC[OH2+]
123 194.0924030441 OC#CCN1C=CC2NCCN2C1=[OH+]
124 252.0978823481 C=C(OC(=C=[OH+])CO)N1C=CC2NCCN2C1=O Intermediate Fragment 
125 160.0505382321 C#CN1C=CC2=NC=CN2C1=[OH+]
126 160.0505382321 C#CN=C=C=C1NC=CN1C=[OH+] Intermediate Fragment 
127 162.0661882961 C#CN=C=C=C1NCCN1C=[OH+] Intermediate Fragment 
128 164.0818383601 C#CN1C=CC2NCCN2C1=[OH+]
129 166.0974884241 C#CN1C=CC2NCCN2C1[OH2+]
130 168.1131384881 C#CN1CCC2NCCN2C1[OH2+]
131 252.0978823481 C=C(O)C(=C=[OH+])OCN1C=CC2NCCN2C1=O Intermediate Fragment 
132 252.0978823481 O=C(C=[OH+])C(O)=C=CN1C=CC2NCCN2C1O Intermediate Fragment 
133 196.1080531081 OC#CCN1C=CC2NCCN2C1[OH2+]
134 190.0611029161 OC#CCN1C=CC2=NC=CN2C1=[OH+]
135 190.0611029161 OC#CC=NC=C=C1NC=CN1C=[OH+] Intermediate Fragment 
136 59.0127557561 O=C=C[OH2+]
137 41.0021910721 [C+]#CO
138 89.0233204401 O=CC(=[OH+])CO
139 73.0284058201 CC(=[OH+])C=O
140 93.0546205681 OCC([OH2+])CO
141 75.0440558841 CC(=[OH+])CO
142 154.0974884241 CN1C=CC2NCCN2C1=[OH+]
143 152.0818383601 CN1C=CC2NC=CN2C1=[OH+]
144 150.0661882961 C=NC=C=C1NC=CN1C=[OH+] Intermediate Fragment 
145 150.0661882961 CN(C=[OH+])C=C=C1N=CC=N1 Intermediate Fragment 
146 150.0661882961 C=CN([CH2+])C(=O)N1C=CN=C1 Intermediate Fragment 
147 250.0822322841 O=CC(=[OH+])C(O)=C=CN1C=CC2NCCN2C1=O
148 252.0978823481 C=C1NCCN1C(=O)N(C)C1C=C(O)C(=C=[OH+])O1 Intermediate Fragment 
149 172.0604342201 C[NH+](CO)C1C=C(O)C(=C=O)O1
150 142.0498695361 C[NH2+]C1C=C(O)C(=C=O)O1
151 252.0978823481 C=CN(C(=O)N1CCNC1)C1C=C(O)C(=C=[OH+])O1 Intermediate Fragment 
152 252.0978823481 OCN(C=C=C1NCCN1)C1C=C(O)C(=C=[OH+])O1 Intermediate Fragment 
153 99.0916747721 [CH3+]=CC1NCCN1
154 97.0760247081 [CH2+]#CC1NCCN1
155 180.0291340921 C#C[NH+](C=O)C1C=C(O)C(=C=O)O1
156 70.0287401681 C#C[NH2+]C=O
157 182.0447841561 C#C[NH+](CO)C1C=C(O)C(=C=O)O1
158 184.0604342201 C=C[NH+](CO)C1C=C(O)C(=C=O)O1
159 224.1029677281 O=C=C1OC(=[NH+]CCC2NCCN2)C=C1O
160 206.0924030441 C=C1OC(=[NH+]C#CC2NCCN2)C=C1O
161 144.0655196001 C[NH2+]C1CC(O)C(=C=O)O1
162 206.0924030441 O=C=C1C=CC(=[NH+]C=CC2NCCN2)O1
163 224.1029677281 OC#CC(O)=C=C(O)[NH+]=CCC1NCCN1 Intermediate Fragment 
164 178.0611029161 OC#CC(O)=[NH+]C#CC1=NCCN1
165 152.0818383601 C=C(O)[NH+]=C=C=C1NCCN1
166 150.0661882961 C=C(O)[NH+]=C=C=C1N=CCN1
167 206.0924030441 OC#CC(O)=C=C=[NH+]C=CC1NCCN1
168 222.0873176641 OC#CC(O)=C=C(O)[NH+]=C=CC1NCCN1
169 224.1029677281 OC#COC(=C=CO)[NH+]=CCC1NCCN1 Intermediate Fragment 
170 224.1029677281 C=C([NH+]=C=CC1NCCN1)OC(=C=O)CO Intermediate Fragment 
171 224.1029677281 C=C(O)C(=C=O)OC=[NH+]C=CC1NCCN1 Intermediate Fragment 
172 224.1029677281 O=CC(=O)C(O)=C=C=[NH+]CCC1NCCN1 Intermediate Fragment 
173 220.0716676001 O=C=C1OC(=[NH+]C#CC2NCCN2)C=C1O
174 252.0978823481 OCN1CCNC1C=CN=C1C=C(O)C(=C=[OH+])O1 Intermediate Fragment 
175 127.0865893921 C#CC1NCCN1C[OH2+]
176 125.0709393281 C#CC1NCCN1C=[OH+]
177 123.0552892641 C#CC1NC=CN1C=[OH+]
178 121.0396392001 C#CC1=NC=CN1C=[OH+]
179 132.0655196001 [NH3+]C1CC(O)C(=CO)O1
180 154.0498695361 CC[NH+]=C1C=C(O)C(=C=O)O1
181 156.0655196001 CC[NH2+]C1C=C(O)C(=C=O)O1
182 252.0978823481 CCNC1=NC(O)N(C2C=C(O)C(=C=[OH+])O2)C=C1 Intermediate Fragment 
183 252.0978823481 NCCN1CC=CN(C2C=C(O)C(=C=[OH+])O2)C1=O Intermediate Fragment 
184 225.0869833161 CN1CC=CN(C2C=C(O)C(=C=[OH+])O2)C1O
185 252.0978823481 CCN1C(=O)N(C2C=C(O)C(=C=[OH+])O2)C=CC1N Intermediate Fragment 
186 235.0713332521 C=CN1CC=CN(C2C=C(O)C(=C=[OH+])O2)C1=O
187 252.0978823481 CNC1C=CN(C2C=C(O)C(=C=[OH+])O2)C(=O)N1C Intermediate Fragment 
188 221.0556831881 [CH2+]N1CC=CN(C2C=C(O)C(=C=O)O2)C1=O
