#In-silico ESI-MS/MS [M+H]+ Spectra
#PREDICTED BY CFM-ID 4.0.8
#SMILES=n1cnc2c(c1NC(C(=O)O)CCO)ncn2[C@H]1C[C@H]([C@H](O1)CO)O
#InChiKey=FNFYJTWGKJBFNX-NPTNVHDASA-N
energy0
136.06177 55.63 29 (13.666)
220.08290 49.12 111 119 30 (7.306 4.725 0.03604)
238.09347 100.00 117 131 123 122 132 130 133 (24.381 0.10193 0.057952 0.01278 0.0082316 0.0036712 0.0017258)
252.10912 25.70 38 75 77 52 65 53 49 48 158 51 46 47 50 (6.2352 0.023545 0.010564 0.0096678 0.0095559 0.006317 0.0055412 0.0054524 0.0035992 0.0022081 0.0014642 0.00061739 0.00030836)
336.13025 31.66 98 110 141 140 101 176 (5.0072 1.3487 1.2247 0.15039 0.044544 0.0016619)
354.14081 67.82 0 204 154 205 186 144 162 142 152 153 (16.525 0.051519 0.019982 0.016044 0.013815 0.011166 0.010518 0.0044545 0.0041759 0.0039057)
energy1
134.04612 13.73 28 (4.5728)
136.06177 46.78 29 (15.584)
208.08290 17.26 108 73 (5.7479 0.0015904)
220.08290 100.00 119 111 30 (16.887 16.38 0.046233)
222.09855 13.95 99 112 43 (3.9587 0.6699 0.01977)
238.09347 56.64 117 123 130 132 131 133 122 (17.978 0.41659 0.1231 0.11994 0.10774 0.082365 0.041086)
energy2
91.03897 6.90 13 (1.7796)
114.05495 3.43 151 (0.88537)
117.05462 4.82 114 115 6 (0.54841 0.5014 0.19345)
121.05087 5.73 4 (1.4788)
134.04612 23.42 28 (6.043)
136.06177 100.00 29 (25.8)
138.07742 9.58 40 (2.4728)
140.09307 10.60 41 (2.7351)
142.10872 9.11 42 (2.3514)
144.12437 5.93 79 (1.5309)
148.06177 5.35 159 (1.3804)
162.07742 4.27 57 (1.1006)
190.07234 8.87 37 118 (2.187 0.10103)
192.08799 20.56 61 94 (3.368 1.9367)
194.10364 10.46 96 62 (2.0105 0.68708)
208.08290 8.72 108 73 (1.2931 0.95627)
219.08765 4.42 17 10 11 (0.77288 0.2085 0.15893)
220.08290 8.20 111 30 119 (1.6289 0.4336 0.053537)
222.09855 4.11 112 99 43 (0.86272 0.12159 0.076499)
234.09855 19.89 64 44 45 (2.8416 1.2741 1.0147)
236.11420 3.60 84 81 80 (0.50068 0.28868 0.13873)
238.09347 28.34 117 123 133 131 122 130 132 (7.2995 0.0061663 0.0034895 0.0016202 0.00069076 0.00063572 0.00026575)
252.10912 3.87 53 65 75 38 158 77 49 47 51 46 48 50 52 (0.43574 0.22891 0.13821 0.085544 0.02735 0.015448 0.013015 0.01194 0.010595 0.010335 0.0077015 0.0073347 0.0067424)

0 354.1408097801 O=C(O)C(CCO)[NH2+]c1ncnc2c1ncn2C1CC(O)C(CO)O1
1 120.0655196001 [NH2+]=C(CCO)C(O)O
2 233.0669165681 OC1=C(C[OH2+])OC(N2C=NC3=CN=CN=C32)=C1
3 235.0825666321 OC1C=C(N2C=NC3=CN=CN=C32)OC1C[OH2+]
4 121.0508725801 C1=NC2=NC=[NH+]CC2=N1
5 237.0982166961 OC1CC(N2C=NC3=CN=CN=C32)OC1C[OH2+]
6 117.0546205681 OC1C=COC1C[OH2+]
7 123.0665226441 C1=[NH+]CC2=NCNC2=N1
8 125.0821727081 C1=[NH+]CC2NCNC2=N1
9 127.0978227721 C1=[NH+]CC2NCNC2N1
10 219.0876520121 CC1OC(N2C=NC3=CN=CN=C32)=CC1[OH2+]
11 219.0876520121 [OH2+]CC1CC=C(N2C=NC3=CN=CN=C32)O1
12 237.0982166961 OC(C=CN1C=NC2=CN=CN=C21)C(O)C[OH2+] Intermediate Fragment 
13 91.0389705041 OC=C([OH2+])CO
14 147.0665226441 C=[CH2+]N1C=NC2=CN=CN=C21
15 175.0614372641 [OH2+]CC#CN1C=NC2=CN=CN=C21
16 177.0770873281 [OH2+]CC=CN1C=NC2=CN=CN=C21
17 219.0876520121 OC(C#CN1C=NC2=CN=CN=C21)CC[OH2+]
18 237.0982166961 OC(=CC(O)CC[OH2+])N1C=NC2=CN=CN=C21 Intermediate Fragment 
19 237.0982166961 OCC=C(OCC[OH2+])N1C=NC2=CN=CN=C21 Intermediate Fragment 
20 239.1138667601 OC1CC(N2CNC3=CN=CN=C32)OC1C[OH2+]
21 241.1295168241 OC1CC(N2CNC3CN=CN=C32)OC1C[OH2+]
22 107.0702706321 OCCCC(O)[OH2+]
23 105.0546205681 OCCCC(O)=[OH+]
24 103.0389705041 OCC=CC(O)=[OH+]
25 57.0334912001 C#CC[OH2+]
26 101.0233204401 OCC#CC(O)=[OH+]
27 248.0778156001 [NH3+]C1=C2N=CN(C3=CC(O)=C(CO)O3)C2=NC=N1
28 134.0461215481 [NH2+]=C1N=CN=C2N=CN=C12
29 136.0617716121 [NH2+]=C1N=CN=C2NCN=C12
30 220.0829009801 [NH3+]C1=C2N=CN(C3=CC(O)CO3)C2=NC=N1
31 250.0934656641 [NH3+]C1=C2N=CN(C3=CC(O)C(CO)O3)C2=NC=N1
32 232.0829009801 CC1=C(O)C=C(N2C=NC3=C([NH3+])N=CN=C32)O1
33 232.0829009801 [NH3+]C1=C2N=CN(C3=CC=C(CO)O3)C2=NC=N1
34 250.0934656641 C=C(O)C(=CO)OCN1C=NC2=C([NH3+])N=CN=C21 Intermediate Fragment 
35 250.0934656641 [NH3+]C1=C2N=CN(C(O)=C=C(O)CCO)C2=NC=N1 Intermediate Fragment 
36 250.0934656641 [NH3+]C1=C2N=CN(C(=C=CO)OCCO)C2=NC=N1 Intermediate Fragment 
37 190.0723362961 [NH3+]C1=C2N=CN(C#CCO)C2=NC=N1
38 252.1091157281 [NH3+]C1=C2N=CN(C3CC(O)C(CO)O3)C2=NC=N1
39 119.0702706321 OC1CCOC1C[OH2+]
40 138.0774216761 [NH2+]=C1N=CN=C2NCNC12
41 140.0930717401 [NH3+]C1N=CN=C2NCNC21
42 142.1087218041 [NH3+]C1N=CNC2NCNC12
43 222.0985510441 [NH3+]C1=C2N=CN(C3CC(O)CO3)C2=NC=N1
44 234.0985510441 CC1OC(N2C=NC3=C([NH3+])N=CN=C32)=CC1O
45 234.0985510441 [NH3+]C1=C2N=CN(C3=CCC(CO)O3)C2=NC=N1
46 252.1091157281 N=C=NC1=C(C#[NH+])NCN1C1CC(O)C(CO)O1 Intermediate Fragment 
47 252.1091157281 N=C=NC(=[NH2+])C1=CN(C2CC(O)C(CO)O2)C=N1 Intermediate Fragment 
48 252.1091157281 C=NC([NH3+])=C1N=CN(C2=CC(O)C(CO)O2)C1=N Intermediate Fragment 
49 252.1091157281 N=CN(C1=CC(O)C(CO)O1)C1=NC=NC([NH3+])=C1 Intermediate Fragment 
50 252.1091157281 [NH3+]C1=C(N=C=NC2CC(O)C(CO)O2)C=NC=N1 Intermediate Fragment 
51 252.1091157281 C=NC1=C([NH3+])N=CN=C1N=C1CC(O)C(CO)O1 Intermediate Fragment 
52 252.1091157281 C=C(O)C(CO)OCN1C=NC2=C([NH3+])N=CN=C21 Intermediate Fragment 
53 252.1091157281 [NH3+]C1=C2N=CN(C=CC(O)C(O)CO)C2=NC=N1 Intermediate Fragment 
54 93.0546205681 OCC([OH2+])CO
55 89.0233204401 O=CC([OH2+])=CO
56 160.0617716121 C#CN1C=NC2=C([NH3+])N=CN=C21
57 162.0774216761 C=CN1C=NC2=C([NH3+])N=CN=C21
58 164.0930717401 CCN1C=NC2=C([NH3+])N=CN=C21
59 166.1087218041 CCN1CNC2=C([NH3+])N=CN=C21
60 168.1243718681 CCN1CNC2C1=NC=NC2[NH3+]
61 192.0879863601 [NH3+]C1=C2N=CN(C=CCO)C2=NC=N1
62 194.1036364241 [NH3+]C1=C2N=CN(CCCO)C2=NC=N1
63 196.1192864881 [NH3+]C1=C2NCN(CCCO)C2=NC=N1
64 234.0985510441 [NH3+]C1=C2N=CN(C#CC(O)CCO)C2=NC=N1
65 252.1091157281 [NH3+]C1=C2N=CN(C(O)=CC(O)CCO)C2=NC=N1 Intermediate Fragment 
66 89.0597059481 C=C(O)CC[OH2+]
67 75.0440558841 OC=CC[OH2+]
68 73.0284058201 OC#CC[OH2+]
69 178.0723362961 C=C(O)N1C=NC2=C([NH3+])N=CN=C21
70 182.1036364241 CC(O)N1CNC2=C([NH3+])N=CN=C21
71 184.1192864881 CC(O)N1CNC2C1=NC=NC2[NH3+]
72 206.0672509161 [NH3+]C1=C2N=CN(C(O)=C=CO)C2=NC=N1
73 208.0829009801 [NH3+]C1=C2N=CN(C(O)=CCO)C2=NC=N1
74 210.0985510441 [NH3+]C1=C2N=CN(C(O)CCO)C2=NC=N1
75 252.1091157281 [NH3+]C1=C2N=CN(C(=CCO)OCCO)C2=NC=N1 Intermediate Fragment 
76 47.0491412641 CC[OH2+]
77 252.1091157281 C=C(OC(CO)CO)N1C=NC2=C([NH3+])N=CN=C21 Intermediate Fragment 
78 254.1247657921 [NH3+]C1=C2NCN(C3CC(O)C(CO)O3)C2=NC=N1
79 144.1243718681 [NH3+]C1NCNC2NCNC12
80 236.1142011081 CC1OC(N2C=NC3=C([NH3+])N=CN=C32)CC1O
81 236.1142011081 [NH3+]C1=C2N=CN(C3CCC(CO)O3)C2=NC=N1
82 254.1247657921 C=NC1=C([NH3+])N=CN=C1NC1CC(O)C(CO)O1 Intermediate Fragment 
83 254.1247657921 [NH3+]C1=C2N=CN(CCC(O)C(O)CO)C2=NC=N1 Intermediate Fragment 
84 236.1142011081 [NH3+]C1=C2N=CN(C=CC(O)CCO)C2=NC=N1
85 254.1247657921 [NH3+]C1=C2N=CN(C(O)CC(O)CCO)C2=NC=N1 Intermediate Fragment 
86 256.1404158561 [NH3+]C1N=CN=C2C1NCN2C1CC(O)C(CO)O1
87 238.1298511721 [NH3+]C1=C2NCN(C3CCC(CO)O3)C2=NC=N1
88 256.1404158561 [NH3+]C1=C2NCN(CCC(O)C(O)CO)C2=NC=N1 Intermediate Fragment 
89 256.1404158561 [NH3+]C1=C2NCN(C(O)CC(O)CCO)C2=NC=N1 Intermediate Fragment 
90 258.1560659201 [NH3+]C1N=CNC2C1NCN2C1CC(O)C(CO)O1
91 258.1560659201 [NH3+]C1N=CN=C2C1NCN2CCC(O)C(O)CO Intermediate Fragment 
92 258.1560659201 [NH3+]C1N=CN=C2C1NCN2C(O)CC(O)CCO Intermediate Fragment 
93 306.1196804121 OC=C=C=[NH+]C1=C2NCN(C3CC(O)C(CO)O3)C2=NC=N1
94 192.0879863601 OCC=C=[NH+]C1=C2NCNC2=NC=N1
95 308.1353304761 OCC=C=[NH+]C1=C2NCN(C3CC(O)C(CO)O3)C2=NC=N1
96 194.1036364241 OCCC=[NH+]C1=C2NCNC2=NC=N1
97 310.1509805401 OCCC=[NH+]C1=C2NCN(C3CC(O)C(CO)O3)C2=NC=N1
98 336.1302450961 O=CC(C=CO)=[NH+]C1=C2NCN(C3CC(O)C(CO)O3)C2=NC=N1
99 222.0985510441 O=CC(CCO)=[NH+]C1=C2NCNC2=NC=N1
100 224.1142011081 OCCC(CO)=[NH+]C1=C2NCNC2=NC=N1
101 336.1302450961 O=CC(C#CO)=[NH+]C1=C2NCN(C(O)CC(O)CCO)C2=NC=N1 Intermediate Fragment 
102 308.0989449681 OCC1OC(N2C=NC3=C([NH+]=C=C(O)O)N=CN=C32)CC1O
103 194.0672509161 O=C(O)C=[NH+]C1=C2NCNC2=NC=N1
104 310.1145950321 OCC1OC(N2CNC3=C([NH+]=C=C(O)O)N=CN=C32)CC1O
105 312.1302450961 OCC1OC(N2CNC3=C([NH+]=CC(O)O)N=CN=C32)CC1O
106 322.1145950321 CC(=[NH+]C1=C2N=CN(C3CC(O)C(CO)O3)C2=NC=N1)C(=O)O
107 206.0672509161 CC(=[NH+]C1=C2N=CNC2=NC=N1)C(=O)O
108 208.0829009801 CC(=[NH+]C1=C2NCNC2=NC=N1)C(=O)O
109 324.1302450961 CC(=[NH+]C1=C2NCN(C3CC(O)C(CO)O3)C2=NC=N1)C(=O)O
110 336.1302450961 C=CC(=[NH+]C1=C2NCN(C3CC(O)C(CO)O3)C2=NC=N1)C(=O)O
111 220.0829009801 C=CC(=[NH+]C1=C2NCNC2=NC=N1)C(=O)O
112 222.0985510441 CCC(=[NH+]C1=C2NCNC2=NC=N1)C(=O)O
113 99.0440558841 CC1=C([OH2+])C=CO1
114 117.0546205681 C=COC(=CO)C[OH2+] Intermediate Fragment 
115 117.0546205681 OC=C=C(O)CC[OH2+] Intermediate Fragment 
116 236.0778156001 O=C(O)C(C=CO)=[NH+]C1=C2NCNC2=NC=N1
117 238.0934656641 O=C(O)C(CCO)=[NH+]C1=C2NCNC2=NC=N1
118 190.0723362961 OC=C=C=[NH+]C1=C2NCNC2=NC=N1
119 220.0829009801 O=CC(C=CO)=[NH+]C1=C2NCNC2=NC=N1
120 192.0516008521 OC(O)=C=[NH+]C1=C2N=CNC2=NC=N1
121 210.0985510441 CC(=[NH+]C1=C2NCNC2=NC=N1)C(O)O
122 238.0934656641 N=C=NC1=C(C=[NH+]C(C=CO)=C(O)O)NCN1 Intermediate Fragment 
123 238.0934656641 OC=CC([NH+]=CN=C=NC1=CNCN1)=C(O)O Intermediate Fragment 
124 145.0607685681 [NH3+]C=NC(C=CO)=C(O)O
125 157.0607685681 C=[NH+]C=NC(C=CO)=C(O)O
126 109.0508725801 [NH+]#CN=C1C=NCN1
127 107.0352225161 [NH+]#CN=C1C=NC=N1
128 130.0498695361 C=[NH+]C(C=CO)=C(O)O
129 132.0655196001 C=[NH+]C(CCO)=C(O)O
130 238.0934656641 C=NC([NH+]=C(C=CO)C(=O)O)=C1NCNC1=N Intermediate Fragment 
131 238.0934656641 C=NC1=C(C(N)=[NH+]C(C#CO)=C(O)O)NCN1 Intermediate Fragment 
132 238.0934656641 NCNC1=C([NH+]=C(C=CO)C(=O)O)N=CN=C1 Intermediate Fragment 
133 238.0934656641 CNC1=C([NH+]=C(C=CO)C(=O)O)N=CN=C1N Intermediate Fragment 
134 209.0669165681 NC1=NC=NC([NH+]=C(C=CO)C(=O)O)=C1
135 211.0825666321 NC1=NC=NC([NH+]=C(CCO)C(=O)O)=C1
136 221.0669165681 CNC1=C([NH+]=C(C#CO)C(=O)O)N=CN=C1
137 240.1091157281 OCCC(=[NH+]C1=C2NCNC2=NC=N1)C(O)O
138 242.1247657921 OCCC([NH2+]C1=C2NCNC2=NC=N1)C(O)O
139 244.1404158561 OCCC([NH2+]C1N=CN=C2NCNC21)C(O)O
140 336.1302450961 CC1OC(N2CNC3=C([NH+]=C(C=CO)C(=O)O)N=CN=C32)CC1O
141 336.1302450961 O=C(O)C(C=CO)=[NH+]C1=C2NCN(C3CCC(CO)O3)C2=NC=N1
142 354.1408097801 N=C=NC1=C(C=[NH+]C(C=CO)=C(O)O)NCN1C1CC(O)C(CO)O1 Intermediate Fragment 
143 327.1299107481 [NH2+]=C1C(=C=NC(C=CO)=C(O)O)NCN1C1CC(O)C(CO)O1
144 354.1408097801 OC=CC([NH+]=CN=C=NC1=CNCN1C1CC(O)C(CO)O1)=C(O)O Intermediate Fragment 
145 216.1342678561 C=[NH+]C1CNCN1C1CC(O)C(CO)O1
146 212.1029677281 C=[NH+]C1=CN=CN1C1CC(O)C(CO)O1
147 94.0399735481 C#[N+]C1=CN=CN1
148 210.0873176641 C=[NH+]C1=CN=CN1C1=CC(O)C(CO)O1
149 208.0716676001 C=[NH+]C1=CN=CN1C1=CC(O)=C(CO)O1
150 225.0982166961 [NH+]#CN=C1C=NCN1C1CC(O)C(CO)O1
151 114.0549549161 C=CC([NH+]=C)=C(O)O
152 354.1408097801 C=NC1=C(C(N)=[NH+]C(C#CO)=C(O)O)NCN1C1CC(O)C(CO)O1 Intermediate Fragment 
153 354.1408097801 CNC1=C([NH+]=C(C=CO)C(=O)O)N=CN=C1NC1CC(O)C(CO)O1 Intermediate Fragment 
154 354.1408097801 CC(O)C(CO)OCN1CNC2=C([NH+]=C(C=CO)C(=O)O)N=CN=C21 Intermediate Fragment 
155 87.0440558841 C=C(O)C=C[OH2+]
156 256.1404158561 CN1CNC2=C([NH2+]C(CCO)C(O)O)N=CN=C21
157 254.1247657921 CN1CNC2=C([NH+]=C(CCO)C(O)O)N=CN=C21
158 252.1091157281 CN1CNC2=C([NH+]=C(CCO)C(=O)O)N=CN=C21
159 148.0617716121 [CH2+]N1C=NC2=C(N)N=CN=C21
160 250.0934656641 CN1CNC2=C([NH+]=C(C=CO)C(=O)O)N=CN=C21
161 248.0778156001 CN1CNC2=C([NH+]=C(C#CO)C(=O)O)N=CN=C21
162 354.1408097801 O=C(O)C(C=CO)=[NH+]C1=C2NCN(CCC(O)C(O)CO)C2=NC=N1 Intermediate Fragment 
163 61.0284058201 OCC=[OH+]
164 73.0284058201 CC([OH2+])=C=O
165 262.0934656641 CCN1CNC2=C([NH+]=C(C#CO)C(=O)O)N=CN=C21
166 264.1091157281 CCN1CNC2=C([NH+]=C(C=CO)C(=O)O)N=CN=C21
167 266.1247657921 CCN1CNC2=C([NH+]=C(CCO)C(=O)O)N=CN=C21
168 268.1404158561 CCN1CNC2=C([NH+]=C(CCO)C(O)O)N=CN=C21
169 270.1560659201 CCN1CNC2=C([NH2+]C(CCO)C(O)O)N=CN=C21
170 292.1040303481 O=C(O)C(C#CO)=[NH+]C1=C2NCN(CCCO)C2=NC=N1
171 274.0934656641 O=CC(C#CO)=[NH+]C1=C2N=CN(CCCO)C2=NC=N1
172 294.1196804121 O=C(O)C(C=CO)=[NH+]C1=C2NCN(CCCO)C2=NC=N1
173 296.1353304761 O=C(O)C(CCO)=[NH+]C1=C2NCN(CCCO)C2=NC=N1
174 278.1247657921 O=CC(C=CO)=[NH+]C1=C2NCN(CCCO)C2=NC=N1
175 298.1509805401 OCCCN1CNC2=C([NH+]=C(CCO)C(O)O)N=CN=C21
176 336.1302450961 O=C(O)C(C#CO)=[NH+]C1=C2NCN(CCC(O)CCO)C2=NC=N1
177 221.1033020761 OC(C=CN1C=NC2=CN=CN=C21)CC[OH2+]
178 238.1298511721 [NH3+]C1=C2N=CN(CCC(O)CCO)C2=NC=N1
179 240.1455012361 [NH3+]C1=C2NCN(CCC(O)CCO)C2=NC=N1
180 292.1404158561 OC=C=C=[NH+]C1=C2NCN(CCC(O)CCO)C2=NC=N1
181 318.1196804121 O=CC(C#CO)=[NH+]C1=C2N=CN(CCC(O)CCO)C2=NC=N1
182 308.1353304761 CC(=[NH+]C1=C2N=CN(CCC(O)CCO)C2=NC=N1)C(=O)O
183 318.1196804121 C#CC(=[NH+]C1=C2N=CN(CCC(O)CCO)C2=NC=N1)C(=O)O
184 318.1196804121 CCC(O)CCN1C=NC2=C([NH+]=C(C#CO)C(=O)O)N=CN=C21
185 318.1196804121 O=C(O)C(C#CO)=[NH+]C1=C2N=CN(CCCCCO)C2=NC=N1
186 354.1408097801 O=C(O)C(C=CO)=[NH+]C1=C2NCN(C(O)CC(O)CCO)C2=NC=N1 Intermediate Fragment 
187 264.0727302201 O=C(O)C(C#CO)=[NH+]C1=C2NCN(CO)C2=NC=N1
188 164.0566862321 [NH3+]C1=C2N=CN(C=O)C2=NC=N1
189 266.0883802841 O=C(O)C(C=CO)=[NH+]C1=C2NCN(CO)C2=NC=N1
190 268.1040303481 O=C(O)C(CCO)=[NH+]C1=C2NCN(CO)C2=NC=N1
191 270.1196804121 OCCC(=[NH+]C1=C2NCN(CO)C2=NC=N1)C(O)O
192 77.0597059481 OCCC[OH2+]
193 59.0491412641 CC=C[OH2+]
194 45.0334912001 C=C[OH2+]
195 278.0883802841 CC(O)N1CNC2=C([NH+]=C(C#CO)C(=O)O)N=CN=C21
196 280.1040303481 CC(O)N1CNC2=C([NH+]=C(C=CO)C(=O)O)N=CN=C21
197 282.1196804121 CC(O)N1CNC2=C([NH+]=C(CCO)C(=O)O)N=CN=C21
198 264.1091157281 CC(O)N1CNC2=C([NH+]=C(C=O)C=CO)N=CN=C21
199 284.1353304761 CC(O)N1CNC2=C([NH+]=C(CCO)C(O)O)N=CN=C21
200 286.1509805401 CC(O)N1CNC2=C([NH2+]C(CCO)C(O)O)N=CN=C21
201 308.0989449681 O=C(O)C(C#CO)=[NH+]C1=C2NCN(C(O)CCO)C2=NC=N1
202 310.1145950321 O=C(O)C(C=CO)=[NH+]C1=C2NCN(C(O)CCO)C2=NC=N1
203 312.1302450961 O=C(O)C(CCO)=[NH+]C1=C2NCN(C(O)CCO)C2=NC=N1
204 354.1408097801 O=C(O)C(C=CO)=[NH+]C1=C2NCN(C(CCO)OCCO)C2=NC=N1 Intermediate Fragment 
205 354.1408097801 CC(OC(CO)CO)N1CNC2=C([NH+]=C(C=CO)C(=O)O)N=CN=C21 Intermediate Fragment 
