#In-silico ESI-MS/MS [M+H]+ Spectra
#PREDICTED BY CFM-ID 4.0.8
#SMILES=[nH]1c(nc2c(c1=O)nc(n2[C@H]1C[C@H]([C@H](O1)CO)O)C(C)O)N
#InChiKey=IGULLZBPOSSPKQ-UVSCYPECSA-N
energy0
196.08290 49.41 36 55 50 60 71 44 61 73 58 68 (26.995 0.049067 0.040349 0.034443 0.023506 0.014954 0.010394 0.0078171 0.0074447 0.0066274)
312.13025 100.00 0 229 147 255 144 151 254 145 115 137 117 128 130 133 (54.404 0.18717 0.16093 0.11531 0.036319 0.033623 0.024456 0.018625 0.015822 0.012612 0.0055364 0.0046995 0.0032455 0.0010986)
energy1
99.04406 13.03 20 21 33 (2.3886 1.0591 0.70995)
101.05971 5.73 16 5 6 (0.78008 0.74544 0.3039)
117.05462 6.81 17 30 24 29 22 (1.2326 0.33409 0.24093 0.22071 0.14525)
178.07234 78.77 42 37 163 (25.043 0.093769 0.0019159)
179.05635 7.26 43 62 45 70 (1.6639 0.32234 0.18792 0.14215)
180.08799 6.16 77 2 179 (1.8806 0.086069 2.4667e-05)
196.08290 100.00 36 61 55 71 50 58 44 73 60 68 (30.012 0.76201 0.32489 0.24155 0.20067 0.13075 0.12498 0.041314 0.039842 0.037946)
200.11420 4.22 78 80 (1.3451 0.0020171)
294.11968 13.06 98 93 85 211 112 91 108 1 103 94 102 104 87 88 222 226 224 (1.8246 1.1172 0.89368 0.088252 0.05605 0.049883 0.036801 0.030265 0.023101 0.016807 0.01513 0.0057708 0.0043433 0.0030349 0.002804 0.0014143 0.0005752)
312.13025 15.62 0 229 254 151 147 128 117 115 144 130 255 145 133 137 (4.6867 0.067846 0.043257 0.041542 0.029318 0.025555 0.025255 0.016026 0.011269 0.01102 0.010604 0.0088104 0.0071442 0.0017951)
energy2
45.03349 28.10 8 (3.0842)
57.03349 11.67 14 (1.2812)
59.04914 18.04 15 (1.9802)
71.04914 8.36 232 233 (0.58686 0.33036)
99.04406 6.59 21 20 33 (0.34696 0.22073 0.15585)
101.05971 9.39 6 5 16 (0.4829 0.28025 0.26778)
111.05529 10.54 126 184 (0.81051 0.34655)
112.05054 16.78 136 (1.8419)
125.04579 20.46 69 (2.2458)
150.04104 10.23 38 (1.1226)
151.06144 10.30 172 52 (1.0768 0.054073)
152.05669 6.81 39 (0.74801)
178.07234 28.68 42 163 37 (1.6125 1.3649 0.17104)
179.05635 7.10 43 70 45 62 (0.63862 0.12121 0.015522 0.0043606)
180.08799 12.91 179 2 77 (0.81039 0.36867 0.23763)
182.10364 14.95 79 190 (0.83925 0.80132)
194.06725 18.02 35 67 72 75 (1.88 0.0607 0.018942 0.018872)
196.08290 66.38 36 71 61 73 50 58 44 68 55 60 (4.3455 0.68209 0.61672 0.41294 0.33267 0.25604 0.24625 0.22198 0.11394 0.058125)
200.11420 15.88 78 80 (1.4275 0.31604)
202.12985 10.35 81 82 (0.94012 0.19613)
206.06725 78.79 89 109 (8.6257 0.023484)
208.08290 43.13 150 110 (4.7065 0.028396)
220.08290 27.72 90 171 175 167 177 176 166 170 (1.3046 0.88429 0.26815 0.20585 0.13003 0.1214 0.064708 0.064208)
222.09855 100.00 178 182 180 185 186 (4.2734 3.668 1.4383 1.2549 0.34267)
224.07782 51.78 149 (5.6837)
224.11420 9.61 187 188 (0.77445 0.28013)
226.09347 26.11 148 (2.8664)
241.09313 14.16 135 (1.5539)
252.10912 9.48 203 198 201 206 207 113 (0.30468 0.29556 0.23802 0.085517 0.07676 0.040359)
310.11460 17.96 146 228 252 (1.33 0.6039 0.037399)

0 312.1302450961 CC(O)c1nc2c(=O)[nH]c([NH3+])nc2n1C1CC(O)C(CO)O1
1 294.1196804121 CC(O)C1=NC2=CN=C([NH3+])N=C2N1C1=CC(O)C(CO)O1
2 180.0879863601 CC(O)C1=NC2=CN=C([NH3+])N=C2N1
3 119.0702706321 OC1CCOC1C[OH2+]
4 87.0440558841 [OH2+]C1C=COC1
5 101.0597059481 CC1OC=CC1[OH2+]
6 101.0597059481 [OH2+]CC1CC=CO1
7 119.0702706321 C=COC(CO)C[OH2+] Intermediate Fragment 
8 45.0334912001 C=C[OH2+]
9 73.0284058201 OC#CC[OH2+]
10 119.0702706321 OCC=COCC[OH2+] Intermediate Fragment 
11 119.0702706321 OC=CC(O)CC[OH2+] Intermediate Fragment 
12 119.0702706321 C=CC(O)C(O)C[OH2+] Intermediate Fragment 
13 61.0284058201 OCC=[OH+]
14 57.0334912001 C#CC[OH2+]
15 59.0491412641 C=CC[OH2+]
16 101.0597059481 C#CC(O)CC[OH2+]
17 117.0546205681 C#CC(O)C([OH2+])CO
18 85.0284058201 [OH2+]C1=COC=C1
19 89.0597059481 [OH2+]C1CCOC1
20 99.0440558841 CC1=C([OH2+])C=CO1
21 99.0440558841 [OH2+]CC1=CC=CO1
22 117.0546205681 C=C(O)C(=C[OH2+])OC Intermediate Fragment 
23 43.0178411361 C#C[OH2+]
24 117.0546205681 C=COC(=CO)C[OH2+] Intermediate Fragment 
25 89.0597059481 C=C[OH+]CCO
26 47.0491412641 CC[OH2+]
27 75.0440558841 OC=CC[OH2+]
28 91.0389705041 OC=C([OH2+])CO
29 117.0546205681 OC=C=COCC[OH2+] Intermediate Fragment 
30 117.0546205681 OC=C=C(O)CC[OH2+] Intermediate Fragment 
31 89.0597059481 C=C(O)CC[OH2+]
32 87.0440558841 C=C(O)C=C[OH2+]
33 99.0440558841 C#CC(O)=CC[OH2+]
34 115.0389705041 OC1=C(C[OH2+])OC=C1
35 194.0672509161 C=C(O)C1=NC2=C(O)N=C([NH3+])N=C2N1
36 196.0829009801 CC(O)C1=NC2=C(O)N=C([NH3+])N=C2N1
37 178.0723362961 C=C(O)C1=NC2=CN=C([NH3+])N=C2N1
38 150.0410361681 [NH3+]C1=NC(=O)C2=NC=NC2=N1
39 152.0566862321 [NH3+]C1=NC(=O)C2=NCNC2=N1
40 154.0723362961 [NH3+]C1=NC(=O)C2NCNC2=N1
41 180.0516008521 [NH3+]C1=NC(O)=C2N=C(C=O)NC2=N1
42 178.0723362961 C=CC1=NC2=C(O)N=C([NH3+])N=C2N1
43 179.0563518841 C=C(O)C1=NC2=C([OH2+])N=CN=C2N1
44 196.0829009801 CC(O)C1=NC(=C=O)C(=NC(=N)[NH3+])N1 Intermediate Fragment 
45 179.0563518841 C=C(O)C1=NC(C=O)=C([NH+]=C=N)N1
46 154.0611029161 CC(O)C1=NC(=C=O)C(=[NH2+])N1
47 152.0454528521 C=C(O)C1=NC(=C=O)C(=[NH2+])N1
48 137.0345538201 C=C(O)C1=NC(=C=[OH+])C=N1
49 168.0879863601 CC(O)C1=NC(=NC(N)=[NH2+])C=N1
50 196.0829009801 CC(O)C1=NC(=NC([NH3+])=NC=O)C=N1 Intermediate Fragment 
51 153.0770873281 C=C(O)C1=NC=C([NH+]=CN)N1
52 151.0614372641 C=C(O)C1=NC=C([NH+]=C=N)N1
53 126.0661882961 CC(O)C1=NC(=[NH2+])C=N1
54 124.0505382321 C=C(O)C1=NC(=[NH2+])C=N1
55 196.0829009801 C=C(O)C1=NC(C(=O)N=C(N)[NH3+])=CN1 Intermediate Fragment 
56 154.0611029161 C=C(O)C1=NC(C([NH3+])=O)=CN1
57 109.0396392001 [CH+]=C(O)C1=NC=CN1
58 196.0829009801 C=C(O)C1=NC(=C(O)N=C[NH3+])C(=N)N1 Intermediate Fragment 
59 150.0298027881 [CH+]=C(O)C1=NC(=C=O)C(=N)N1
60 196.0829009801 C=C(O)C1=NC(C(N)=O)=C(N=C[NH3+])N1 Intermediate Fragment 
61 196.0829009801 C=C(O)C(=N)NC1=NC([NH3+])=NC(O)=C1 Intermediate Fragment 
62 179.0563518841 [CH2+]C(O)=C=NC1=NC(N)=NC(O)=C1
63 127.0614372641 NC1=NC(O)=CC([NH3+])=N1
64 68.0130901041 [CH+]=C(O)C#N
65 70.0287401681 C=C(O)C#[NH+]
66 85.0396392001 [CH+]=C(O)C(=N)N
67 194.0672509161 [CH+]=C(O)C(=N)NC1=NC(N)=NC(O)=C1
68 196.0829009801 C=C(O)C(N)=NC1=C(O)N=C([NH3+])N=C1 Intermediate Fragment 
69 125.0457872001 NC1=NC(=O)C(=[NH2+])C=N1
70 179.0563518841 [CH2+]C(O)=C=NC1=C(O)N=C(N)N=C1
71 196.0829009801 CC(O)=C=NC1=C(O)N=C([NH3+])N=C1N Intermediate Fragment 
72 194.0672509161 [CH2+]C(O)=C=NC1=C(O)N=C(N)N=C1N
73 196.0829009801 CC(O)=C=NC1=NC([NH3+])=NC(O)=C1N Intermediate Fragment 
74 127.0614372641 NC1=NC(=O)C([NH3+])C=N1
75 194.0672509161 [CH2+]C(O)=C=NC1=NC(N)=NC(O)=C1N
76 198.0985510441 CC(O)C1NC2=NC([NH3+])=NC(O)=C2N1
77 180.0879863601 CCC1=NC2=C(O)N=C([NH3+])N=C2N1
78 200.1142011081 CC(O)C1NC2=NC([NH3+])=NC(O)C2N1
79 182.1036364241 CCC1NC2=NC([NH3+])=NC(O)=C2N1
80 200.1142011081 CC(O)CNC1=C(O)N=C([NH3+])N=C1N Intermediate Fragment 
81 202.1298511721 CC(O)C1NC2NC([NH3+])=NC(O)C2N1
82 202.1298511721 CC(O)CNC1=NC([NH3+])=NC(O)C1N Intermediate Fragment 
83 280.1040303481 CC(O)C1=NC2=C(O)N=C([NH3+])N=C2N1C1=CC(O)CO1
84 282.1196804121 CC(O)C1=NC2=C(O)N=C([NH3+])N=C2N1C1CC(O)CO1
85 294.1196804121 CC(O)C1=NC2=C(O)N=C([NH3+])N=C2N1C1=CC(O)C(C)O1
86 276.1091157281 CCC1=NC2=C(O)N=C([NH3+])N=C2N1C1=CC(O)=C(C)O1
87 294.1196804121 CC1=C(O)C=C(N2C(=NC([NH3+])=NC=O)C=NC2C(C)O)O1 Intermediate Fragment 
88 294.1196804121 CC(O)C(O)=C=CN1C2=NC([NH3+])=NC(O)=C2N=C1C(C)O Intermediate Fragment 
89 206.0672509161 C=C(O)C1=NC2=C(O)N=C(N)N=C2N1[CH2+]
90 220.0829009801 C#CN1C2=NC([NH3+])=NC(O)=C2N=C1C(C)O
91 294.1196804121 CCC(O)=C=C(O)N1C2=NC([NH3+])=NC(O)=C2N=C1C(C)O Intermediate Fragment 
92 268.1040303481 CC(O)C1=NC2=C(O)N=C([NH3+])N=C2N1C(O)=CCO
93 294.1196804121 CC(O)C1=NC2=C(O)N=C([NH3+])N=C2N1C1=CCC(CO)O1
94 294.1196804121 CC(O)C1=NC2=C(O)N=C([NH3+])N=C2N1C(O)=C=CCCO Intermediate Fragment 
95 266.0883802841 [NH3+]C1=NC(O)=C2N=CN(C3=CC(O)C(CO)O3)C2=N1
96 268.1040303481 [NH3+]C1=NC(O)=C2N=CN(C3CC(O)C(CO)O3)C2=N1
97 270.1196804121 [NH3+]C1=NC(O)=C2NCN(C3CC(O)C(CO)O3)C2=N1
98 294.1196804121 CCC1=NC2=C(O)N=C([NH3+])N=C2N1C1=CC(O)C(CO)O1
99 184.1192864881 CCC1NC2=NC([NH3+])=NC(O)C2N1
100 264.1091157281 CCC1=NC2=C(O)N=C([NH3+])N=C2N1C1=CC(O)CO1
101 276.1091157281 CCC1=NC2=C(O)N=C([NH3+])N=C2N1C1=CC=C(CO)O1
102 294.1196804121 CCC1N=CC(=NC([NH3+])=NC=O)N1C1=CC(O)=C(CO)O1 Intermediate Fragment 
103 294.1196804121 C=C(O)C(=CO)OCN1C(CC)=NC2=C(O)N=C([NH3+])N=C21 Intermediate Fragment 
104 294.1196804121 CCC1=NC2=C(O)N=C([NH3+])N=C2N1C=C=C(O)C(O)CO Intermediate Fragment 
105 204.0879863601 C#CN1C(CC)=NC2=C(O)N=C([NH3+])N=C21
106 206.1036364241 C=CN1C(CC)=NC2=C(O)N=C([NH3+])N=C21
107 276.1091157281 CCC1=NC2=C(O)N=C([NH3+])N=C2N1C#CC(O)=CCO
108 294.1196804121 CCC1=NC2=C(O)N=C([NH3+])N=C2N1C(O)=C=C(O)CCO Intermediate Fragment 
109 206.0672509161 C#CC1=NC2=C(O)N=C([NH3+])N=C2N1CO
110 208.0829009801 C=CC1=NC2=C(O)N=C([NH3+])N=C2N1CO
111 250.0934656641 CCC1=NC2=C(O)N=C([NH3+])N=C2N1C(O)=C=CO
112 294.1196804121 CCC1=NC2=C(O)N=C([NH3+])N=C2N1C(=C=CO)OCCO Intermediate Fragment 
113 252.1091157281 CCC1=NC2=C(O)N=C([NH3+])N=C2N1C(O)=CCO
114 295.1036960001 CC(O)C1=NC2=C([OH2+])N=CN=C2N1C1=CC(O)C(CO)O1
115 312.1302450961 CC(O)C1=NC(=C=O)C(=NC(=N)[NH3+])N1C1CC(O)C(CO)O1 Intermediate Fragment 
116 284.1353304761 CC(O)C1N=CC(=NC(N)=[NH2+])N1C1=CC(O)C(CO)O1
117 312.1302450961 CC(O)C1N=CC(=NC([NH3+])=NC=O)N1C1=CC(O)C(CO)O1 Intermediate Fragment 
118 269.1244314441 CC(O)C1=NC=C([NH+]=CN)N1C1=CC(O)C(CO)O1
119 242.1135324121 CC(O)C1N=CC(=[NH2+])N1C1=CC(O)C(CO)O1
120 267.1087813801 CC(O)C1=NC=C([NH+]=CN)N1C1=CC(O)=C(CO)O1
121 265.0931313161 CC(O)C1=NC=C([NH+]=CN)N1C1=CC(O)=C(C=O)O1
122 225.0869833161 CC(O)C1=NC=CN1C1=CC(O)=C(C[OH2+])O1
123 224.1029677281 CCC1N=CC(=[NH2+])N1C1=CC(O)=C(CO)O1
124 242.1135324121 CC(O)C1N=CC(=[NH2+])N1C(=C=CO)OCCO Intermediate Fragment 
125 227.1026333801 CC(O)C1=NC=CN1C1=CC(O)C(C[OH2+])O1
126 111.0552892641 C=C([OH2+])C1=NC=CN1
127 223.0713332521 CC(O)C1=NC=CN1C1=CC(O)=C(C=[OH+])O1
128 312.1302450961 CC(O)C1=NC(C(=O)N=C(N)[NH3+])=CN1C1=CC(O)C(CO)O1 Intermediate Fragment 
129 253.0818979361 CC(O)C1=NC(C=[OH+])=CN1C1=CC(O)=C(CO)O1
130 312.1302450961 CC(O)C1=NC(=C(O)N=C[NH3+])C(=N)N1C1=CC(O)C(CO)O1 Intermediate Fragment 
131 268.0927969681 CC(O)C1=NC(=C=O)C(=[NH2+])N1C1=CC(O)C(CO)O1
132 270.1084470321 CC(O)C1=NC(=C=O)C(=[NH2+])N1C1CC(O)C(CO)O1
133 312.1302450961 CC(O)C(=N)N(C1=CC(O)C(CO)O1)C1=NC([NH3+])=NC(O)=C1 Intermediate Fragment 
134 243.1087813801 NC1=NC(O)=CC([NH2+]C2CC(O)C(CO)O2)=N1
135 241.0931313161 NC1=NC(O)=CC([NH+]=C2CC(O)C(CO)O2)=N1
136 112.0505382321 [NH3+]C1=NC(O)=CC=N1
137 312.1302450961 CC(O)C(N=C1CC(O)C(CO)O1)=NC1=C(O)N=C([NH3+])N=C1 Intermediate Fragment 
138 199.0713332521 CC(O)C(=[NH2+])N=C1C=C(O)C(=CO)O1
139 132.0655196001 [NH2+]=C1CC(O)C(CO)O1
140 132.0655196001 [NH2+]=C(O)C=C(O)CCO Intermediate Fragment 
141 181.0720019481 CC(O)=C=[NH+]C1=C(O)N=C(N)N=C1
142 183.0876520121 CC(O)C=[NH+]C1=C(O)N=C(N)N=C1
143 185.1033020761 CC(O)C[NH2+]C1=C(O)N=C(N)N=C1
144 312.1302450961 CC(O)C=NC1=C(O)N=C([NH3+])N=C1N=C1CC(O)C(CO)O1 Intermediate Fragment 
145 312.1302450961 CC(O)CN(C1=CC(O)=C(CO)O1)C1=NC([NH3+])=NC(O)=C1N Intermediate Fragment 
146 310.1145950321 CC(O)CN(C1=CC(O)=C(C=O)O1)C1=NC(N)=NC(O)=C1[NH3+]
147 312.1302450961 C=C(O)C(CO)OCN1C2=NC([NH3+])=NC(O)=C2N=C1C(C)O Intermediate Fragment 
148 226.0934656641 CC(O)C1=NC2=C(O)N=C([NH3+])N=C2N1CO
149 224.0778156001 C=C(O)C1=NC2=C(O)N=C([NH3+])N=C2N1CO
150 208.0829009801 C=C(O)C1=NC2=C(O)N=C([NH3+])N=C2N1C
151 312.1302450961 CC(O)C1=NC2=C(O)N=C([NH3+])N=C2N1C=CC(O)C(O)CO Intermediate Fragment 
152 105.0546205681 C=C(O)C([OH2+])CO
153 210.0985510441 CC(O)C1=NC2=C(O)N=C([NH3+])N=C2N1C
154 192.0879863601 C=CC1=NC2=C(O)N=C([NH3+])N=C2N1C
155 212.1142011081 CC(O)C1NC2=C(O)N=C([NH3+])N=C2N1C
156 93.0546205681 OCC([OH2+])CO
157 75.0440558841 CC([OH2+])=CO
158 73.0284058201 CC([OH2+])=C=O
159 89.0233204401 O=CC([OH2+])=CO
160 192.0516008521 C=C(O)C1=NC2=NC([NH3+])=NC(=O)C2=N1
161 174.0410361681 [C+]#CN1C=NC2=C(O)N=C(N)N=C21
162 176.0566862321 C#CN1C=NC2=C(O)N=C([NH3+])N=C21
163 178.0723362961 C=CN1C=NC2=C(O)N=C([NH3+])N=C21
164 202.0723362961 C#CN1C(C=C)=NC2=C(O)N=C([NH3+])N=C21
165 203.0563518841 C#CN1C(C(=C)O)=NC2=C([OH2+])N=CN=C21
166 220.0829009801 C#CN1C(=NC(=N)[NH3+])C(=C=O)N=C1C(C)O Intermediate Fragment 
167 220.0829009801 C#CN1C(=NC([NH3+])=NC=O)C=NC1=C(C)O Intermediate Fragment 
168 177.0770873281 C#CN1C([NH+]=CN)=CN=C1C(=C)O
169 152.0818383601 C#CN1C(=[NH2+])C=NC1C(C)O
170 220.0829009801 C#CN1C(=N)C(=C(O)N=C[NH3+])N=C1C(=C)O Intermediate Fragment 
171 220.0829009801 C#CN(C(=N)C(=C)O)C1=NC([NH3+])=NC(O)=C1 Intermediate Fragment 
172 151.0614372641 C=C=[NH+]C1=NC(N)=NC(O)=C1
173 149.0457872001 [CH+]=C=NC1=NC(N)=NC(O)=C1
174 109.0396392001 [CH+]=C=NC(=N)C(=C)O
175 220.0829009801 C=C=NC(=NC1=C(O)N=C([NH3+])N=C1)C(=C)O Intermediate Fragment 
176 220.0829009801 C=C=NC1=NC([NH3+])=NC(O)=C1N=C=C(C)O Intermediate Fragment 
177 220.0829009801 [C+]#CN(C=C(C)O)C1=NC(N)=NC(O)=C1N Intermediate Fragment 
178 222.0985510441 C=CN1C2=NC([NH3+])=NC(O)=C2N=C1C(C)O
179 180.0879863601 CCN1C=NC2=C(O)N=C([NH3+])N=C21
180 222.0985510441 C#CN1C(=NC([NH3+])=NC=O)C=NC1C(C)O Intermediate Fragment 
181 194.1036364241 C#CN1C(=NC(N)=[NH2+])C=NC1C(C)O
182 222.0985510441 C#CN(C(=N)C(C)O)C1=NC([NH3+])=NC(O)=C1 Intermediate Fragment 
183 153.0770873281 CC=[NH+]C1=NC(N)=NC(O)=C1
184 111.0552892641 C=C=NC(=[NH2+])C(=C)O
185 222.0985510441 C=C=NC(=NC1=C(O)N=C([NH3+])N=C1)C(C)O Intermediate Fragment 
186 222.0985510441 C#CN(C=C(C)O)C1=NC([NH3+])=NC(O)=C1N Intermediate Fragment 
187 224.1142011081 CCN1C2=NC([NH3+])=NC(O)=C2N=C1C(C)O
188 224.1142011081 C=CN(C(=N)C(C)O)C1=NC([NH3+])=NC(O)=C1 Intermediate Fragment 
189 226.1298511721 CCN1C2=NC([NH3+])=NC(O)=C2NC1C(C)O
190 182.1036364241 CCN1CNC2=C(O)N=C([NH3+])N=C21
191 208.1192864881 CCC1=NC2=C(O)N=C([NH3+])N=C2N1CC
192 228.1455012361 CCN1C2=NC([NH3+])=NC(O)C2NC1C(C)O
193 184.1192864881 CCN1CNC2C1=NC([NH3+])=NC2O
194 210.1349365521 CCC1NC2=C(O)N=C([NH3+])N=C2N1CC
195 228.1455012361 CCNC(NC1=C(O)N=C([NH3+])N=C1)C(C)O Intermediate Fragment 
196 228.1455012361 CCNC1=NC([NH3+])=NC(O)=C1NCC(C)O Intermediate Fragment 
197 250.0934656641 CC(O)C1=NC2=C(O)N=C([NH3+])N=C2N1C#CCO
198 252.1091157281 CC(O)C1=NC2=C(O)N=C([NH3+])N=C2N1C=CCO
199 234.0985510441 CC#CN1C2=NC([NH3+])=NC(O)=C2N=C1C(C)O
200 234.0985510441 CCC1=NC2=C(O)N=C([NH3+])N=C2N1C#CCO
201 252.1091157281 CC(O)C1N=CC(=NC([NH3+])=NC=O)N1C#CCO Intermediate Fragment 
202 182.0924030441 CC(O)C1N=CC(=[NH2+])N1C#CCO
203 252.1091157281 CC(O)C(=N)N(C#CCO)C1=NC([NH3+])=NC(O)=C1 Intermediate Fragment 
204 183.0876520121 NC1=NC(O)=CC([NH+]=CCCO)=N1
205 181.0720019481 NC1=NC(O)=CC([NH+]=C=CCO)=N1
206 252.1091157281 CC(O)C(N=C=CCO)=NC1=C(O)N=C([NH3+])N=C1 Intermediate Fragment 
207 252.1091157281 CC(O)C=NC1=C(O)N=C([NH3+])N=C1N=C=CCO Intermediate Fragment 
208 254.1247657921 CC(O)C1=NC2=C(O)N=C([NH3+])N=C2N1CCCO
209 236.1142011081 CCC1=NC2=C(O)N=C([NH3+])N=C2N1C=CCO
210 256.1404158561 CC(O)C1NC2=C(O)N=C([NH3+])N=C2N1CCCO
211 294.1196804121 CC(O)C1=NC2=C(O)N=C([NH3+])N=C2N1C#CC(O)CCO
212 103.0753560121 C=CC(O)CC[OH2+]
213 77.0597059481 OCCC[OH2+]
214 218.0672509161 C#CN1C(C(=C)O)=NC2=C(O)N=C([NH3+])N=C21
215 248.0778156001 CC(O)C1=NC2=C(O)N=C([NH3+])N=C2N1C#CC=O
216 262.0934656641 C=C(O)C#CN1C2=NC([NH3+])=NC(O)=C2N=C1C(C)O
217 264.1091157281 CC(O)C#CN1C2=NC([NH3+])=NC(O)=C2N=C1C(C)O
218 266.1247657921 CC(O)C=CN1C2=NC([NH3+])=NC(O)=C2N=C1C(C)O
219 276.1091157281 CC=C(O)C#CN1C2=NC([NH3+])=NC(O)=C2N=C1C(C)O
220 276.1091157281 CC(O)C1=NC2=C(O)N=C([NH3+])N=C2N1C#CC=CCO
221 250.0934656641 [NH3+]C1=NC(O)=C2N=CN(C#CC(O)CCO)C2=N1
222 294.1196804121 CC(O)C1=NC(=C=O)C(=NC(=N)[NH3+])N1C#CC(O)CCO Intermediate Fragment 
223 266.1247657921 CC(O)C1N=CC(=NC(N)=[NH2+])N1C#CC(O)=CCO
224 294.1196804121 CC(O)C1N=CC(=NC([NH3+])=NC=O)N1C#CC(O)=CCO Intermediate Fragment 
225 226.1186177921 CC(O)C1N=CC(=[NH2+])N1C#CC(O)CCO
226 294.1196804121 CC(O)C(=N)N(C#CC(O)=CCO)C1=NC([NH3+])=NC(O)=C1 Intermediate Fragment 
227 225.0982166961 NC1=NC(O)=CC([NH+]=C=CC(O)CCO)=N1
228 310.1145950321 CC(O)C1=NC2=C(O)N=C([NH3+])N=C2N1C#CC(O)C(O)CO
229 312.1302450961 CC(O)C1=NC2=C(O)N=C([NH3+])N=C2N1C(O)=CC(O)CCO Intermediate Fragment 
230 91.0753560121 CC(O)CC[OH2+]
231 73.0647913281 C=C([OH2+])CC
232 71.0491412641 C=CC(=C)[OH2+]
233 71.0491412641 C#CCC[OH2+]
234 222.0621655361 C=C(O)C1=NC2=C(O)N=C([NH3+])N=C2N1C=O
235 204.0516008521 C#CC1=NC2=C(O)N=C([NH3+])N=C2N1C=O
236 222.0621655361 CC(O)=C1N=CC(=NC(N)=NC=O)N1C#[O+] Intermediate Fragment 
237 154.0611029161 CC(O)=C1N=CC(=[NH2+])N1C=O
238 222.0621655361 C=C(O)C(=N)N(C#[O+])C1=NC(N)=NC(O)=C1 Intermediate Fragment 
239 153.0407018201 NC1=NC(O)=CC([NH+]=C=O)=N1
240 222.0621655361 CC(O)=C=NC1=C(O)N=C([NH3+])N=C1N=C=O Intermediate Fragment 
241 228.1091157281 CC(O)C1NC2=C(O)N=C([NH3+])N=C2N1CO
242 236.0778156001 C=C(O)C1=NC2=C(O)N=C([NH3+])N=C2N1C(=C)O
243 238.0934656641 C=C(O)N1C2=NC([NH3+])=NC(O)=C2N=C1C(C)O
244 238.0934656641 C=C(O)C(N=C(C)O)=NC1=C(O)N=C([NH3+])N=C1 Intermediate Fragment 
245 240.1091157281 CC(O)C1=NC2=C(O)N=C([NH3+])N=C2N1C(C)O
246 242.1247657921 CC(O)C1NC2=C(O)N=C([NH3+])N=C2N1C(C)O
247 244.1404158561 CC(O)C1NC2C(=NC([NH3+])=NC2O)N1C(C)O
248 266.0883802841 CC(O)C1=NC2=C(O)N=C([NH3+])N=C2N1C(O)=C=CO
249 268.1040303481 CC(O)C1N=CC(=NC([NH3+])=NC=O)N1C(O)=C=CO Intermediate Fragment 
250 268.1040303481 CC(O)C(N=C(O)C=CO)=NC1=C(O)N=C([NH3+])N=C1 Intermediate Fragment 
251 270.1196804121 CC(O)C1=NC2=C(O)N=C([NH3+])N=C2N1C(O)CCO
252 310.1145950321 CC(O)C1=NC2=C(O)N=C([NH3+])N=C2N1C(O)=C=C(O)CCO
253 292.1040303481 CC(O)C1=NC2=C(O)N=C([NH3+])N=C2N1C(O)=C=C=CCO
254 312.1302450961 CC(O)C1=NC2=C(O)N=C([NH3+])N=C2N1C(=CCO)OCCO Intermediate Fragment 
255 312.1302450961 C=C(OC(CO)CO)N1C2=NC([NH3+])=NC(O)=C2N=C1C(C)O Intermediate Fragment 
