#In-silico ESI-MS/MS [M+H]+ Spectra
#PREDICTED BY CFM-ID 4.0.8
#SMILES=[nH]1c(nc2c(c1=O)ncn2[C@@H]1O[C@H](CO)[C@@H](C1)O)Nc1c2c(ccc1N)c1c(cc2)cccc1
#InChiKey=WDNSIJUYLCRXEQ-GUDVDZBRSA-N
energy0
343.13019 100.00 19 61 38 70 28 75 57 74 48 40 71 73 59 51 54 47 72 66 69 63 42 (87.431 0.14736 0.11183 0.10518 0.087256 0.069889 0.069073 0.060064 0.054709 0.045905 0.035141 0.034878 0.032994 0.027489 0.02272 0.019407 0.018567 0.011644 0.0097428 0.0089054 0.0063561)
energy1
326.10364 9.76 27 29 49 53 44 (6.5447 0.27451 0.2575 0.16569 0.014281)
343.13019 100.00 19 28 63 61 70 38 54 73 48 57 66 74 72 75 59 42 51 69 47 40 71 (68.89 1.2938 1.1035 0.60661 0.42302 0.3475 0.31889 0.24939 0.21494 0.18153 0.16772 0.12803 0.090032 0.087253 0.078894 0.059881 0.040204 0.028263 0.021156 0.020186 0.018125)
energy2
47.04914 5.64 179 (1.2799)
57.03349 24.42 13 (5.5404)
59.04914 6.76 12 (1.5345)
71.04914 3.76 199 200 (0.59105 0.26205)
73.02841 7.60 170 (1.7239)
135.03014 3.10 23 (0.70282)
144.06552 2.74 151 (0.62167)
150.04104 27.41 26 (6.2188)
153.06988 7.02 99 (1.5919)
182.09643 5.49 64 95 (0.74753 0.49854)
194.09643 14.73 25 113 92 (2.6017 0.54306 0.19649)
198.12773 8.11 89 (1.8388)
207.09167 32.25 22 106 105 (6.1669 0.65023 0.49837)
209.10732 34.65 21 98 94 101 93 103 97 102 104 (6.54 0.36468 0.28313 0.16297 0.15462 0.10003 0.099887 0.077156 0.077107)
219.09167 5.67 43 (1.2868)
226.08223 3.23 120 (0.73364)
316.11929 8.20 55 52 60 (1.1772 0.59366 0.089888)
325.11962 3.44 20 (0.78016)
326.10364 13.67 53 27 29 49 44 (2.0338 0.86817 0.10955 0.066602 0.021864)
341.11454 2.95 18 37 56 (0.28634 0.19664 0.18727)
343.13019 100.00 54 19 28 57 42 63 51 38 66 47 40 59 48 61 70 75 72 74 69 71 73 (10.234 5.0104 2.285 0.63837 0.59985 0.5908 0.58611 0.38875 0.37994 0.3708 0.30683 0.21558 0.2102 0.17149 0.13749 0.13312 0.11023 0.10455 0.080634 0.06624 0.064797)
369.14584 10.82 162 (2.4535)
389.17205 3.32 174 (0.75386)
391.18770 3.32 175 (0.75386)
399.15640 5.46 183 160 (1.0619 0.17733)
403.18770 2.80 157 (0.63629)
413.13566 6.21 180 (1.4092)

0 459.1775296361 Nc1ccc2c(ccc3ccccc32)c1[NH2+]c1nc2c(ncn2C2CC(O)C(CO)O2)c(=O)[nH]1
1 441.1669649521 N=C1C=CC2=C(CCC3=C2CCCC3)C1=[NH+]C1=NC=C2N=CN(C3C=C(O)C(=C=O)O3)C2=N1
2 327.1352709001 N=C1C=CC2=C(C=CC3=C2C=CC=C3)C1[NH+]=C1N=C2N=CN=C2CN1
3 119.0702706321 OC1CCOC1C[OH2+]
4 101.0597059481 C=C1OCCC1[OH2+]
5 119.0702706321 O=CCC(O)CC[OH2+] Intermediate Fragment 
6 117.0546205681 OC=CC(O)CC=[OH+]
7 89.0597059481 [OH2+]C1CCOC1
8 99.0440558841 C=C1OCC=C1[OH2+]
9 99.0440558841 [OH+]=C=C1CCCO1
10 117.0546205681 CCC(O)C(=O)C=[OH+] Intermediate Fragment 
11 99.0440558841 CC=C(O)C#C[OH2+]
12 59.0491412641 CC=C[OH2+]
13 57.0334912001 CC#C[OH2+]
14 61.0284058201 OCC=[OH+]
15 117.0546205681 OCCCOC#C[OH2+] Intermediate Fragment 
16 117.0546205681 CCOC(=C=[OH+])CO Intermediate Fragment 
17 115.0389705041 OC1CCOC1=C=[OH+]
18 341.1145354561 N=C1C=CC2=C(C=CC3=C2C=CC=C3)C1=[NH+]C1=NC(O)=C2N=CNC2=N1
19 343.1301855201 N=C1C=CC2=C(C=CC3=C2CCC=C3)C1=[NH+]C1=NC(O)=C2N=CNC2=N1
20 325.1196208361 N=C1C=CC2=C(C=CC3=C2C=CC=C3)C1=[NH+]C1=NC=C2N=CNC2=N1
21 209.1073248361 N=C1C=CC2=C(C=CC3=C2CCC=C3)C1=[NH2+]
22 207.0916747721 N=C1C=CC2=C(C=CC3=C2C=CC=C3)C1=[NH2+]
23 135.0301371361 [OH+]=C1N=CN=C2N=CN=C12
24 137.0457872001 [OH+]=C1N=CN=C2NCN=C12
25 194.0964258041 [NH3+]C1=CC=C2C(=C1)C=CC1=C2C=CC=C1
26 150.0410361681 [NH3+]C1=NC(=O)C2=NC=NC2=N1
27 326.1036364241 O=C1N=C([NH+]=C2CC=CC3=C2C=CC2=C3C=CC=C2)N=C2N=CN=C12
28 343.1301855201 N=C(N=C1NC=NC1=C=O)[NH+]=C1C(=N)C=CC2=C1C=CC1=C2CCC=C1 Intermediate Fragment 
29 326.1036364241 NC1=CC=C2C3=C(C=CC=C3)C=CC2=C1N=C=NC1=C(C#[O+])N=CN1
30 110.0348881681 [NH2+]=C1N=CN=C1C=O
31 232.0869237401 N=C1C=CC2=C(C=CC3=C2C=CC=C3)C1=NC#[NH+]
32 234.1025738041 N=C1C=CC2=C(C=CC3=C2CCC=C3)C1=NC#[NH+]
33 236.1182238681 N=C1C=CC2=C(C=CC3=C2CCCC3)C1=NC#[NH+]
34 249.1134728361 N=C1C=CC2=C(C=CC3=C2C=CC=C3)C1=NC(N)=[NH2+]
35 313.1196208361 N=C1C=CC2=C(C=CC3=C2C=CC=C3)C1=NC(=[NH2+])N=C1C=NC=N1
36 315.1352709001 N=C1C=CC2=C(C=CC3=C2CCC=C3)C1=NC(=[NH2+])N=C1C=NC=N1
37 341.1145354561 N=C1C=CC2=C(C=CC3=C2C=CC=C3)C1=NC(=[NH2+])N=C1NC=NC1=C=O
38 343.1301855201 N=C1C=CC2=C(C=CC3=C2CCC=C3)C1=[NH+]C(N=C1C=NC=N1)=NC=O Intermediate Fragment 
39 298.1087218041 N=C1C=CC2=C(C=CC3=C2C=CC=C3)C1=[N+]=C=NC1=CN=CN1
40 343.1301855201 N=C1C=CC2=C(C=CC3=C2C=CC=C3)C1=[NH+]C(N)=NC(=O)C1=CNC=N1 Intermediate Fragment 
41 95.0239891361 [O+]#CC1=CNC=N1
42 343.1301855201 N=C1NC=NC1=C(O)N=C=[NH+]C1=C2C=CC3=C(C=CC=C3)C2=CC=C1N Intermediate Fragment 
43 219.0916747721 C#[N+]C1=C2C=CC3=C(C=CC=C3)C2=CC=C1N
44 326.1036364241 N=C1C=CC2=C(C=CC3=C2C=CC=C3)C1=[N+]=C=NC(=O)C1=CNC=N1
45 262.0974884241 NC1=CC=C2C3=C(C=CC=C3)C=CC2=C1N=C=[NH+]C=O
46 260.0818383601 NC1=CC=C2C3=C(C=CC=C3)C=CC2=C1N=C=NC#[O+]
47 343.1301855201 NC(=O)C1=C(N=C=[NH+]C2=C3C=CC4=C(C=CC=C4)C3=CC=C2N)NC=N1 Intermediate Fragment 
48 343.1301855201 N=C=NC1=NC([NH+]=C2C(=N)C=CC3=C2C=CC2=C3CCC=C2)=NC(O)=C1 Intermediate Fragment 
49 326.1036364241 C#[N+]C1=NC(N=C2C(=N)C=CC3=C2C=CC2=C3C=CC=C2)=NC(O)=C1
50 301.1083874561 N=C1C=CC2=C(C=CC3=C2C=CC=C3)C1=[NH+]C1=NC(O)=CC=N1
51 343.1301855201 N=C=NC1=C(O)N=C([NH+]=C2C(=N)C=CC3=C2C=CC2=C3CCC=C2)N=C1 Intermediate Fragment 
52 316.1192864881 N=C1C=CC2=C(C=CC3=C2CCC=C3)C1=NC1=NC(=O)C(=[NH2+])C=N1
53 326.1036364241 C#[N+]C1=C(O)N=C(N=C2C(=N)C=CC3=C2C=CC2=C3C=CC=C2)N=C1
54 343.1301855201 C=NC1=C(O)N=C([NH+]=C2C(=N)C=CC3=C2C=CC2=C3C=CC=C2)N=C1N Intermediate Fragment 
55 316.1192864881 N=C1C=CC2=C(C=CC3=C2C=CC=C3)C1=NC1=NC(O)=CC([NH3+])=N1
56 341.1145354561 C#[N+]C1=C(O)N=C(N=C2C(=N)C=CC3=C2C=CC2=C3C=CC=C2)N=C1N
57 343.1301855201 C=NC1=NC([NH+]=C2C(=N)C=CC3=C2C=CC2=C3C=CC=C2)=NC(O)=C1N Intermediate Fragment 
58 314.1036364241 N=C1C=CC2=C(C=CC3=C2C=CC=C3)C1=NC1=NC(=O)C(=[NH2+])C=N1
59 343.1301855201 C=CC1=C(C(C#N)=[NH+]C2=NC(O)=C3N=CNC3=N2)C=CC2=C1CCC=C2 Intermediate Fragment 
60 316.1192864881 C=C=C1C(=C=[NH+]C2=NC(O)=C3N=CNC3=N2)C=CC2=C1CCC=C2
61 343.1301855201 N=C=C=C=C1C(=C=[NH+]C2=NC(O)=C3N=CNC3=N2)C=CC2=C1CCCC2 Intermediate Fragment 
62 314.1036364241 C=C=C1C(=C=[NH+]C2=NC(O)=C3N=CNC3=N2)C=CC2=C1C=CC=C2
63 343.1301855201 NC(=C=CC1=CC=CC2=C1C=CC=C2)C=[NH+]C1=NC(O)=C2N=CNC2=N1 Intermediate Fragment 
64 182.0964258041 [NH2+]=CC#CC1=CC=CC2=C1CCC=C2
65 184.1120758681 [NH2+]=CC#CC1=CC=CC2=C1CCCC2
66 343.1301855201 CC1=C(C2=C(C)C(=[NH+]C3=NC(=O)C4=NC=NC4=N3)C(=N)C=C2)C=CC=C1 Intermediate Fragment 
67 91.0542266441 [CH2+]C1=CC=CC=C1
68 251.0675852641 [CH2+]C1=CC=CC(=N)C1=NC1=NC(=O)C2=NC=NC2=N1
69 343.1301855201 C=CC1=C(C2=CC(=[NH+]C3=NC(O)=C4N=CNC4=N3)C(=N)C=C2)C=CC=C1 Intermediate Fragment 
70 343.1301855201 N=C1C=CC=C(C=CC2=CC=CC=C2)C1=[NH+]C1=NC(O)=C2N=CNC2=N1 Intermediate Fragment 
71 343.1301855201 C=CC1=C(C2=CC=CC=C2)C=CC(=N)C1=[NH+]C1=NC(O)=C2N=CNC2=N1 Intermediate Fragment 
72 343.1301855201 C=C=CC1=C(C)C=CC2=C1C=CC(=N)C2=[NH+]C1=NC(O)=C2N=CNC2=N1 Intermediate Fragment 
73 343.1301855201 C=C=CC1=C(C)C2=C(C=C1)C(=[NH+]C1=NC(O)=C3N=CNC3=N1)C(=N)C=C2 Intermediate Fragment 
74 343.1301855201 CC=C=CC1=CC2=C(C=C1)C(=[NH+]C1=NC(O)=C3N=CNC3=N1)C(=N)C=C2 Intermediate Fragment 
75 343.1301855201 C=C=CCC1=CC=CC2=C1C=CC(=N)C2=[NH+]C1=NC(O)=C2N=CNC2=N1 Intermediate Fragment 
76 345.1458355841 N=C1C=CC2=C(C=CC3=C2CCCC3)C1=[NH+]C1=NC(O)=C2N=CNC2=N1
77 347.1614856481 N=C1C=CC2=C(CCC3=C2CCCC3)C1=[NH+]C1=NC(O)=C2N=CNC2=N1
78 349.1771357121 N=C1C=CC2=C(CCC3CCCCC23)C1=[NH+]C1=NC(O)=C2N=CNC2=N1
79 427.1513148881 N=C1C=CC2=C(C=CC3=C2CCC=C3)C1=[NH+]C1=NC(O)=C2N=CN(C3CC(O)=CO3)C2=N1
80 429.1669649521 N=C1C=CC2=C(C=CC3=C2CCCC3)C1=[NH+]C1=NC(O)=C2N=CN(C3CC(O)=CO3)C2=N1
81 431.1826150161 N=C1C=CC2=C(CCC3=C2CCCC3)C1=[NH+]C1=NC(O)=C2N=CN(C3CC(O)=CO3)C2=N1
82 441.1669649521 C=C1OC(N2C=NC3=C(O)N=C([NH+]=C4C(=N)C=CC5=C4C=CC4=C5CCCC4)N=C32)C=C1O
83 423.1564002681 C=C1C=CC(N2C=NC3=C(O)N=C([NH+]=C4C(=N)C=CC5=C4C=CC4=C5CCC=C4)N=C32)O1
84 211.1229749001 N=C1C=CC2=C(C=CC3=C2CCCC3)C1=[NH2+]
85 441.1669649521 CC(=O)C(O)=CCN1C=NC2=C(O)N=C([NH+]=C3C(=N)C=CC4=C3C=CC3=C4CCC=C3)N=C21 Intermediate Fragment 
86 441.1669649521 C=C(C=O)OC(C)N1C=NC2=C(O)N=C([NH+]=C3C(=N)C=CC4=C3C=CC3=C4CCC=C3)N=C21 Intermediate Fragment 
87 441.1669649521 C#COC(C=C=O)N1C=NC2=C(O)N=C([NH+]=C3C(=N)C=CC4=C3CCC3=C4CCCC3)N=C21 Intermediate Fragment 
88 215.1542750281 N=C1C=CC2=C(CCC3CCCCC23)C1=[NH2+]
89 198.1277259321 [NH3+]C1=CC=C2C(=C1)C=CC1=C2CCCC1
90 213.1386249641 N=C1C=CC2=C(CCC3=C2CCCC3)C1=[NH2+]
91 196.1120758681 [NH3+]C1=CC=C2C(=C1)C=CC1=C2CCC=C1
92 194.0964258041 [NH2+]=C1CC=CC2=C1C=CC1=C2C=CC=C1
93 209.1073248361 N=C=C=CC1=C(C#[NH+])C=CC2=C1CCCC2 Intermediate Fragment 
94 209.1073248361 C=CC1=C(C(=[NH2+])C#N)C=CC2=C1CCC=C2 Intermediate Fragment 
95 182.0964258041 C#CC1=C(C#[NH+])C=CC2=C1CCCC2
96 180.0807757401 C#CC1=C(C#[NH+])C=CC2=C1CCC=C2
97 209.1073248361 C=C=C(N)C(=[NH2+])C1=CC2=C(C=CC=C2)C=C1 Intermediate Fragment 
98 209.1073248361 [NH+]#CC(N)=C=CC1=CC=CC2=C1CCC=C2 Intermediate Fragment 
99 153.0698767081 C#[CH+]C1=CC=CC2=C1C=CC=C2
100 155.0855267721 C#[CH+]C1=CC=CC2=C1CCC=C2
101 209.1073248361 C=C1C=CC=CC1=C1C=CC(=N)C(=[NH2+])C1=C Intermediate Fragment 
102 209.1073248361 C=CC1=C(C2=CC(=[NH2+])C(=N)C=C2)C=CC=C1 Intermediate Fragment 
103 209.1073248361 N=C1C=CC=C(C=CC2=CC=CC=C2)C1=[NH2+] Intermediate Fragment 
104 209.1073248361 C=C=CCC1=CC=CC2=C1C=CC(=N)C2=[NH2+] Intermediate Fragment 
105 207.0916747721 C=CC1=C(C(=[NH2+])C#N)C=CC2=C1C=CC=C2 Intermediate Fragment 
106 207.0916747721 [NH+]#CC(N)=C=CC1=CC=CC2=C1C=CC=C2 Intermediate Fragment 
107 249.0618311881 O=C=C1OC(N2C=NC3=C([OH2+])N=CN=C32)CC1O
108 251.0774812521 OC=C1OC(N2C=NC3=C([OH2+])N=CN=C32)CC1O
109 253.0931313161 OCC1OC(N2C=NC3=C([OH2+])N=CN=C32)CC1O
110 253.0931313161 O=C(CC(O)CCO)N1C=NC2=C([OH2+])N=CN=C21 Intermediate Fragment 
111 200.1433759961 [NH3+]C1=CC=C2C(=C1)CCC1=C2CCCC1
112 183.1168269001 C1=C[CH2+]=C2C=CC3=C(CCCC3)C2=C1
113 194.0964258041 C=C1C=CC2=C(CCC=C2)C1=C=C=C=[NH2+] Intermediate Fragment 
114 260.0414300921 [NH3+]C1=NC(O)=C2N=CN(C3=CC(=O)C(=C=O)O3)C2=N1
115 264.0727302201 [NH3+]C1=NC(O)=C2N=CN(C3CC(O)C(=C=O)O3)C2=N1
116 266.0883802841 [NH3+]C1=NC(O)=C2N=CN(C3CC(O)C(=CO)O3)C2=N1
117 442.1509805401 O=C=C1OC(N2C=NC3=C(O)N=C([NH+]=C4CC=CC5=C4C=CC4=C5CCCC4)N=C32)C=C1O
118 328.1192864881 O=C1N=C([NH+]=C2CC=CC3=C2C=CC2=C3CCC=C2)N=C2N=CN=C12
119 459.1775296361 N=C(N=C1C(=C=O)N=CN1C1C=C(O)C(=C=O)O1)[NH+]=C1C(=N)C=CC2=C1CCC1CCCCC21 Intermediate Fragment 
120 226.0822322841 [NH2+]=C1C(=C=O)N=CN1C1CC(O)C(CO)O1
121 431.1826150161 N=C1C=CC2=C(CCC3=C2CCCC3)C1=NC(=[NH2+])N=C1C=NCN1C1C=C(O)C(=C=O)O1
122 431.1826150161 N=C1C=CC2=C(CCC3=C2CCCC3)C1=NC(=[NH2+])N=C1C=NCN1C(=O)C=C(O)C#CO Intermediate Fragment 
123 459.1775296361 N=C1C=CC2=C(CCC3=C2CCCC3)C1=[NH+]C(=NC=O)N=C1C=NCN1C1C=C(O)C(=C=O)O1 Intermediate Fragment 
124 416.1717159841 NC1=CC=C2C3=C(CCCC3)CCC2=C1N=C=[NH+]C1=CN=CN1C1C=C(O)C(=C=O)O1
125 300.1243718681 NC1=CC=C2C3=C(C=CC=C3)C=CC2=C1N=C=[NH+]C1C=NC=N1
126 416.1717159841 NC1=CC=C2C3=C(CCCC3)CCC2=C1N=C=[NH+]C1=CN=CN1C(=O)C=C(O)C#CO Intermediate Fragment 
127 414.1560659201 NC1=CC=C2C(=C1N=C=[NH+]C1=CN=CN1C1C=C(O)C(=C=O)O1)C=CC1=C2CCCC1
128 412.1404158561 NC1=CC=C2C(=C1N=C=[NH+]C1=CN=CN1C1C=C(O)C(=C=O)O1)C=CC1=C2CCC=C1
129 198.0873176641 [NH2+]=C1C=NCN1C1CC(O)C(=CO)O1
130 183.0764186321 OC1CC(N2C=CN=C2)OC1=C[OH2+]
131 181.0607685681 OC1CC(N2C=CN=C2)OC1=C=[OH+]
132 181.0607685681 O=C(C=[OH+])C(O)=CCN1C=CN=C1 Intermediate Fragment 
133 179.0451185041 O=C1CC(N2C=CN=C2)OC1=C=[OH+]
134 429.1669649521 N=C1C=CC2=C(C=CC3=C2CCCC3)C1=NC(=[NH2+])N=C1C=NCN1C1C=C(O)C(=C=O)O1
135 459.1775296361 N=C1C=CC2=C(CCC3=C2CCCC3)C1=[NH+]C(N)=NC(=O)C1=CN(C2C=C(O)C(=C=O)O2)C=N1 Intermediate Fragment 
136 459.1775296361 N=C1C(=C(O)N=C=[NH+]C2=C3CCC4=C(CCCC4)C3=CC=C2N)N=CN1C1C=C(O)C(=C=O)O1 Intermediate Fragment 
137 221.1073248361 C=[NH+]C1=C2C=CC3=C(C=CC=C3)C2=CC=C1N
138 224.0665822201 [NH2+]=C1C(=C=O)N=CN1C1CC(O)C(=CO)O1
139 459.1775296361 NC(=O)C1=C(N=C=[NH+]C2=C3CCC4=C(CCCC4)C3=CC=C2N)N(C2C=C(O)C(=C=O)O2)C=N1 Intermediate Fragment 
140 459.1775296361 N=CN(C1=NC([NH+]=C2C(=N)C=CC3=C2CCC2=C3CCCC2)=NC(O)=C1)C1C=C(O)C(=C=O)O1 Intermediate Fragment 
141 442.1509805401 C[NH+](C1=NC(N=C2C(=N)C=CC3=C2C=CC2=C3CCC=C2)=NC(O)=C1)C1C=C(O)C(=C=O)O1
142 432.1666306041 N=C1C=CC2=C(CCC3CCCCC23)C1=NC1=NC(O)=CC([NH+]=C2C=C(O)C(=C=O)O2)=N1
143 432.1666306041 N=C1C=CC2=C(CCC3=C2CCCC3)C1=NC1=NC(O)=CC([NH+]=C(O)C=C(O)C#CO)=N1 Intermediate Fragment 
144 303.1240375201 N=C1C=CC2=C(C=CC3=C2CCC=C3)C1=[NH+]C1=NC(O)=CC=N1
145 159.0764186321 [NH+]#CNC1CC(O)C(CO)O1
146 142.0498695361 C=[NH+]C1CC(O)C(=C=O)O1
147 159.0764186321 [NH+]#CN=C(O)CC(O)CCO Intermediate Fragment 
148 159.0764186321 CC(=NC#[NH+])OC(CO)CO Intermediate Fragment 
149 159.0764186321 CC(O)C(CO)OC=NC#[NH+] Intermediate Fragment 
150 459.1775296361 N=C1C=CC2=C(CCC3CCCCC23)C1=[NH+]C1=NC(O)=C(N=C=NC2C=C(O)C(=C=O)O2)C=N1 Intermediate Fragment 
151 144.0655196001 C=[NH+]C1CC(O)C(=CO)O1
152 459.1775296361 C=NC1=C(O)N=C([NH+]=C2C(=N)C=CC3=C2CCC2CCCCC32)N=C1N=C1C=C(O)C(=C=O)O1 Intermediate Fragment 
153 328.1192864881 C=[NH+]C1=C(O)N=C(N=C2C(=N)C=CC3=C2C=CC2=C3C=CC=C2)N=C1
154 459.1775296361 N=C1C=CC2=C(CCC3=C2CCCC3)C1=[NH+]C1=NC(O)=C2N=CN(CC=C(O)C(=O)C=O)C2=N1 Intermediate Fragment 
155 441.1669649521 N=C1C=CC2=C(C=CC3=C2CCCC3)C1=[NH+]C1=NC(O)=C2N=CN(CC=C(O)C#CO)C2=N1
156 423.1564002681 C#CC(O)=CCN1C=NC2=C(O)N=C([NH+]=C3C(=N)C=CC4=C3C=CC3=C4CCC=C3)N=C21
157 403.1877003961 N=C1C=CC2=C(CCC3CCCCC23)C1=[NH+]C1=NC(O)=C2N=CN(CC#CO)C2=N1
158 401.1720503321 N=C1C=CC2=C(CCC3=C2CCCC3)C1=[NH+]C1=NC(O)=C2N=CN(CC#CO)C2=N1
159 383.1614856481 C#CCN1C=NC2=C(O)N=C([NH+]=C3C(=N)C=CC4=C3C=CC3=C4CCCC3)N=C21
160 399.1564002681 N=C1C=CC2=C(C=CC3=C2CCCC3)C1=[NH+]C1=NC(O)=C2N=CN(CC#CO)C2=N1
161 397.1407502041 N=C1C=CC2=C(C=CC3=C2CCC=C3)C1=[NH+]C1=NC(O)=C2N=CN(CC#CO)C2=N1
162 369.1458355841 CCN1C=NC2=C(O)N=C([NH+]=C3C(=N)C=CC4=C3C=CC3=C4C=CC=C3)N=C21
163 375.1927857761 CCN1C=NC2=C(O)N=C([NH+]=C3C(=N)C=CC4=C3CCC3=C4CCCC3)N=C21
164 373.1771357121 CCN1C=NC2=C(O)N=C([NH+]=C3C(=N)C=CC4=C3C=CC3=C4CCCC3)N=C21
165 371.1614856481 CCN1C=NC2=C(O)N=C([NH+]=C3C(=N)C=CC4=C3C=CC3=C4CCC=C3)N=C21
166 367.1301855201 C=CN1C=NC2=C(O)N=C([NH+]=C3C(=N)C=CC4=C3C=CC3=C4C=CC=C3)N=C21
167 459.1775296361 C=C(O)C(=C=O)OCN1C=NC2=C(O)N=C([NH+]=C3C(=N)C=CC4=C3CCC3=C4CCCC3)N=C21 Intermediate Fragment 
168 459.1775296361 CC(OC(=C=O)C=O)N1C=NC2=C(O)N=C([NH+]=C3C(=N)C=CC4=C3CCC3=C4CCCC3)N=C21 Intermediate Fragment 
169 75.0440558841 OCC=C[OH2+]
170 73.0284058201 OCC#C[OH2+]
171 383.1251001401 CC(=O)N1C=NC2=C(O)N=C([NH+]=C3C(=N)C=CC4=C3C=CC3=C4C=CC=C3)N=C21
172 385.1407502041 CC(=O)N1C=NC2=C(O)N=C([NH+]=C3C(=N)C=CC4=C3C=CC3=C4CCC=C3)N=C21
173 387.1564002681 CC(=O)N1C=NC2=C(O)N=C([NH+]=C3C(=N)C=CC4=C3C=CC3=C4CCCC3)N=C21
174 389.1720503321 CC(=O)N1C=NC2=C(O)N=C([NH+]=C3C(=N)C=CC4=C3CCC3=C4CCCC3)N=C21
175 391.1877003961 CC(=O)N1C=NC2=C(O)N=C([NH+]=C3C(=N)C=CC4=C3CCC3CCCCC43)N=C21
176 429.1669649521 CC(OC#CO)N1C=NC2=C(O)N=C([NH+]=C3C(=N)C=CC4=C3C=CC3=C4CCCC3)N=C21
177 431.1826150161 CC(OC#CO)N1C=NC2=C(O)N=C([NH+]=C3C(=N)C=CC4=C3CCC3=C4CCCC3)N=C21
178 459.1775296361 N=C1C=CC2=C(CCC3CCCCC23)C1=[NH+]C1=NC(O)=C2N=CN(C(C=C=O)OC#CO)C2=N1 Intermediate Fragment 
179 47.0491412641 CC[OH2+]
180 413.1356648241 N=C1C=CC2=C(C=CC3=C2CCCC3)C1=[NH+]C1=NC(O)=C2N=CN(C(=O)C#CO)C2=N1
181 415.1513148881 N=C1C=CC2=C(CCC3=C2CCCC3)C1=[NH+]C1=NC(O)=C2N=CN(C(=O)C#CO)C2=N1
182 417.1669649521 N=C1C=CC2=C(CCC3CCCCC23)C1=[NH+]C1=NC(O)=C2N=CN(C(=O)C#CO)C2=N1
183 399.1564002681 C#CC(=O)N1C=NC2=C(O)N=C([NH+]=C3C(=N)C=CC4=C3CCC3=C4CCCC3)N=C21
184 417.1669649521 N=C1C=CC2=C(CCC3=C2CCCC3)C1=[NH+]C1=NC(O)=C2N=CN(COC#CO)C2=N1
185 415.1513148881 N=C1C=CC2=C(C=CC3=C2CCCC3)C1=[NH+]C1=NC(O)=C2N=CN(COC#CO)C2=N1
186 459.1775296361 N=C1C=CC2=C(CCC3CCCCC23)C1=[NH+]C1=NC(O)=C2N=CN(C(=O)C=C(O)C#CO)C2=N1 Intermediate Fragment 
187 45.0334912001 C=C[OH2+]
188 68.9971056921 [O+]#CC#CO
189 71.0127557561 O=CC#C[OH2+]
190 43.0178411361 C#C[OH2+]
191 77.0597059481 OCCC[OH2+]
192 375.1564002681 N=C1C=CC2=C(CCC3=C2CCCC3)C1=[NH+]C1=NC(O)=C2N=CN(C=O)C2=N1
193 373.1407502041 N=C1C=CC2=C(C=CC3=C2CCCC3)C1=[NH+]C1=NC(O)=C2N=CN(C=O)C2=N1
194 355.1301855201 CN1C=NC2=C(O)N=C([NH+]=C3C(=N)C=CC4=C3C=CC3=C4C=CC=C3)N=C21
195 371.1251001401 N=C1C=CC2=C(C=CC3=C2CCC=C3)C1=[NH+]C1=NC(O)=C2N=CN(C=O)C2=N1
196 369.1094500761 N=C1C=CC2=C(C=CC3=C2C=CC=C3)C1=[NH+]C1=NC(O)=C2N=CN(C=O)C2=N1
197 87.0440558841 CC(O)C#C[OH2+]
198 89.0597059481 CC(O)C=C[OH2+]
199 71.0491412641 C#CC(C)[OH2+]
200 71.0491412641 CCC#C[OH2+]
201 91.0753560121 CC(O)CC[OH2+]
202 73.0647913281 C=CC(C)[OH2+]
203 73.0647913281 CCC=C[OH2+]
204 459.1775296361 C=CC1=C(C(C#N)=[NH+]C2=NC(O)=C3N=CN(C4C=C(O)C(=C=O)O4)C3=N2)CCC2CCCCC12 Intermediate Fragment 
205 432.1666306041 C=C=C1C(=C=[NH+]C2=NC(O)=C3N=CN(C4C=C(O)C(=C=O)O4)C3=N2)CCC2CCCCC12
206 459.1775296361 NC=C=C=C1C(=C=[NH+]C2=NC(O)=C3N=CN(C4C=C(O)C(=C=O)O4)C3=N2)CCC2CCCCC12 Intermediate Fragment 
207 186.1277259321 [NH2+]=CC#CC1=CCCC2=C1CCCC2
208 416.1353304761 C=C1C(=C=[NH+]C2=NC(O)=C3N=CN(C4C=C(O)C(=C=O)O4)C3=N2)C=CC2=C1CCCC2
209 302.1036364241 C=C1C(=C=[NH+]C2=NC(=O)C3=NC=NC3=N2)C=CC2=C1CCC=C2
210 418.1509805401 C=C1C(=C=[NH+]C2=NC(O)=C3N=CN(C4C=C(O)C(=C=O)O4)C3=N2)CCC2=C1CCCC2
211 428.1353304761 C=C=C1C(=C=[NH+]C2=NC(O)=C3N=CN(C4C=C(O)C(=C=O)O4)C3=N2)C=CC2=C1CCCC2
212 430.1509805401 C=C=C1C(=C=[NH+]C2=NC(O)=C3N=CN(C4C=C(O)C(=C=O)O4)C3=N2)CCC2=C1CCCC2
213 459.1775296361 NC(=C=CC1=CCCC2=C1CCCC2)C=[NH+]C1=NC(O)=C2N=CN(C3C=C(O)C(=C=O)O3)C2=N1 Intermediate Fragment 
214 459.1775296361 C=C=C(N)C(=[NH+]C1=NC(O)=C2N=CN(C3C=C(O)C(=C=O)O3)C2=N1)C1=CC2=C(CCCC2)CC1 Intermediate Fragment 
215 459.1775296361 CC1=C(C2=C(C)C(=[NH+]C3=NC(O)=C4N=CN(C5C=C(O)C(=C=O)O5)C4=N3)C(=N)C=C2)CCCC1 Intermediate Fragment 
216 459.1775296361 CCC1=C(C2=CC(=[NH+]C3=NC(O)=C4N=CN(C5C=C(O)C(=C=O)O5)C4=N3)C(=N)C=C2)CCCC1 Intermediate Fragment 
217 431.1462295081 N=C1C=CC(C2=CCCCC2)=CC1=[NH+]C1=NC(O)=C2N=CN(C3C=C(O)C(=C=O)O3)C2=N1
218 433.1618795721 N=C1C=CC(C2CCCCC2)=CC1=[NH+]C1=NC(O)=C2N=CN(C3C=C(O)C(=C=O)O3)C2=N1
219 317.1145354561 N=C1C=CC(C2=CC=CCC2)=CC1=[NH+]C1=NC(=O)C2=NC=NC2=N1
220 459.1775296361 N=C1C=CC=C(CCC2=CCCCC2)C1=[NH+]C1=NC(O)=C2N=CN(C3C=C(O)C(=C=O)O3)C2=N1 Intermediate Fragment 
221 357.1305794441 NC1CCCCC1=[NH+]C1=NC(O)=C2N=CN(C3C=C(O)C(=C=O)O3)C2=N1
222 241.0832353281 NC1C=CC=CC1=[NH+]C1=NC(=O)C2=NC=NC2=N1
223 459.1775296361 CCC1=C(C2=CCCCC2)C=CC(=N)C1=[NH+]C1=NC(O)=C2N=CN(C3C=C(O)C(=C=O)O3)C2=N1 Intermediate Fragment 
224 459.1775296361 CCCC1=C(C)CCC2=C1C=CC(=N)C2=[NH+]C1=NC(O)=C2N=CN(C3C=C(O)C(=C=O)O3)C2=N1 Intermediate Fragment 
225 429.1305794441 CC1=C(C)C2=C(C=C1)C(=[NH+]C1=NC(O)=C3N=CN(C4C=C(O)C(=C=O)O4)C3=N1)C(=N)C=C2
226 459.1775296361 CCC1=C(CC)C2=C(CC1)C(=[NH+]C1=NC(O)=C3N=CN(C4C=C(O)C(=C=O)O4)C3=N1)C(=N)C=C2 Intermediate Fragment 
227 431.1462295081 CCC1=CCCC2=C1C=CC(=N)C2=[NH+]C1=NC(O)=C2N=CN(C3C=C(O)C(=C=O)O3)C2=N1
228 433.1618795721 CCC1CCCC2=C1C=CC(=N)C2=[NH+]C1=NC(O)=C2N=CN(C3C=C(O)C(=C=O)O3)C2=N1
229 317.1145354561 C=CC1=CC=CC2=C1C=CC(=N)C2=[NH+]C1=NC(O)=C2N=CNC2=N1
230 433.1618795721 CCC1CCCC2=C1C=CC(=N)C2=[NH+]C1=NC(O)=C2N=CN(C(=O)C=C(O)C#CO)C2=N1 Intermediate Fragment 
231 459.1775296361 CCCC1=C(C)C2=C(CC1)C(=[NH+]C1=NC(O)=C3N=CN(C4C=C(O)C(=C=O)O4)C3=N1)C(=N)C=C2 Intermediate Fragment 
232 459.1775296361 CCCCC1=CC2=C(CC1)C(=[NH+]C1=NC(O)=C3N=CN(C4C=C(O)C(=C=O)O4)C3=N1)C(=N)C=C2 Intermediate Fragment 
233 403.1149293801 N=C1C=CC2=C(CCC=C2)C1=[NH+]C1=NC(O)=C2N=CN(C3C=C(O)C(=C=O)O3)C2=N1
234 291.0988853921 N=C1C=CC2=C(CCC=C2)C1=[NH+]C1=NC(=O)C2=NC=NC2=N1
235 405.1305794441 N=C1C=CC2=C(CCCC2)C1=[NH+]C1=NC(O)=C2N=CN(C3C=C(O)C(=C=O)O3)C2=N1
236 415.1149293801 CC1=CC2=C(C=C1)C(=[NH+]C1=NC(O)=C3N=CN(C4C=C(O)C(=C=O)O4)C3=N1)C(=N)C=C2
237 431.1462295081 CCC1=CC2=C(CC1)C(=[NH+]C1=NC(O)=C3N=CN(C4C=C(O)C(=C=O)O4)C3=N1)C(=N)C=C2
238 459.1775296361 CCCCC1=CCCC2=C1C=CC(=N)C2=[NH+]C1=NC(O)=C2N=CN(C3C=C(O)C(=C=O)O3)C2=N1 Intermediate Fragment 
