#In-silico ESI-MS/MS [M+H]+ Spectra
#PREDICTED BY CFM-ID 4.0.8
#SMILES=[nH]1c(nc2c(c1=O)nc(n2[C@@H]1O[C@H](CO)[C@@H](C1)O)Nc1nc2c(n1C)c(cc1c2nc(cn1)C)C)N
#InChiKey=JSHKVOHSKOQDRU-JHJVBQTASA-N
energy0
377.15813 32.06 10 76 64 28 38 80 62 55 43 61 21 79 39 73 71 74 47 44 52 49 63 (22.002 0.1195 0.044343 0.038382 0.029497 0.021064 0.021059 0.018924 0.016086 0.012732 0.0094039 0.0075335 0.0068439 0.0064035 0.0058255 0.0046273 0.0019015 0.00076234 0.00037799 0.0003371 7.047e-05)
493.20548 100.00 0 194 162 191 241 131 235 280 277 239 136 287 153 154 286 225 181 178 275 223 274 159 161 240 156 (68.262 0.9853 0.21079 0.093346 0.047654 0.028984 0.016925 0.013762 0.012771 0.010923 0.010092 0.0095719 0.0091866 0.0086351 0.008473 0.0080506 0.0073868 0.0056571 0.0032713 0.00176 0.0016762 0.0012527 0.00041771 8.5427e-05 4.923e-05)
energy1
360.13158 5.79 20 22 81 78 50 53 (2.5225 0.48859 0.17656 0.1351 0.013199 0.0016649)
361.12683 14.12 19 17 18 (4.5598 1.9394 1.6411)
375.14248 2.90 9 37 70 60 51 46 54 (1.6349 0.026728 0.0065005 0.0011371 0.00095371 0.00019241 8.2237e-05)
377.15813 100.00 10 28 74 21 64 38 61 76 62 80 39 55 73 43 79 49 44 71 63 47 52 (53.539 0.75391 0.6879 0.44588 0.39523 0.33087 0.32895 0.32252 0.22153 0.15057 0.09847 0.088173 0.072801 0.060672 0.050818 0.029904 0.02756 0.022459 0.014547 0.0033344 0.0030206)
449.17926 3.03 102 (1.7469)
475.19491 5.95 88 163 100 97 1 107 104 94 101 92 103 (2.5111 0.56014 0.083156 0.080913 0.064318 0.042235 0.02907 0.022487 0.019808 0.015953 0.0022286)
493.20548 8.28 0 194 162 136 287 181 153 277 235 241 178 154 191 131 280 225 223 275 239 274 286 159 240 156 161 (3.1911 1.1751 0.16338 0.040802 0.035074 0.034587 0.023746 0.019491 0.017179 0.015367 0.013175 0.012674 0.010581 0.0066808 0.0042123 0.0025334 0.0023711 0.0023256 0.0015886 0.0011322 0.00062643 0.00052157 0.00038207 5.6691e-05 2.4208e-05)
energy2
43.01784 4.88 206 (0.89113)
45.03349 7.72 199 (1.4116)
55.01784 4.75 208 (0.86805)
57.03349 24.88 209 (4.5476)
75.04406 4.65 148 (0.84922)
89.05971 9.75 180 (1.7814)
209.07815 5.38 183 (0.98369)
212.09307 5.66 112 113 (0.63503 0.39943)
226.10872 4.77 115 (0.87126)
322.12583 4.65 237 (0.84944)
360.13158 5.31 20 78 22 81 50 53 (0.89618 0.022753 0.021052 0.01438 0.013203 0.0028583)
361.12683 14.34 19 17 18 (1.2205 0.84526 0.55535)
375.14248 9.06 9 70 46 54 37 51 60 (1.4004 0.12695 0.047594 0.025874 0.024382 0.015714 0.014508)
377.15813 100.00 10 28 64 39 21 55 44 76 49 71 52 61 47 79 38 43 74 73 80 62 63 (9.5162 2.2666 1.6568 0.79202 0.66719 0.55055 0.41278 0.34965 0.27127 0.25139 0.2124 0.2023 0.16917 0.1546 0.14502 0.14444 0.12424 0.11599 0.11002 0.090656 0.075475)
381.18943 3.96 83 (0.7246)
383.20508 7.85 84 (1.4357)
387.15238 5.26 252 (0.96166)
401.15813 11.51 173 (2.1046)
403.17378 49.87 98 (9.116)
405.15305 8.44 214 212 213 (0.65145 0.60347 0.28815)
406.16221 4.76 135 (0.87019)
419.16870 10.25 184 182 (1.2896 0.58473)
423.20000 4.56 187 (0.83277)
425.21565 4.56 188 (0.83277)
433.18435 26.74 168 96 193 167 (1.9407 1.2771 0.90884 0.76152)
449.17926 4.73 102 (0.86515)
466.19458 7.73 279 234 (0.84436 0.56885)
473.17926 4.68 222 (0.85534)
477.17418 6.59 125 124 128 129 126 (0.62182 0.48936 0.040248 0.027653 0.025384)
491.18983 12.41 152 273 158 177 221 (1.3572 0.37797 0.30783 0.15274 0.073235)

0 493.2054757001 Cc1cnc2cc(C)c3c(nc([NH2+]c4nc5c(=O)[nH]c(N)nc5n4C4CC(O)C(CO)O4)n3C)c2n1
1 475.1949110161 CC1=C2C(=NC(=[NH+]C3=NC4=CN=C(N)N=C4N3C3C=C(O)C(=C=O)O3)N2C)C2NC(C)CNC2=C1
2 361.1632169641 CC1=C2C(=NC(=[NH+]C3=NC4=CN=C(N)N=C4N3)N2C)C2=NC(C)C=NC2=C1
3 117.0546205681 OC1CCOC1=C[OH2+]
4 99.0440558841 C=C1OCC=C1[OH2+]
5 117.0546205681 CCC(O)C(=O)C=[OH+] Intermediate Fragment 
6 99.0440558841 CC=C(O)C#C[OH2+]
7 117.0546205681 O=CCC(O)C=C[OH2+] Intermediate Fragment 
8 115.0389705041 OC1CCOC1=C=[OH+]
9 375.1424815201 [CH2+]N1C(=NC2=NC3=C(O)N=C(N)N=C3N2)N=C2C3=NC(C)=CNC3=CC(C)=C21
10 377.1581315841 CC1=CNC2=CC(C)=C3C(=NC(=[NH+]C4=NC5=C(O)N=C(N)N=C5N4)N3C)C2=N1
11 359.1475669001 [CH2+]N1C(=NC2=NC3=CN=C(N)N=C3N2)N=C2C3=NC(C)=CNC3=CC(C)=C21
12 228.1243718681 CC1=C2C(=NC(=[NH2+])N2C)C2=NC(C)C=NC2=C1
13 213.1134728361 C=C1C=NC2=CC(C)C3=C(N=CN3[CH4+])C2=N1
14 211.0978227721 C=C1C=NC2=CC(=C)C3=C(N=CN3[CH4+])C2=N1
15 165.0519352001 NC1=NC(=O)C2=NC([NH3+])=NC2=N1
16 167.0675852641 NC1=NC(=O)C2=NC([NH3+])NC2=N1
17 361.1268314561 CC1=CC2=C(N=C(C)C=N2)C2=NC(=[NH+]C3=NC4=C(O)N=C(N)N=C4N3)N=C12
18 361.1268314561 [CH2+]N1C(=NC2=NC3=C(O)N=C(N)N=C3N2)N=C2C3=NC=CNC3=CC(C)=C21
19 361.1268314561 [CH2+]N1C2=CC=C3NC=C(C)N=C3C2=NC1=NC1=NC2=C(O)N=C(N)N=C2N1
20 360.1315824881 [CH2+]N1C(=NC2=NC3=C(O)N=CN=C3N2)N=C2C3=NC(C)=CNC3=CC(C)=C21
21 377.1581315841 CC1=CNC2=CC(C)=C3C(=NC(=[NH+]C4=NC(=C=O)C(=NC(=N)N)N4)N3C)C2=N1 Intermediate Fragment 
22 360.1315824881 CC1=CNC2=CC(C)=C3C(=NC(=NC4=NC(C#[O+])=C(N=C=N)N4)N3C)C2=N1
23 335.1363335201 CC1=C2C(=NC(=NC3=NC(=C=O)C(=[NH2+])N3)N2C)C2=NC(C)C=NC2=C1
24 333.1206834561 C=C1C=NC2=CC(C)=C3C(=NC(=NC4=NC(=C=O)C(=[NH2+])N4)N3C)C2=N1
25 318.1097844241 C=C1C=NC2=CC(C)=C3C(=NC(=[NH+]C4=NC(=C=O)C=N4)N3C)C2=N1
26 316.0941343601 C=C1C=NC2=CC(C)=C3C(=NC(=NC4=NC(=C=O)C=N4)N3[CH2+])C2=N1
27 349.1632169641 CC1=C2C(=NC(=NC3=NC(=NC(N)=[NH2+])C=N3)N2C)C2=NC(C)C=NC2=C1
28 377.1581315841 CC1=CNC2=CC(C)=C3C(=NC(=[NH+]C4=NC(=NC(N)=NC=O)C=N4)N3C)C2=N1 Intermediate Fragment 
29 334.1523179321 C=C1C=NC2=CC(C)=C3C(=NC(=NC4=NC=C([NH+]=CN)N4)N3C)C2=N1
30 332.1366678681 C=C1C=NC2=CC(C)=C3C(=NC(=NC4=NC=C([NH+]=C=N)N4)N3C)C2=N1
31 330.1210178041 C=C1C=NC2=CC(C)=C3C(=NC(=NC4=NC=C(N=C=N)N4)N3[CH2+])C2=N1
32 307.1414189001 CC1=C2C(=NC(=NC3=NC(=[NH2+])C=N3)N2C)C2=NC(C)C=NC2=C1
33 305.1257688361 C=C1C=NC2=CC(C)=C3C(=NC(=NC4=NC(=[NH2+])C=N4)N3C)C2=N1
34 292.1305198681 C=C1C=NC2=CC(=C)C3=C(N=C([NH+]=C4N=CCN4)N3C)C2=N1
35 290.1148698041 C=C1C=NC2=CC(=C)C3=C(N=C([NH+]=C4N=CC=N4)N3C)C2=N1
36 347.1475669001 C=C1C=NC2=CC(C)=C3C(=NC(=NC4=NC(=NC(N)=[NH2+])C=N4)N3C)C2=N1
37 375.1424815201 CC1=CNC2=CC(C)=C3C(=NC(=NC4=NC(=NC(N)=NC#[O+])C=N4)N3C)C2=N1
38 377.1581315841 [CH2+]N1C(=NC2=NC(C(=O)N=C(N)N)=CN2)N=C2C3=NC(C)=CNC3=CC(C)=C21 Intermediate Fragment 
39 377.1581315841 CC1=CNC2=CC(C)=C3C(=NC(=[NH+]C4=NC(=C(O)N=C=N)C(=N)N4)N3C)C2=N1 Intermediate Fragment 
40 348.1315824881 C=C1C=NC2=CC(C)=C3C(=NC(=NC4=NC(=N)C(C([NH3+])=O)=N4)N3C)C2=N1
41 350.1472325521 CC1=C2C(=NC(=NC3=NC(=N)C(C([NH3+])=O)=N3)N2C)C2=NC(C)C=NC2=C1
42 331.1050333921 C=C1C=NC2=CC(C)=C3C(=NC(=NC4=NC(=C=O)C(=N)N4)N3[CH2+])C2=N1
43 377.1581315841 CC1=CNC2=CC(C)=C3C(=NC(=[NH+]C4=NC(C(N)=O)=C(N=C=N)N4)N3C)C2=N1 Intermediate Fragment 
44 377.1581315841 [CH2+]N1C(=NC(=N)NC2=NC(N)=NC(O)=C2)N=C2C3=NC(C)=CNC3=CC(C)=C21 Intermediate Fragment 
45 266.1148698041 C=C1C=NC2=CC(C)=C3C(=NC(=NC(=N)N)N3[CH2+])C2=N1
46 375.1424815201 C=C1C=NC2=CC(C)=C3C(=NC(=NC(=N)NC4=NC(N)=NC(O)=C4)N3[CH2+])C2=N1
47 377.1581315841 [CH2+]N1C(=NC(N)=NC2=C(O)N=C(N)N=C2)N=C2C3=NC(C)=CNC3=CC(C)=C21 Intermediate Fragment 
48 253.1196208361 CC1=C2C(=NC(=NC#[NH+])N2C)C2=NC(C)C=NC2=C1
49 377.1581315841 CC1=CC2=C(N=C(C)C=N2)C2=C1N(C)C([NH+]=C=NC1=C(O)N=C(N)N=C1N)=N2 Intermediate Fragment 
50 360.1315824881 [CH2+]N1C(N=C=NC2=C(O)N=C(N)N=C2)=NC2=C1C(C)=CC1=C2N=C(C)C=N1
51 375.1424815201 [CH2+]N1C(N=C=NC2=C(O)N=C(N)N=C2N)=NC2=C1C(C)=CC1=C2N=C(C)C=N1
52 377.1581315841 CC1=CC2=C(N=C(C)C=N2)C2=C1N(C)C([NH+]=C=NC1=NC(N)=NC(O)=C1N)=N2 Intermediate Fragment 
53 360.1315824881 [CH2+]N1C(N=C=NC2=NC(N)=NC(O)=C2)=NC2=C1C(C)=CC1=C2N=C(C)C=N1
54 375.1424815201 [CH2+]N1C(N=C=NC2=NC(N)=NC(O)=C2N)=NC2=C1C(C)=CC1=C2N=C(C)C=N1
55 377.1581315841 C=NC1=C(N=C=[NH+]C2=NC3=C(O)N=C(N)N=C3N2)C2=C(C=C1C)NCC(C)=N2 Intermediate Fragment 
56 192.0628342321 NC=[NH+]C1=NC2=NC(N)=NC(=O)C2=N1
57 346.1159324241 [CH2+]C1=NC2=C(C=C(C)C=C2N=C=NC2=NC3=C(O)N=C(N)N=C3N2)N=C1
58 348.1315824881 CC1=CC2=C(N=C(C)C=N2)C(N=C=[NH+]C2=NC3=C(O)N=C(N)N=C3N2)=C1
59 350.1472325521 CC1=CC2=C(N=C(C)CN2)C(N=C=[NH+]C2=NC3=C(O)N=C(N)N=C3N2)=C1
60 375.1424815201 C=NC1=C(N=C=[NH+]C2=NC3=C(O)N=C(N)N=C3N2)C2=C(C=C1C)N=CC(C)=N2
61 377.1581315841 C=NC(N=C1C=C(C)C=C2NC=C(C)N=C21)=[NH+]C1=NC2=C(O)N=C(N)N=C2N1 Intermediate Fragment 
62 377.1581315841 [CH2+]N(C1=CC2=C(C=C1C)N=CC(C)=N2)C(N)=NC1=NC2=C(O)N=C(N)N=C2N1 Intermediate Fragment 
63 377.1581315841 [CH2+]N1C(=NC2=NC3=C(O)N=C(N)N=C3N2)N=C(C2=CN=CC(C)=N2)C1=C(C)C Intermediate Fragment 
64 377.1581315841 [CH2+]N1C(=NC2=NC3=C(O)N=C(N)N=C3N2)N=CC1=C(C)C=C1C=NC(C)=CN1 Intermediate Fragment 
65 245.0893833281 CN1CC=NC1=[NH+]C1=NC2=NC(N)=NC(=O)C2=N1
66 247.1050333921 CN1CCNC1=[NH+]C1=NC2=NC(N)=NC(=O)C2=N1
67 269.0893833281 C=C=C1C=NC(=[NH+]C2=NC3=NC(N)=NC(=O)C3=N2)N1C
68 271.1050333921 CC=C1C=NC(=[NH+]C2=NC3=NC(N)=NC(=O)C3=N2)N1C
69 283.1050333921 [CH2+]N1C(=NC2=NC3=NC(N)=NC(=O)C3=N2)N=CC1=C(C)C
70 375.1424815201 C=C1C=NC(=CC(C)=C2C=NC(=NC3=NC4=C(O)N=C(N)N=C4N3)N2[CH2+])C=N1
71 377.1581315841 C=C=C=C1NC=C(C)N=C1C1=NC(=[NH+]C2=NC3=C(O)N=C(N)N=C3N2)N(C)C1 Intermediate Fragment 
72 133.0760247081 C=C1C=NC(=C=[CH2+]C)C=N1
73 377.1581315841 CC=C=NC1=CC(C)=C2C(=NC(=[NH+]C3=NC4=C(O)N=C(N)N=C4N3)N2C)C1=N Intermediate Fragment 
74 377.1581315841 C=CN=C1C(N=C)=CC(C)=C2C1=NC(=[NH+]C1=NC3=C(O)N=C(N)N=C3N1)N2C Intermediate Fragment 
75 350.1472325521 C=CN=C1C=CC(C)=C2C1=NC(=[NH+]C1=NC3=C(O)N=C(N)N=C3N1)N2C
76 377.1581315841 C=C(C)N=C1C(N)=CC(C)=C2C1=NC(=NC1=NC3=C(O)N=C(N)N=C3N1)N2[CH2+] Intermediate Fragment 
77 337.1268314561 CC1=C2C(=NC(=[NH+]C3=NC4=NC(N)=NC(=O)C4=N3)N2C)C(=N)C(N)=C1
78 360.1315824881 C=C(C)N=C1C=CC(C)=C2C1=NC(=NC1=NC3=NC(N)=NC(=O)C3=N1)N2[CH2+]
79 377.1581315841 CC(=C=N)N=C1C=CC(C)=C2C1=NC(=[NH+]C1=NC3=C(O)N=C(N)N=C3N1)N2C Intermediate Fragment 
80 377.1581315841 [CH2+]N1C(=NC2=NC3=C(O)N=C(N)N=C3N2)N=C2CC(N=CC(C)=N)=CC(C)=C21 Intermediate Fragment 
81 360.1315824881 C=C=C=NC1=CC(C)=C2C(=NC(=NC3=NC4=C(O)N=C(N)N=C4N3)N2[CH2+])C1
82 379.1737816481 CC1=C2C(=NC(=[NH+]C3=NC4=C(O)N=C(N)N=C4N3)N2C)C2=NC(C)CNC2=C1
83 381.1894317121 CC1=C2C(=NC(=[NH+]C3=NC4=C(O)N=C(N)N=C4N3)N2C)C2NC(C)CNC2=C1
84 383.2050817761 CC1=C2C(=NC(=[NH+]C3=NC4=C(O)N=C(N)N=C4N3)N2C)C2NC(C)CNC2C1
85 461.1792609521 CC1=CNC2=CC(C)=C3C(=NC(=[NH+]C4=NC5=C(O)N=C(N)N=C5N4C4CC(O)=CO4)N3C)C2=N1
86 463.1949110161 CC1=C2C(=NC(=[NH+]C3=NC4=C(O)N=C(N)N=C4N3C3CC(O)=CO3)N2C)C2=NC(C)CNC2=C1
87 465.2105610801 CC1=C2C(=NC(=[NH+]C3=NC4=C(O)N=C(N)N=C4N3C3CC(O)=CO3)N2C)C2NC(C)CNC2=C1
88 475.1949110161 C=C1OC(N2C([NH+]=C3N=C4C5=NC(C)CNC5=CC(C)=C4N3C)=NC3=C(O)N=C(N)N=C32)C=C1O
89 457.1843463321 C=C1C=CC(N2C([NH+]=C3N=C4C5=NC(C)=CNC5=CC(C)=C4N3C)=NC3=C(O)N=C(N)N=C32)O1
90 265.1043646961 C=C1OC(N2C([NH3+])=NC3=C(O)N=C(N)N=C32)CC1O
91 459.1636108881 C=C1OC(N2C([NH+]=C3N=C4C(=CC=C5NC=C(C)N=C54)N3C)=NC3=C(O)N=C(N)N=C32)C=C1O
92 475.1949110161 C=C1OC(N2C(=NC(N)=NC=O)C=NC2=[NH+]C2=NC3=C(C(C)=CC4=C3N=C(C)CN4)N2C)C=C1O Intermediate Fragment 
93 405.1781983321 C=C1OC(N2C(=[NH2+])C=NC2=NC2=NC3=C(C(C)=CC4=C3N=C(C)CN4)N2C)C=C1O
94 475.1949110161 CC(=O)C(O)=CCN1C([NH+]=C2N=C3C4=NC(C)=CNC4=CC(C)=C3N2C)=NC2=C(O)N=C(N)N=C21 Intermediate Fragment 
95 457.1843463321 C#CC(O)=CCN1C([NH+]=C2N=C3C4=NC(C)=CNC4=CC(C)=C3N2C)=NC2=C(O)N=C(N)N=C21
96 433.1843463321 CC1=C2C(=NC(=[NH+]C3=NC4=C(O)N=C(N)N=C4N3CC#CO)N2C)C2=NC(C)CNC2=C1
97 475.1949110161 C=C(C=O)OC(C)N1C([NH+]=C2N=C3C4=NC(C)=CNC4=CC(C)=C3N2C)=NC2=C(O)N=C(N)N=C21 Intermediate Fragment 
98 403.1737816481 C=CN1C([NH+]=C2N=C3C4=NC(C)=CNC4=CC(C)=C3N2C)=NC2=C(O)N=C(N)N=C21
99 405.1894317121 CCN1C([NH+]=C2N=C3C4=NC(C)=CNC4=CC(C)=C3N2C)=NC2=C(O)N=C(N)N=C21
100 475.1949110161 C#COC(C=C=O)N1C([NH+]=C2N=C3C(=C(C)C=C4NCC(C)NC43)N2C)=NC2=C(O)N=C(N)N=C21 Intermediate Fragment 
101 475.1949110161 C#CC(O)=CC(=O)N1C([NH+]=C2N=C3C(=C(C)C=C4NCC(C)NC43)N2C)=NC2=C(O)N=C(N)N=C21 Intermediate Fragment 
102 449.1792609521 CC1=C2C(=NC(=[NH+]C3=NC4=C(O)N=C(N)N=C4N3C(=O)C#CO)N2C)C2NC(C)CNC2=C1
103 475.1949110161 C=NC1=C(N=C=[NH+]C2=NC3=C(O)N=C(N)N=C3N2C2C=C(O)C(=C)O2)C2=C(C=C1C)NCC(C)N2 Intermediate Fragment 
104 475.1949110161 C=C1OC(N2C([NH+]=C3N=CC(=C(C)C=C4C=NC(C)=CN4)N3C)=NC3=C(O)N=C(N)N=C32)C=C1O Intermediate Fragment 
105 369.1418128241 C=C1OC(N2C([NH+]=C3N=CC(=CC)N3C)=NC3=C(O)N=C(N)N=C32)C=C1O
106 95.0603746441 [CH4+]C1=NC=CN=C1
107 475.1949110161 C=C(C)N=C1C(N)=CC(C)=C2C1=NC(=[NH+]C1=NC3=C(O)N=C(N)N=C3N1C1C=C(O)C(=C)O1)N2C Intermediate Fragment 
108 458.1683619201 [CH+]=C1OC(N2C(N=C3N=C4C(=NC(=C)C)C=CC(C)=C4N3C)=NC3=C(O)N=C(N)N=C32)C=C1O
109 234.1713220601 CC1=C2C(=NC(=[NH2+])N2C)C2NC(C)CNC2C1
110 232.1556719961 CC1=C2C(=NC(=[NH2+])N2C)C2NC(C)CNC2=C1
111 230.1400219321 CC1=C2C(=NC(=[NH2+])N2C)C2=NC(C)CNC2=C1
112 212.0930717401 CC1=CC2=C(N=C(C)C=N2)C2=NC(=[NH2+])N=C12
113 212.0930717401 [CH2+]N1C(=N)N=C2C1=CC=C1NC=C(C)N=C12
114 228.1243718681 [CH2+]N1C(=N)N=CC1=C(C)C=C1C=NC(C)=CN1 Intermediate Fragment 
115 226.1087218041 C=C1C=NC(=CC(C)=C2C=NC(=N)N2[CH2+])C=N1
116 266.0883802841 [NH3+]C1=NC(O)=C2N=CN(C3CC(O)C(=CO)O3)C2=N1
117 268.1040303481 [NH3+]C1=NC(O)=C2N=CN(C3CC(O)C(CO)O3)C2=N1
118 150.0410361681 [NH3+]C1=NC(=O)C2=NC=NC2=N1
119 219.1604230281 CC1CNC2=CC(C)C3=C(N=CN3[CH4+])C2N1
120 275.0523291241 NC1=NC(O)=C2N=C([NH3+])N(C3=CC(=O)C(=C=O)O3)C2=N1
121 281.0992793161 NC1=NC(O)=C2N=C([NH3+])N(C3CC(O)C(=CO)O3)C2=N1
122 283.1149293801 NC1=NC(O)=C2N=C([NH3+])N(C3CC(O)C(CO)O3)C2=N1
123 283.1149293801 NC1=NC(O)=C2N=C([NH3+])N(C(=O)CC(O)CCO)C2=N1 Intermediate Fragment 
124 477.1741755721 CC1=CC2NCC(C)NC2C2=NC(=[NH+]C3=NC4=C(O)N=C(N)N=C4N3C3C=C(O)C(=C=O)O3)N=C12
125 477.1741755721 CC1=C2C(=NC(=[NH+]C3=NC4=C(O)N=C(N)N=C4N3C3C=C(O)C(=C=O)O3)N2C)C2NCCNC2=C1
126 477.1741755721 CC1CNC2=CC=C3C(=NC(=[NH+]C4=NC5=C(O)N=C(N)N=C5N4C4C=C(O)C(=C=O)O4)N3C)C2N1
127 363.1424815201 CC1C=NC2=CC=C3C(=NC(=[NH+]C4=NC5=C(O)N=C(N)N=C5N4)N3C)C2=N1
128 477.1741755721 CC1CNC2=CC=C3C(=NC(=[NH+]C4=NC5=C(O)N=C(N)N=C5N4CC=C(O)C(=O)C=O)N3C)C2=N1 Intermediate Fragment 
129 477.1741755721 CC1CNC2=CC=C3C(=NC(=[NH+]C4=NC5=C(O)N=C(N)N=C5N4C(=O)C=C(O)C#CO)N3C)C2N1 Intermediate Fragment 
130 476.1789266041 CC1=C2C(=NC(=[NH+]C3=NC4=C(O)N=CN=C4N3C3C=C(O)C(=C=O)O3)N2C)C2NC(C)CNC2=C1
131 493.2054757001 CC1=C2C(=NC(=[NH+]C3=NC(=C=O)C(=NC(=N)N)N3C3C=C(O)C(=C=O)O3)N2C)C2NC(C)CNC2C1 Intermediate Fragment 
132 476.1789266041 CC1=C2C(=NC(=NC3=NC(C=O)=C([NH+]=CN)N3C3C=C(O)C(=C=O)O3)N2C)C2=NC(C)CNC2=C1
133 451.1836776361 CC1=C2C(=NC(=NC3=NC(=C=O)C(=[NH2+])N3C3C=C(O)C(=C=O)O3)N2C)C2NC(C)CNC2C1
134 434.1571285401 CC1=C2C(=NC(=[NH+]C3=NC(C=O)=CN3C3C=C(O)C(=C=O)O3)N2C)C2=NC(C)CNC2=C1
135 406.1622139201 CC1=C2C(=NC(=[NH+]C3=NC=CN3C3C=C(O)C(=C=O)O3)N2C)C2=NC(C)CNC2=C1
136 493.2054757001 CC1=CC2NCC(C)NC2C2=C1N(C)C([NH+]=C1N=CC(=NC(N)=NC=O)N1C1C=C(O)C(=C=O)O1)=N2 Intermediate Fragment 
137 450.1996620481 CC1=C2C(=NC(=NC3=NC=C([NH+]=CN)N3C3C=C(O)C(=C=O)O3)N2C)C2NC(C)CNC2=C1
138 423.1887630161 CC1=CC2NCC(C)NC2C2=C1N(C)C(N=C1N=CC(=[NH2+])N1C1C=C(O)C(=C=O)O1)=N2
139 450.1996620481 CC1=C2C(=NC(=NC3=NC=C([NH+]=CN)N3CC=C(O)C(=O)C=O)N2C)C2=NC(C)CNC2=C1 Intermediate Fragment 
140 450.1996620481 CC1=C2C(=NC(=NC3=NC=C([NH+]=CN)N3C(=O)C=C(O)C#CO)N2C)C2NC(C)CNC2=C1 Intermediate Fragment 
141 448.1840119841 CC1=C2C(=NC(=NC3=NC=C([NH+]=CN)N3C3C=C(O)C(=C=O)O3)N2C)C2=NC(C)CNC2=C1
142 448.1840119841 CC1=CNC2=CC(C)=C3C(=NC(=NC4=NC=C([NH+]=CN)N4CC=C(O)C(=O)C=O)N3C)C2=N1 Intermediate Fragment 
143 446.1683619201 CC1=CNC2=CC(C)=C3C(=NC(=NC4=NC=C([NH+]=CN)N4C4C=C(O)C(=C=O)O4)N3C)C2=N1
144 425.2044130801 CC1CNC2CC(C)C3=C(N=C(N=C4N=CC(=[NH2+])N4C4C=C(O)C(=C=O)O4)N3C)C2N1
145 405.1781983321 CC1=CC2=C(NC(C)CN2)C2=C1N(C)C(N=C1N=CC(=[NH2+])N1C1C=CC(=C=O)O1)=N2
146 423.1887630161 CC1=CC2=C(NC(C)CN2)C2=C1N(C)C(N=C1N=CC(=[NH2+])N1CC=C(O)C(=O)C=O)=N2 Intermediate Fragment 
147 423.1887630161 CC1=CC2NCC(C)NC2C2=C1N(C)C(N=C1N=CC(=[NH2+])N1C(=O)C=C(O)C#CO)=N2 Intermediate Fragment 
148 75.0440558841 OCC=C[OH2+]
149 408.1778639841 CC1=C2C(=NC(=[NH+]C3=NC=CN3C3C=C(O)C(=C=O)O3)N2C)C2NC(C)CNC2=C1
150 465.2105610801 CC1=CC2NCC(C)NC2C2=C1N(C)C(N=C1N=CC(=NC(N)=[NH2+])N1C1C=C(O)C(=C=O)O1)=N2
151 465.2105610801 CC1=CC2NCC(C)NC2C2=C1N(C)C(N=C1N=CC(=NC(N)=[NH2+])N1C(=O)C=C(O)C#CO)=N2 Intermediate Fragment 
152 491.1898256361 CC1=CC2=C(NC(C)CN2)C2=C1N(C)C(N=C1N=CC(=NC(N)=[NH+]C=O)N1C1C=C(O)C(=C=O)O1)=N2
153 493.2054757001 CC1=C2C(=NC(=[NH+]C3=NC(C(=O)N=C(N)N)=CN3C3C=C(O)C(=C=O)O3)N2C)C2NC(C)CNC2=C1 Intermediate Fragment 
154 493.2054757001 CC1=C2C(=NC(=[NH+]C3=NC(=C(O)N=CN)C(=N)N3C3C=C(O)C(=C=O)O3)N2C)C2NC(C)CNC2=C1 Intermediate Fragment 
155 449.1680275721 CC1=C2C(=NC(=NC3=NC(=C=O)C(=[NH2+])N3C3C=C(O)C(=C=O)O3)N2C)C2NC(C)CNC2=C1
156 493.2054757001 CC1=C2C(=NC(=[NH+]C(=N)N(C3=NC(N)=NC(O)=C3)C3C=C(O)C(=C=O)O3)N2C)C2NC(C)CNC2=C1 Intermediate Fragment 
157 382.1622139201 CC1=C2C(=NC(=NC(=[NH2+])N=C3C=C(O)C(=C=O)O3)N2C)C2NC(C)CNC2=C1
158 491.1898256361 CC1=C2C(=NC(=NC(=[NH2+])N(C3=NC(N)=NC(O)=C3)C3C=C(O)C(=C=O)O3)N2C)C2=NC(C)CNC2=C1
159 493.2054757001 CC1=C2C(=NC(=[NH+]C(=NC3=C(O)N=C(N)N=C3)N=C3C=C(O)C(=C=O)O3)N2C)C2NC(C)CNC2C1 Intermediate Fragment 
160 125.0457872001 NC1=NC(=O)C(=[NH2+])C=N1
161 493.2054757001 CC1=CC2=C(NC(C)CN2)C2=C1N(C)C([NH+]=CN(C1=NC(N)=NC(O)=C1N)C1C=C(O)C(=C=O)O1)=N2 Intermediate Fragment 
162 493.2054757001 CC1=C2C(=NC(=[NH+]C3=NC4=C(O)N=C(N)N=C4N3CC=C(O)C(=O)C=O)N2C)C2NC(C)CNC2=C1 Intermediate Fragment 
163 475.1949110161 CC1=C2C(=NC(=[NH+]C3=NC4=C(O)N=C(N)N=C4N3CC=C(O)C#CO)N2C)C2=NC(C)CNC2=C1
164 437.2156464601 CC1=C2C(=NC(=[NH+]C3=NC4=C(O)N=C(N)N=C4N3CC#CO)N2C)C2NC(C)CNC2C1
165 435.1999963961 CC1=C2C(=NC(=[NH+]C3=NC4=C(O)N=C(N)N=C4N3CC#CO)N2C)C2NC(C)CNC2=C1
166 417.1894317121 C#CCN1C([NH+]=C2N=C3C4=NC(C)CNC4=CC(C)=C3N2C)=NC2=C(O)N=C(N)N=C21
167 433.1843463321 CC1=CC2=C(N=C(C)CN2)C2=C1N(C)C([NH+]=C1N=CC(=NC(N)=NC=O)N1CC#CO)=N2 Intermediate Fragment 
168 433.1843463321 CC1=CNC(=CC(C)=C2C=NC(=[NH+]C3=NC4=C(O)N=C(N)N=C4N3CC#CO)N2C)C=N1 Intermediate Fragment 
169 431.1686962681 CC1=CNC2=CC(C)=C3C(=NC(=[NH+]C4=NC5=C(O)N=C(N)N=C5N4CC#CO)N3C)C2=N1
170 63.0440558841 OCC[OH2+]
171 409.2207318401 CCN1C([NH+]=C2N=C3C(=C(C)C=C4NCC(C)NC43)N2C)=NC2=C(O)N=C(N)N=C21
172 407.2050817761 CCN1C([NH+]=C2N=C3C4=NC(C)CNC4=CC(C)=C3N2C)=NC2=C(O)N=C(N)N=C21
173 401.1581315841 C#CN1C([NH+]=C2N=C3C4=NC(C)=CNC4=CC(C)=C3N2C)=NC2=C(O)N=C(N)N=C21
174 91.0389705041 OCC(=[OH+])CO
175 93.0546205681 OCC([OH2+])CO
176 387.1424815201 C=C1C=NC2=CC(C)=C3C(=NC(=NC4=NC5=C(O)N=C(N)N=C5N4[CH2+])N3C)C2=N1
177 491.1898256361 CC1=C2C(=NC(=[NH+]C3=NC4=C(O)N=C(N)N=C4N3CC=C(O)C(=O)C=O)N2C)C2=NC(C)CNC2=C1
178 493.2054757001 C=C(O)C(=C=O)OCN1C([NH+]=C2N=C3C(=C(C)C=C4NCC(C)NC43)N2C)=NC2=C(O)N=C(N)N=C21 Intermediate Fragment 
179 389.1581315841 C=C1C=NC2=CC(C)=C3C(=NC(=[NH+]C4=NC5=C(O)N=C(N)N=C5N4C)N3C)C2=N1
180 89.0597059481 CC(O)C=C[OH2+]
181 493.2054757001 CC1=C2C(=NC(=[NH+]C3=NC4=C(O)N=C(N)N=C4N3C(C)OC(=C=O)C=O)N2C)C2NC(C)CNC2=C1 Intermediate Fragment 
182 419.1686962681 CC(=O)N1C([NH+]=C2N=C3C4=NC(C)=CNC4=CC(C)=C3N2C)=NC2=C(O)N=C(N)N=C21
183 209.0781499481 CC(=O)N1C2=NC(N)=NC(=O)C2=NC1[NH3+]
184 419.1686962681 [CH2+]C(=O)N1C(N=C2N=CC(=C(C)C=C3C=NC(C)=CN3)N2C)=NC2=C(O)N=C(N)N=C21 Intermediate Fragment 
185 421.1843463321 CC(=O)N1C([NH+]=C2N=C3C4=NC(C)CNC4=CC(C)=C3N2C)=NC2=C(O)N=C(N)N=C21
186 421.1843463321 CC(=O)N1C([NH+]=C2N=CC(=C(C)C=C3C=NC(C)=CN3)N2C)=NC2=C(O)N=C(N)N=C21 Intermediate Fragment 
187 423.1999963961 CC(=O)N1C([NH+]=C2N=C3C(=C(C)C=C4NCC(C)NC43)N2C)=NC2=C(O)N=C(N)N=C21
188 425.2156464601 CC(=O)N1C([NH+]=C2N=C3C(=C(C)CC4NCC(C)NC34)N2C)=NC2=C(O)N=C(N)N=C21
189 463.1949110161 CC1=C2C(=NC(=[NH+]C3=NC4=C(O)N=C(N)N=C4N3C(C)OC#CO)N2C)C2=NC(C)CNC2=C1
190 465.2105610801 CC1=C2C(=NC(=[NH+]C3=NC4=C(O)N=C(N)N=C4N3C(C)OC#CO)N2C)C2NC(C)CNC2=C1
191 493.2054757001 CC1=C2C(=NC(=[NH+]C3=NC4=C(O)N=C(N)N=C4N3C(C=C=O)OC#CO)N2C)C2NC(C)CNC2C1 Intermediate Fragment 
192 451.1949110161 CC1=C2C(=NC(=[NH+]C3=NC4=C(O)N=C(N)N=C4N3C(=O)C#CO)N2C)C2NC(C)CNC2C1
193 433.1843463321 C#CC(=O)N1C([NH+]=C2N=C3C(=C(C)C=C4NCC(C)NC43)N2C)=NC2=C(O)N=C(N)N=C21
194 493.2054757001 CC1=C2C(=NC(=[NH+]C3=NC4=C(O)N=C(N)N=C4N3C(=O)C=C(O)C#CO)N2C)C2NC(C)CNC2C1 Intermediate Fragment 
195 447.1636108881 CC1=C2C(=NC(=[NH+]C3=NC4=C(O)N=C(N)N=C4N3C(=O)C#CO)N2C)C2=NC(C)CNC2=C1
196 429.1530462041 CC1=CNC2=CC(C)=C3C(=NC(=NC4=NC5=C(O)N=C(N)N=C5N4[CH+]C#CO)N3C)C2=N1
197 447.1636108881 CC1=CNC(=CC(C)=C2C=NC(=[NH+]C3=NC4=C(O)N=C(N)N=C4N3C(=O)C#CO)N2C)C=N1 Intermediate Fragment 
198 447.1636108881 C=C(C)N=C1C(N)=CC(C)=C2C1=NC(=[NH+]C1=NC3=C(O)N=C(N)N=C3N1C(=O)C#CO)N2C Intermediate Fragment 
199 45.0334912001 C=C[OH2+]
200 47.0491412641 CC[OH2+]
201 29.0385765801 C=[CH3+]
202 417.1530462041 [CH2+]C(=O)N1C(N=C2N=C3C4=NC(C)=CNC4=CC(C)=C3N2C)=NC2=C(O)N=C(N)N=C21
203 68.9971056921 [O+]#CC#CO
204 41.0021910721 [C+]#CO
205 71.0127557561 O=CC#C[OH2+]
206 43.0178411361 C#C[OH2+]
207 73.0284058201 OCC#C[OH2+]
208 55.0178411361 C#CC=[OH+]
209 57.0334912001 C#CC[OH2+]
210 409.1843463321 CC1=C2C(=NC(=[NH+]C3=NC4=C(O)N=C(N)N=C4N3C=O)N2C)C2NC(C)CNC2=C1
211 407.1686962681 CC1=C2C(=NC(=[NH+]C3=NC4=C(O)N=C(N)N=C4N3C=O)N2C)C2=NC(C)CNC2=C1
212 405.1530462041 CC1=CNC2=CC(C)=C3C(=NC(=[NH+]C4=NC5=C(O)N=C(N)N=C5N4C=O)N3C)C2=N1
213 405.1530462041 CC1=CC2=C(N=C(C)C=N2)C2=C1N(C)C([NH+]=C1N=CC(=NC(N)=NC=O)N1C=O)=N2 Intermediate Fragment 
214 405.1530462041 CC1=CNC(=CC(C)=C2C=NC(=NC3=NC4=C(O)N=C(N)N=C4N3C#[O+])N2C)C=N1 Intermediate Fragment 
215 403.1373961401 CC1=CNC2=CC(C)=C3C(=NC(=NC4=NC5=C(O)N=C(N)N=C5N4C#[O+])N3C)C2=N1
216 87.0440558841 CC(O)C#C[OH2+]
217 69.0334912001 C=CC#C[OH2+]
218 91.0753560121 CC(O)CC[OH2+]
219 73.0647913281 C=CC(C)[OH2+]
220 73.0647913281 CCC=C[OH2+]
221 491.1898256361 CC1=C2C(=NC(=[NH+]C3=NC4=C(O)N=C(N)N=C4N3C(=O)C=C(O)C#CO)N2C)C2NC(C)CNC2=C1
222 473.1792609521 CC1=CNC2=CC(C)=C3C(=NC(=[NH+]C4=NC5=C(O)N=C(N)N=C5N4CC=C(O)C#CO)N3C)C2=N1
223 493.2054757001 CC1=C(N(C)C=[NH+]C2=NC3=C(O)N=C(N)N=C3N2C2C=C(O)C(=C=O)O2)C(=N)C2NC(C)CNC2=C1 Intermediate Fragment 
224 201.1134728361 C=C1C=NC2=CC(C)C(=NC)C(=[NH2+])C2=N1
225 493.2054757001 C=NC1=C(N=C=[NH+]C2=NC3=C(O)N=C(N)N=C3N2C2C=C(O)C(=C=O)O2)C2NC(C)CNC2CC1C Intermediate Fragment 
226 188.1182238681 C=[NH+]C1=CC2=NC(C)C=NC2=CC1C
227 186.1025738041 C=[NH+]C1=CC2=NC(=C)C=NC2=CC1C
228 184.0869237401 C=[NH+]C1=CC2=NC(=C)C=NC2=CC1=C
229 308.1101783481 NC[NH2+]C1=NC2=C(O)N=C(N)N=C2N1C1CC(O)C(=C=O)O1
230 310.1258284121 NC[NH2+]C1=NC2=C(O)N=C(N)N=C2N1C1CC(O)C(=CO)O1
231 462.1632765401 CC1=CC2=C(NC(C)CN2)C(N=C=[NH+]C2=NC3=C(O)N=C(N)N=C3N2C2C=C(O)C(=C=O)O2)=C1
232 464.1789266041 CC1=CC2NCC(C)NC2C(N=C=[NH+]C2=NC3=C(O)N=C(N)N=C3N2C2C=C(O)C(=C=O)O2)=C1
233 464.1789266041 CC1=CC2NCC(C)NC2C(N=C=[NH+]C2=NC3=C(O)N=C(N)N=C3N2C(=O)C=C(O)C#CO)=C1 Intermediate Fragment 
234 466.1945766681 CC1C=C(N=C=[NH+]C2=NC3=C(O)N=C(N)N=C3N2C2C=C(O)C(=C=O)O2)C2NC(C)CNC2C1
235 493.2054757001 C=NC(N=C1C=C(C)CC2NCC(C)NC12)=[NH+]C1=NC2=C(O)N=C(N)N=C2N1C1C=C(O)C(=C=O)O1 Intermediate Fragment 
236 320.1101783481 CNC[NH2+]C1=NC2=C(O)N=C(N)N=C2N1C1C=C(O)C(=C=O)O1
237 322.1258284121 CNC[NH2+]C1=NC2=C(O)N=C(N)N=C2N1C1CC(O)C(=C=O)O1
238 159.0916747721 CC1C=CC2=NC(=[CH3+])C=NC2=C1
239 493.2054757001 CC1=CC2=C(C=C1N(C)C(N)=[NH+]C1=NC3=C(O)N=C(N)N=C3N1C1C=C(O)C(=C=O)O1)NC(C)CN2 Intermediate Fragment 
240 493.2054757001 CC(C)=C1C(C2=CNCC(C)N2)=NC(=[NH+]C2=NC3=C(O)N=C(N)N=C3N2C2C=C(O)C(=C=O)O2)N1C Intermediate Fragment 
241 493.2054757001 CC(C=C1CNC(C)CN1)=C1C=NC(=[NH+]C2=NC3=C(O)N=C(N)N=C3N2C2C=C(O)C(=C=O)O2)N1C Intermediate Fragment 
242 135.0916747721 C[CH2+]=C=C1C=NC(C)C=N1
243 131.0603746441 C=[CH+]=C=C1C=NC(=C)C=N1
244 357.1054273161 CN1CC=NC1=[NH+]C1=NC2=C(O)N=C(N)N=C2N1C1C=C(O)C(=C=O)O1
245 359.1210773801 CN1CCNC1=[NH+]C1=NC2=C(O)N=C(N)N=C2N1C1C=C(O)C(=C=O)O1
246 361.1367274441 CN1CCNC1[NH2+]C1=NC2=C(O)N=C(N)N=C2N1C1C=C(O)C(=C=O)O1
247 361.1367274441 CN1CCNC1[NH2+]C1=NC2=C(O)N=C(N)N=C2N1C(=O)C=C(O)C#CO Intermediate Fragment 
248 363.1523775081 CN1CCNC1[NH2+]C1=NC2=C(O)N=C(N)N=C2N1C1CC(O)C(=C=O)O1
249 107.0603746441 C=C1C=NC(=[CH3+])C=N1
250 383.1210773801 CC=C1C=NC(=[NH+]C2=NC3=C(O)N=C(N)N=C3N2C2C=C(O)C(=C=O)O2)N1C
251 385.1367274441 CCC1C=NC(=[NH+]C2=NC3=C(O)N=C(N)N=C3N2C2C=C(O)C(=C=O)O2)N1C
252 387.1523775081 CCC1CNC(=[NH+]C2=NC3=C(O)N=C(N)N=C3N2C2C=C(O)C(=C=O)O2)N1C
253 97.0760247081 [CH4+]C1=NC=CNC1
254 95.0603746441 C=C=NC([CH4+])=C=N Intermediate Fragment 
255 95.0603746441 C=C([CH4+])N=C=C=N Intermediate Fragment 
256 68.0494756121 C#[N+]C(=C)C
257 95.0603746441 C=NC=C=NC=[CH3+] Intermediate Fragment 
258 68.0494756121 C#C[NH+]=CC
259 95.0603746441 C=CN=CC([CH2+])=N Intermediate Fragment 
260 95.0603746441 C=NC([CH2+])=C=NC Intermediate Fragment 
261 54.0338255481 C#C[NH+]=C
262 93.0447245801 [CH2+]C1=NC=CN=C1
263 93.0447245801 C=NC=C=NC#[CH2+] Intermediate Fragment 
264 66.0338255481 C#C[NH+]=C=C
265 395.1210773801 [CH2+]N1C(=NC2=NC3=C(O)N=C(N)N=C3N2C2C=C(O)C(=C=O)O2)N=CC1=C(C)C
266 285.1206834561 CC(C)=C1C=NC(=[NH+]C2=NC3=NC(N)=NC(=O)C3=N2)N1C
267 397.1367274441 CC(C)=C1C=NC(=[NH+]C2=NC3=C(O)N=C(N)N=C3N2C2C=C(O)C(=C=O)O2)N1C
268 399.1523775081 CC(C)C1C=NC(=[NH+]C2=NC3=C(O)N=C(N)N=C3N2C2C=C(O)C(=C=O)O2)N1C
269 381.1418128241 [CH+]=C1OC(N2C(N=C3N=CC(=C(C)C)N3C)=NC3=C(O)N=C(N)N=C32)C=C1O
270 399.1523775081 CC(C)=C1C=NC(=[NH+]C2=NC3=C(O)N=C(N)N=C3N2CC=C(O)C(=O)C=O)N1C Intermediate Fragment 
271 399.1523775081 CC(C)C1C=NC(=[NH+]C2=NC3=C(O)N=C(N)N=C3N2C(=O)C=C(O)C#CO)N1C Intermediate Fragment 
272 399.1523775081 CNC(=CN=C=[NH+]C1=NC2=C(O)N=C(N)N=C2N1C1C=C(O)C(=C=O)O1)C(C)C Intermediate Fragment 
273 491.1898256361 CC(C=C1C=NC(C)CN1)=C1C=NC(=[NH+]C2=NC3=C(O)N=C(N)N=C3N2C2C=C(O)C(=C=O)O2)N1C
274 493.2054757001 CC=C=C1NCC(C)NC1C1=NC(=[NH+]C2=NC3=C(O)N=C(N)N=C3N2C2C=C(O)C(=C=O)O2)N(C)C1 Intermediate Fragment 
275 493.2054757001 CCCNC1=CC(C)=C2C(=NC(=[NH+]C3=NC4=C(O)N=C(N)N=C4N3C3C=C(O)C(=C=O)O3)N2C)C1N Intermediate Fragment 
276 438.1632765401 CC1=C2C(=NC(=[NH+]C3=NC4=C(O)N=C(N)N=C4N3C3C=C(O)C(=C=O)O3)N2C)C(N)CC1
277 493.2054757001 CCNC1C(NC)=CC(C)=C2C1=NC(=[NH+]C1=NC3=C(O)N=C(N)N=C3N1C1C=C(O)C(=C=O)O1)N2C Intermediate Fragment 
278 452.1789266041 CNC1CC2=NC(=[NH+]C3=NC4=C(O)N=C(N)N=C4N3C3C=C(O)C(=C=O)O3)N(C)C2=C(C)C1
279 466.1945766681 CCNC1CCC(C)=C2C1=NC(=[NH+]C1=NC3=C(O)N=C(N)N=C3N1C1C=C(O)C(=C=O)O1)N2C
280 493.2054757001 CC1=C2C(=NC(=[NH+]C3=NC4=C(O)N=C(N)N=C4N3C3C=C(O)C(=C=O)O3)N2C)C(NC(C)C)C(N)=C1 Intermediate Fragment 
281 451.1585255081 CC1=C2C(=NC(=[NH+]C3=NC4=C(O)N=C(N)N=C4N3C3C=C(O)C(=C=O)O3)N2C)C(N)C(N)=C1
282 453.1741755721 CC1=C2C(=NC(=[NH+]C3=NC4=C(O)N=C(N)N=C4N3C3C=C(O)C(=C=O)O3)N2C)C(N)C(N)C1
283 453.1741755721 CC1=C2C(=NC(=[NH+]C3=NC4=C(O)N=C(N)N=C4N3C(=O)C=C(O)C#CO)N2C)C(N)C(N)C1 Intermediate Fragment 
284 476.1789266041 CC1=C2C(=NC(=[NH+]C3=NC4=C(O)N=C(N)N=C4N3C3C=C(O)C(=C=O)O3)N2C)C(=NC(C)C)C=C1
285 364.1628826161 CC1=C2C(=NC(=[NH+]C3=NC4=NC(N)=NC(=O)C4=N3)N2C)C(=NC(C)C)C=C1
286 493.2054757001 CC1=C2C(=NC(=[NH+]C3=NC4=C(O)N=C(N)N=C4N3C3C=C(O)C(=C=O)O3)N2C)C(NC(C)CN)C=C1 Intermediate Fragment 
287 493.2054757001 CC1=C2C(=NC(=[NH+]C3=NC4=C(O)N=C(N)N=C4N3C3C=C(O)C(=C=O)O3)N2C)CC(NCC(C)N)=C1 Intermediate Fragment 
288 476.1789266041 CC=CNC1=CC(C)=C2C(=NC(=[NH+]C3=NC4=C(O)N=C(N)N=C4N3C3C=C(O)C(=C=O)O3)N2C)C1
289 364.1628826161 CC=CNC1=CC(C)=C2C(=NC(=[NH+]C3=NC4=NC(N)=NC(=O)C4=N3)N2C)C1
290 450.1632765401 CNC1=CC(C)=C2C(=NC(=[NH+]C3=NC4=C(O)N=C(N)N=C4N3C3C=C(O)C(=C=O)O3)N2C)C1
291 448.1476264761 C=NC1=CC(C)=C2C(=NC(=[NH+]C3=NC4=C(O)N=C(N)N=C4N3C3C=C(O)C(=C=O)O3)N2C)C1
292 425.1680275721 CC1CCCC2=NC(=[NH+]C3=NC4=C(O)N=C(N)N=C4N3C3C=C(O)C(=C=O)O3)N(C)C21
293 425.1680275721 CC1CCCC2=NC(=[NH+]C3=NC4=C(O)N=C(N)N=C4N3C(=O)C=C(O)C#CO)N(C)C21 Intermediate Fragment 
294 423.1523775081 CC1=C2C(=NC(=[NH+]C3=NC4=C(O)N=C(N)N=C4N3C3C=C(O)C(=C=O)O3)N2C)CCC1
