#In-silico ESI-MS/MS [M+H]+ Spectra
#PREDICTED BY CFM-ID 4.0.8
#SMILES=n1([C@H]2C[C@H]([C@H](O2)CO)O)c(=O)[nH]c(=O)[nH]c1=O
#InChiKey=ZDRVJUHQWHYWAT-UOWFLXDJSA-N
energy0
44.01309 8.36 46 (4.7731)
87.01890 16.56 45 (9.4585)
130.02472 100.00 42 43 (44.405 12.708)
246.07206 18.89 0 231 82 187 126 166 181 179 235 (10.53 0.10354 0.046414 0.036222 0.02799 0.023383 0.013194 0.0058603 0.0027734)
energy1
44.01309 93.42 46 (19.332)
69.99235 40.73 47 (8.4289)
87.01890 100.00 45 (20.694)
99.04406 45.61 5 29 6 (5.3658 2.2535 1.8202)
112.99817 31.92 44 (6.6062)
130.02472 74.97 43 42 (9.7683 5.7468)
energy2
43.01784 13.10 10 (1.4841)
44.01309 13.16 46 (1.4912)
45.03349 45.04 11 (5.1021)
47.04914 9.21 12 (1.0437)
57.03349 19.55 26 (2.2148)
61.02841 11.72 27 (1.3277)
68.01309 8.52 217 (0.96462)
69.00834 7.93 228 (0.8981)
69.99235 100.00 47 (11.328)
70.02874 27.91 136 (3.1621)
71.02399 29.76 122 229 (2.002 1.3697)
71.04914 10.24 103 104 (0.74238 0.41791)
72.00800 60.40 50 (6.8418)
73.02841 13.04 20 129 9 (0.81326 0.62425 0.039349)
74.02365 28.27 54 (3.2021)
87.01890 25.75 45 (2.9167)
87.04406 8.06 14 3 18 (0.69036 0.17131 0.051229)
99.04406 30.71 6 5 29 (1.6599 1.4869 0.33222)
100.00292 24.56 90 (2.782)
114.02980 20.33 80 119 (2.2201 0.082336)
115.01382 21.64 91 98 (1.7556 0.69582)
130.02472 87.41 43 42 (8.0995 1.8023)
142.02472 14.18 121 125 87 (0.84315 0.57847 0.18419)
142.04987 8.84 72 78 218 (0.60314 0.29271 0.10598)
156.04037 24.66 135 134 133 139 (1.7755 0.72535 0.22725 0.065738)
158.01963 45.83 97 95 94 93 (1.8869 1.6097 1.3404 0.35495)

0 246.0720615241 O=c1[nH]c(=O)n(C2CC(O)C(C[OH2+])O2)c(=O)[nH]1
1 117.0546205681 OC1C=COC1C[OH2+]
2 85.0284058201 [OH2+]C1=COC=C1
3 87.0440558841 [OH2+]C1C=COC1
4 89.0597059481 [OH2+]C1CCOC1
5 99.0440558841 CC1=C([OH2+])C=CO1
6 99.0440558841 [OH2+]CC1=CC=CO1
7 117.0546205681 C=C(O)C(=C[OH2+])OC Intermediate Fragment 
8 75.0440558841 C[OH+]C=CO
9 73.0284058201 C[OH+]C#CO
10 43.0178411361 C#C[OH2+]
11 45.0334912001 C=C[OH2+]
12 47.0491412641 CC[OH2+]
13 85.0284058201 C=C(O)C#C[OH2+]
14 87.0440558841 C=C(O)C=C[OH2+]
15 89.0597059481 C=C(O)CC[OH2+]
16 117.0546205681 C=COC(=CO)C[OH2+] Intermediate Fragment 
17 89.0597059481 C=C[OH+]CCO
18 87.0440558841 C#C[OH+]CCO
19 71.0127557561 OC#CC=[OH+]
20 73.0284058201 OC#CC[OH2+]
21 75.0440558841 OC=CC[OH2+]
22 89.0233204401 O=CC([OH2+])=CO
23 91.0389705041 OC=C([OH2+])CO
24 117.0546205681 OC=C=COCC[OH2+] Intermediate Fragment 
25 59.0491412641 C=CC[OH2+]
26 57.0334912001 C#CC[OH2+]
27 61.0284058201 OCC=[OH+]
28 117.0546205681 OC=C=C(O)CC[OH2+] Intermediate Fragment 
29 99.0440558841 C#CC(O)=CC[OH2+]
30 117.0546205681 C=C=C(O)C(O)C[OH2+] Intermediate Fragment 
31 115.0389705041 OC1=C(C[OH2+])OC=C1
32 97.0284058201 [CH2+]C1=C(O)C=CO1
33 115.0389705041 C=COC(C=[OH+])=CO Intermediate Fragment 
34 115.0389705041 OC=C=COC=C[OH2+] Intermediate Fragment 
35 115.0389705041 OC=C=C(O)C=C[OH2+] Intermediate Fragment 
36 115.0389705041 C=C=C(O)C(=O)C[OH2+] Intermediate Fragment 
37 113.0233204401 OC1=C(C=[OH+])OC=C1
38 95.0127557561 [CH+]=C1OC=CC1=O
39 113.0233204401 C=COC(=C=O)C=[OH+] Intermediate Fragment 
40 113.0233204401 C=C=C(O)C(=O)C=[OH+] Intermediate Fragment 
41 111.0076703761 [O+]#CC1=C(O)C=CO1
42 130.0247174081 OC1=NC(O)=NC([OH2+])=N1
43 130.0247174081 N=C([OH2+])N=C(O)N=C=O Intermediate Fragment 
44 112.9981683121 O=C=NC(=O)[NH+]=C=O
45 87.0189037561 [NH2+]=C(O)N=C=O
46 44.0130901041 [NH+]#CO
47 69.9923546601 O=C=[N+]=C=O
48 132.0403674721 OC1=NC([OH2+])=NC(O)N1
49 132.0403674721 N=C([OH2+])N=C(O)N=CO Intermediate Fragment 
50 72.0080047241 O=C=[NH+]C=O
51 134.0560175361 OC1N=C([OH2+])NC(O)N1
52 116.0454528521 OC1N=CN=C([OH2+])N1
53 134.0560175361 N=C([OH2+])N=C(O)NCO Intermediate Fragment 
54 74.0236547881 O=C=[NH+]CO
55 136.0716676001 OC1NC(O)NC([OH2+])N1
56 136.0716676001 N=C([OH2+])NC(O)NCO Intermediate Fragment 
57 214.0458467761 O=C1N=C(O)NC(O)N1C1=CC([OH2+])=CO1
58 196.0352820921 OC1=NC(=[OH+])N(C2=CC=CO2)C(O)=N1
59 216.0614968401 O=C1NC(O)NC(O)N1C1=CC([OH2+])=CO1
60 198.0509321561 OC1=NC(=[OH+])N(C2=CC=CO2)C(O)N1
61 216.0614968401 N=C(O)NC(O)N(C=O)C1=CC([OH2+])=CO1 Intermediate Fragment 
62 218.0771469041 OC1NC(O)N(C2=CC([OH2+])=CO2)C(O)N1
63 200.0665822201 OC1NC(=[OH+])N(C2=CC=CO2)C(O)N1
64 218.0771469041 O=CC([OH2+])=C=CN1C(O)NC(O)NC1O Intermediate Fragment 
65 228.0614968401 CC1=C([OH2+])C=C(N2C(=O)N=C(O)NC2O)O1
66 228.0614968401 CC(=O)C([OH2+])=C=CN1C(=O)N=C(O)NC1O Intermediate Fragment 
67 228.0614968401 C#CC([OH2+])=C=C(O)N1C(=O)NC(O)NC1O Intermediate Fragment 
68 228.0614968401 C#COC(=C=C=[OH+])N1C(O)NC(O)NC1O Intermediate Fragment 
69 228.0614968401 CC1=C([OH2+])C=C(N(C=O)C(O)=NC(=N)O)O1 Intermediate Fragment 
70 211.0349477441 CC1=C(O)C=C([NH+](C=O)C(=O)N=C=O)O1
71 168.0291340921 C=C1OC([NH+](C=O)C=O)=CC1=O
72 142.0498695361 C=C1OC(=[NH+]CO)C=C1O
73 140.0342194721 C=C1OC(=[NH+]C=O)C=C1O
74 89.0345538201 [NH2+]=C(O)N=CO
75 228.0614968401 CC1=C([OH2+])C=C(N(C(=O)N=C=O)C(N)O)O1 Intermediate Fragment 
76 228.0614968401 O=C1NC(O)NC(O)N1C1=CC=C(C=[OH+])O1
77 228.0614968401 N=C(O)NC(O)N(C=O)C1=CC=C(C=[OH+])O1 Intermediate Fragment 
78 142.0498695361 OC=C1C=CC(=[NH+]CO)O1
79 228.0614968401 OC1=C(C=[OH+])OC(N2C=NC(O)NC2O)=C1
80 114.0298027881 OC1=NC([OH2+])=NC=N1
81 228.0614968401 O=C1NCNC(O)N1C1=CC(O)=C(C=[OH+])O1
82 246.0720615241 C=C(O)C(=C=[OH+])OCN1C(=O)NC(O)NC1O Intermediate Fragment 
83 204.0614968401 O=C1NC(O)NC(O)N1C[OH+]C#CO
84 202.0458467761 O=C1N=C(O)NC(O)N1C[OH+]C#CO
85 162.0509321561 O=C1N=C(O)NC(O)N1C[OH2+]
86 160.0352820921 O=C1N=C(O)N=C(O)N1C[OH2+]
87 142.0247174081 [CH2+]N1C(=O)N=C(O)N=C1O
88 160.0352820921 O=C(N=C[OH2+])N=C(O)N=CO Intermediate Fragment 
89 160.0352820921 NC(O)=NC(=O)N(C=O)C=[OH+] Intermediate Fragment 
90 100.0029193441 O=C=[N+](C=O)C=O
91 115.0138183761 NC(=O)[N+](=C=O)C=O
92 160.0352820921 NC(=O)N(C[OH2+])C(=O)N=C=O Intermediate Fragment 
93 158.0196320281 O=C1N=C(O)N=C(O)N1C=[OH+]
94 158.0196320281 O=C=NC(O)=NC(=O)N=C[OH2+] Intermediate Fragment 
95 158.0196320281 NC(O)=NC(=O)N(C#[O+])C=O Intermediate Fragment 
96 140.9930829321 O=C=NC(=O)[N+](=C=O)C=O
97 158.0196320281 NC(=O)N(C=[OH+])C(=O)N=C=O Intermediate Fragment 
98 115.0138183761 O=C=NC(=O)[NH+]=CO
99 156.0039819641 O=C1N=C(O)N=C(O)N1C#[O+]
100 156.0039819641 O=C=NC(O)=NC(=O)N=C=[OH+] Intermediate Fragment 
101 69.0334912001 C#CC(=C)[OH2+]
102 69.0334912001 C#CC=C[OH2+]
103 71.0491412641 C=CC(=C)[OH2+]
104 71.0491412641 C#CCC[OH2+]
105 91.0753560121 CC(O)CC[OH2+]
106 73.0647913281 C=C([OH2+])CC
107 148.0716676001 CN1C(=[OH+])NC(O)NC1O
108 148.0716676001 CN(C(=[OH+])N=CO)C(N)O Intermediate Fragment 
109 146.0560175361 CN1C(=[OH+])N=C(O)NC1O
110 146.0560175361 CN(C=O)C(=[OH+])N=C(N)O Intermediate Fragment 
111 146.0560175361 CN(C(=[OH+])N=C=O)C(N)O Intermediate Fragment 
112 144.0403674721 CN1C(=[OH+])N=C(O)N=C1O
113 126.0298027881 [CH2+]N1C=NC(=O)N=C1O
114 144.0403674721 C=NC(=[OH+])N=C(O)N=CO Intermediate Fragment 
115 144.0403674721 CN(C#[O+])C(=O)N=C(N)O Intermediate Fragment 
116 58.0287401681 C=[NH+]C=O
117 127.0138183761 C=[N+](C=O)C(=O)N=C=O
118 116.0454528521 C=[NH+]C(=O)N=C(N)O
119 114.0298027881 C#[N+]C(=O)N=C(N)O
120 144.0403674721 CN(C(=N)O)C(=[OH+])N=C=O Intermediate Fragment 
121 142.0247174081 C=NC(=[OH+])N=C(O)N=C=O Intermediate Fragment 
122 71.0239891361 C#[N+]C(N)=O
123 97.0032536921 C#[N+]C(=O)N=C=O
124 99.0189037561 C=[NH+]C(=O)N=C=O
125 142.0247174081 [CH2+]N(C(=N)O)C(=O)N=C=O Intermediate Fragment 
126 246.0720615241 O=C(C=[OH+])C(O)=C=CN1C(O)NC(O)NC1O Intermediate Fragment 
127 93.0546205681 OCC([OH2+])CO
128 75.0440558841 CC([OH2+])=CO
129 73.0284058201 CC([OH2+])=C=O
130 154.0247174081 C#CN1C(=[OH+])N=C(O)N=C1O
131 154.0247174081 C=C=NC(=[OH+])N=C(O)N=C=O Intermediate Fragment 
132 154.0247174081 C#CN(C#[O+])C(=O)N=C(N)O Intermediate Fragment 
133 156.0403674721 C#CN1C(=[OH+])N=C(O)NC1O
134 156.0403674721 C=C=NC(=[OH+])N=C(O)N=CO Intermediate Fragment 
135 156.0403674721 C#CN(C=O)C(=[OH+])N=C(N)O Intermediate Fragment 
136 70.0287401681 C#C[NH2+]C=O
137 96.0080047241 C#C[N+](=C=O)C=O
138 128.0454528521 C=C=[NH+]C(=O)N=C(N)O
139 156.0403674721 C#CN(C(=[OH+])N=C=O)C(N)O Intermediate Fragment 
140 158.0560175361 C#CN1C(=[OH+])NC(O)NC1O
141 140.0454528521 C#CN1C=NC(=[OH+])NC1O
142 140.0454528521 C#CN1C(=[OH+])N=CNC1O
143 158.0560175361 C=C=NC(=[OH+])N=C(O)NCO Intermediate Fragment 
144 158.0560175361 C#CN(CO)C(=[OH+])N=C(N)O Intermediate Fragment 
145 72.0443902321 C#C[NH2+]CO
146 98.0236547881 C#C[NH+](C=O)C=O
147 115.0502038841 C#C[NH+](CO)C(N)=O
148 141.0294684401 C#C[NH+](CO)C(=O)N=C=O
149 158.0560175361 C#CN(C(=[OH+])N=CO)C(N)O Intermediate Fragment 
150 160.0716676001 C#CN1C(O)NC(O)NC1[OH2+]
151 162.0873176641 C=CN1C(O)NC(O)NC1[OH2+]
152 184.0352820921 O=C1N=C(O)NC(O)N1C#CC=[OH+]
153 184.0352820921 N=C(O)N=C(O)N(C#CC=[OH+])C=O Intermediate Fragment 
154 186.0509321561 O=C1NC(O)NC(O)N1C#CC=[OH+]
155 168.0403674721 CC#CN1C(=[OH+])N=C(O)N=C1O
156 186.0509321561 O=C(N=C=C=C=[OH+])NC(O)NCO Intermediate Fragment 
157 98.0236547881 O=C=C=C=[NH+]CO
158 115.0502038841 NC(O)[NH+]=C=C=CO
159 186.0509321561 NC(O)=NC(=O)N(C#CC=[OH+])CO Intermediate Fragment 
160 100.0393048521 OC=C=C=[NH+]CO
161 143.0451185041 NC(=O)[NH+](C#CC=O)CO
162 186.0509321561 NC(O)N(C#CC=[OH+])C(=O)N=CO Intermediate Fragment 
163 188.0665822201 OC1NC(O)N(C#CC=[OH+])C(O)N1
164 188.0665822201 OCNC(O)NC(O)N=C=C=C=[OH+] Intermediate Fragment 
165 228.0614968401 OC(=C=C=[OH+])C#CN1C(O)NC(O)NC1O
166 246.0720615241 OC(=C=C(O)N1C(O)NC(O)NC1O)C#C[OH2+] Intermediate Fragment 
167 172.0352820921 C=C([OH2+])N1C(=O)N=C(O)N=C1O
168 174.0509321561 C=C([OH2+])N1C(=O)N=C(O)NC1O
169 174.0509321561 CC([OH2+])=NC(=O)N=C(O)N=CO Intermediate Fragment 
170 174.0509321561 C=C([OH2+])N(C(N)=O)C(O)N=C=O Intermediate Fragment 
171 174.0509321561 C=C([OH2+])N(C=O)C(O)=NC(=N)O Intermediate Fragment 
172 176.0665822201 C=C([OH2+])N1C(=O)NC(O)NC1O
173 178.0822322841 C=C([OH2+])N1C(O)NC(O)NC1O
174 200.0301967121 O=C=C=C([OH2+])N1C(=O)N=C(O)NC1O
175 202.0458467761 O=C=C=C([OH2+])N1C(=O)NC(O)NC1O
176 202.0458467761 O=C(N=C([OH2+])C#CO)N=C(O)NCO Intermediate Fragment 
177 202.0458467761 N=C(O)NC(O)N(C=O)C([OH2+])=C=C=O Intermediate Fragment 
178 204.0614968401 O=C=C=C([OH2+])N1C(O)NC(O)NC1O
179 246.0720615241 OC=C=C(OC#C[OH2+])N1C(O)NC(O)NC1O Intermediate Fragment 
180 190.0822322841 OC1NC(O)N(C#CC[OH2+])C(O)N1
181 246.0720615241 C=C(OC(=C=O)C=[OH+])N1C(O)NC(O)NC1O Intermediate Fragment 
182 170.0196320281 [CH+]=C(O)N1C(=O)N=C(O)N=C1O
183 152.0090673441 [C+]#CN1C(=O)N=C(O)N=C1O
184 170.0196320281 [CH2+]C(O)=NC(=O)N=C(O)N=C=O Intermediate Fragment 
185 84.0080047241 [CH+]=C(O)N=C=O
186 127.0138183761 [CH2+]C(O)=NC(=O)N=C=O
187 246.0720615241 NC(O)NC(O)N(C=O)C1=CC(O)=C(C=[OH+])O1 Intermediate Fragment 
188 216.0614968401 NC(O)NC(O)[NH+]=C1C=C(O)C(=C=O)O1
189 218.0771469041 NC(O)NC(O)[NH+]=C1C=C(O)C(=CO)O1
190 175.0713332521 NC(O)[NH+]=C1C=C(O)C(CO)O1
191 132.0655196001 [NH2+]=C1CC(O)C(CO)O1
192 218.0771469041 NC(O)NC(O)[NH+]=C(O)C=C(O)C#CO Intermediate Fragment 
193 229.0455124281 O=CNC(O)[NH+](C=O)C1=CC(O)=C(C=O)O1
194 117.0294684401 O=C=[NH+]C(O)NC=O
195 119.0451185041 O=C=[NH+]C(O)NCO
196 186.0396987761 O=CC1=C(O)C=C([NH+](C=O)CO)O1
197 184.0240487121 O=CC1=C(O)C=C([NH+](C=O)C=O)O1
198 182.0083986481 O=C=[N+](C=O)C1=CC(O)=C(C=O)O1
199 158.0447841561 OC=C1OC(=[NH+]CO)C=C1O
200 203.0662478721 NC(O)[NH+](CO)C1=CC(O)=C(C=O)O1
201 201.0505978081 NC(O)[NH+](C=O)C1=CC(O)=C(C=O)O1
202 168.0291340921 O=CC1=CC=C([NH+](C=O)C=O)O1
203 186.0396987761 C=C(O)C(=C=O)OC[NH+](C=O)C=O Intermediate Fragment 
204 186.0396987761 O=C=C=C(OC#CO)[NH+](CO)CO Intermediate Fragment 
205 186.0396987761 O=C[NH+](CO)C(O)=C=C(O)C#CO Intermediate Fragment 
206 116.0342194721 C=C(O)[NH+](C=O)C=O
207 186.0396987761 O=CC(=O)C(O)=C=C[NH+](C=O)CO Intermediate Fragment 
208 160.0604342201 OC[NH+]=C1C=C(O)C(CO)O1
209 128.0342194721 [NH2+]=C1C=C(O)C(=CO)O1
210 130.0498695361 [NH2+]=C1C=C(O)C(CO)O1
211 160.0604342201 C=C(O)C(=CO)OC=[NH+]CO Intermediate Fragment 
212 160.0604342201 CC(=[NH+]CO)OC(C=O)=CO Intermediate Fragment 
213 160.0604342201 OC=COC(C=CO)=[NH+]CO Intermediate Fragment 
214 116.0342194721 OC#CC(O)=[NH+]CO
215 160.0604342201 OC=CC(O)=CC(O)=[NH+]CO Intermediate Fragment 
216 160.0604342201 OC[NH+]=C=C=C(O)C(O)CO Intermediate Fragment 
217 68.0130901041 C=C=[N+]=C=O
218 142.0498695361 OC=CC(O)=C=C=[NH+]CO
219 140.0342194721 O=C=C1C=CC(=[NH+]CO)O1
220 126.0185694081 [NH2+]=C1C=C(O)C(=C=O)O1
221 140.0342194721 C[NH+]=C1C=C(O)C(=C=O)O1
222 158.0447841561 C=C(O)C(=C=O)OC=[NH+]CO Intermediate Fragment 
223 158.0447841561 CC(=[NH+]CO)OC(=C=O)C=O Intermediate Fragment 
224 158.0447841561 OC#COC(C=CO)=[NH+]CO Intermediate Fragment 
225 158.0447841561 OC#CC(O)=CC(O)=[NH+]CO Intermediate Fragment 
226 158.0447841561 O=C(CO)C(O)=C=C=[NH+]CO Intermediate Fragment 
227 156.0291340921 O=C=C1OC(=[NH+]CO)C=C1O
228 69.0083390721 [NH+]#CN=C=O
229 71.0239891361 [NH+]#CN=CO
230 46.0287401681 [NH2+]=CO
231 246.0720615241 NC(=O)N(C1=CC(O)=C(C=[OH+])O1)C(O)NCO Intermediate Fragment 
232 203.0662478721 OC=C1OC(=[NH+]C(O)NCO)C=C1O
233 175.0713332521 NC(O)[NH+]=C(O)C=C(O)C=CO Intermediate Fragment 
234 173.0556831881 NC(O)[NH+]=C1C=C(O)C(=CO)O1
235 246.0720615241 OCNC(O)NC(O)N=C1C=C(O)C(=C=[OH+])O1 Intermediate Fragment 
