#In-silico ESI-MS/MS [M+H]+ Spectra
#PREDICTED BY CFM-ID 4.0.8
#SMILES=[C@H]1(C[C@@H](O[C@@H]1CO)n1ccc2n(c1=O)c(cn2)C(C(CCCCC)O)O)O
#InChiKey=YRZMQRFRRJHKLC-YVLDQAHJSA-N
energy0
248.13935 100.00 50 51 22 (39.357 1.6069 0.0084728)
266.14992 42.14 5 66 53 52 80 70 63 76 65 62 (17.087 0.11368 0.043375 0.0063513 0.005911 0.005332 0.0019468 0.0012329 0.0011614 0.00052187)
382.19726 62.08 0 157 192 212 237 215 147 154 236 244 249 213 214 (24.393 0.44971 0.29058 0.16824 0.051197 0.033612 0.026345 0.015342 0.0037528 0.0025273 0.00053573 0.0001559 1.5443e-05)
energy1
71.08553 3.33 35 (1.1956)
111.08044 2.71 114 (0.97262)
113.09609 8.01 112 113 (1.5788 1.2954)
136.05054 25.60 19 (9.1869)
164.04545 7.38 30 197 (2.5552 0.091568)
166.06110 3.28 20 (1.1759)
196.07167 7.91 37 (2.8371)
208.07167 7.59 42 126 (2.7198 0.0033391)
210.08732 6.61 43 (2.372)
224.10297 2.67 47 (0.95935)
234.08732 2.76 8 121 169 (0.91068 0.050199 0.030803)
248.13935 100.00 50 51 22 (29.894 5.9733 0.013293)
266.14992 23.10 5 53 66 52 80 70 62 76 65 63 (7.6009 0.37374 0.26352 0.022241 0.012959 0.0072544 0.0030765 0.0023128 0.0021623 0.001248)
292.16557 6.00 149 (2.1516)
308.16048 2.24 152 233 (0.80321 0.0011175)
318.14483 2.14 210 209 175 (0.39167 0.35216 0.024705)
320.16048 2.30 206 174 (0.75844 0.065363)
322.17613 2.73 203 173 184 187 186 (0.52184 0.41829 0.039403 0.00021169 0.00014915)
338.17105 3.22 204 207 (1.1286 0.025449)
346.17613 4.98 10 11 171 172 168 (1.1513 0.39304 0.11951 0.0844 0.038667)
energy2
45.03349 13.15 90 (1.6979)
55.01784 5.52 194 (0.71335)
57.06988 9.33 41 (1.2046)
59.04914 6.24 93 (0.80616)
67.05423 5.16 115 (0.66638)
71.08553 11.74 35 (1.516)
75.04406 19.65 125 (2.5372)
83.08553 17.09 132 (2.2074)
99.04406 8.48 87 86 92 (0.51379 0.49808 0.083542)
101.05971 6.86 101 102 104 (0.35671 0.33891 0.19014)
101.09609 5.11 15 (0.66051)
111.08044 13.17 114 (1.7014)
113.09609 49.38 112 113 (3.8149 2.562)
115.11174 28.52 110 111 (2.5416 1.1416)
127.07536 7.97 23 (1.029)
129.09101 10.08 18 (1.302)
131.10666 35.35 7 (4.5654)
136.05054 24.17 19 (3.1208)
155.10666 5.15 68 (0.66563)
164.04545 10.93 30 197 (1.2174 0.19386)
166.06110 55.09 20 (7.1145)
194.05602 10.80 36 198 (0.85085 0.54331)
196.07167 12.57 37 (1.6227)
208.07167 6.13 126 42 (0.4483 0.34375)
222.08732 5.89 46 181 (0.68979 0.070671)
236.10297 5.25 48 170 (0.5034 0.17506)
248.13935 100.00 50 51 22 (11.702 0.95619 0.25534)
250.15500 8.26 21 (1.0661)
266.14992 72.07 5 76 53 70 66 63 80 62 65 52 (4.8401 1.3637 1.2697 1.0403 0.21515 0.19392 0.11712 0.11011 0.081472 0.075791)
294.14483 5.53 200 156 (0.50185 0.21215)

0 382.1972620361 CCCCCC(O)C(O)c1cnc2ccn(C3CC(O)C(C[OH2+])O3)c(=O)n12
1 350.1710472881 CCCCCC(O)=C(O)C1=CNC2C=CN(C3C=C(O)CO3)C(=[OH+])N12
2 352.1866973521 CCCCCC(O)C(O)C1=CNC2C=CN(C3C=C(O)CO3)C(=[OH+])N12
3 364.1866973521 C=C1OC(N2C=CC3NC=C(C(O)C(O)CCCCC)N3C2=[OH+])C=C1O
4 268.1655679841 CCCCCC(O)C(O)C1CNC2=CC=NC(=[OH+])N21
5 266.1499179201 CCCCCC(O)C(O)C1=CNC2=CC=NC(=[OH+])N21
6 133.1223062041 CCCCCC([OH2+])CO
7 131.1066561401 CCCCCC([OH2+])=CO
8 234.0873176641 C=C1OC(N2C=CC3NC=CN3C2=[OH+])C=C1O
9 264.0978823481 C=C1OC(N2C=CC3NC=C(CO)N3C2=[OH+])C=C1O
10 346.1761326681 C=C1OC(N2C=CC3NC=C(C(O)=CCCCCC)N3C2=[OH+])C=C1O
11 346.1761326681 C=C1C=CC(N2C=CC3NC=C(C(O)=C(O)CCCCC)N3C2=[OH+])O1
12 364.1866973521 C=C(CO)OC(=C)N1C=CC2NC=C(C(O)=C(O)CCCCC)N2C1=[OH+] Intermediate Fragment 
13 364.1866973521 C#COC(=C=CO)N1C=CC2NCC(C(O)C(O)CCCCC)N2C1=[OH+] Intermediate Fragment 
14 272.1968681121 CCCCCC(O)C(O)C1CNC2CC=NC([OH2+])N21
15 101.0960914561 CCCCC=C[OH2+]
16 254.1863034281 CCCCCCC(O)C1CNC2=CC=NC([OH2+])N21
17 270.1812180481 CCCCCC(O)C(O)C1CNC2=CC=NC([OH2+])N21
18 129.0910060761 CCCC=CC([OH2+])=CO
19 136.0505382321 [OH+]=C1N=CC=C2NC=CN12
20 166.0611029161 OCC1=CNC2=CC=NC(=[OH+])N12
21 250.1550033001 CCCCCCC(O)C1=CNC2=CC=NC(=[OH+])N21
22 248.1393532361 CCCC=CC([OH2+])=C(O)C1=CNC2=CC=NCN21
23 127.0753560121 CCCC#CC([OH2+])=CO
24 125.0597059481 CC=CC#CC([OH2+])=CO
25 138.0661882961 [OH+]=C1N=CC=C2NCCN12
26 140.0818383601 [OH2+]C1N=CC=C2NCCN21
27 142.0974884241 [OH2+]C1N=CCC2NCCN12
28 103.1117415201 CCCCCC[OH2+]
29 99.0804413921 CCCCC#C[OH2+]
30 164.0454528521 O=CC1=CNC2=CC=NC(=[OH+])N12
31 168.0767529801 OCC1CNC2=CC=NC(=[OH+])N21
32 170.0924030441 OCC1CNC2=CC=NC([OH2+])N21
33 172.1080531081 OCC1CNC2CC=NC([OH2+])N12
34 73.1011768361 CCCC[CH4+]
35 71.0855267721 CCCC=[CH3+]
36 194.0560175361 OC=C(O)C1=CNC2=CC=NC(=[OH+])N21
37 196.0716676001 OCC(O)C1=CNC2=CC=NC(=[OH+])N21
38 198.0873176641 OCC(O)C1CNC2=CC=NC(=[OH+])N21
39 200.1029677281 OCC(O)C1CNC2=CC=NC([OH2+])N21
40 202.1186177921 OCC(O)C1CNC2CC=NC([OH2+])N21
41 57.0698767081 CCC=[CH3+]
42 208.0716676001 CC(O)=C(O)C1=CNC2=CC=NC(=[OH+])N21
43 210.0873176641 CC(O)C(O)C1=CNC2=CC=NC(=[OH+])N21
44 214.1186177921 CC(O)C(O)C1CNC2=CC=NC([OH2+])N21
45 45.0698767081 CC[CH4+]
46 222.0873176641 CCC(O)=C(O)C1=CNC2=CC=NC(=[OH+])N21
47 224.1029677281 CCC(O)C(O)C1=CNC2=CC=NC(=[OH+])N21
48 236.1029677281 CCCC(O)=C(O)C1=CNC2=CC=NC(=[OH+])N21
49 250.1186177921 CCCCC(O)=C(O)C1=CNC2=CC=NC(=[OH+])N21
50 248.1393532361 CCCCCC=C(O)C1=CNC2=CC=NC(=[OH+])N21
51 248.1393532361 CCCCCC(O)=CC1=CNC2=CC=NC(=[OH+])N12
52 266.1499179201 CCCCCC(O)C(O)C1=CNC(=C=C=N)N1C=[OH+] Intermediate Fragment 
53 266.1499179201 CCCCCC(O)C(O)C1=NC(=C=C=NC=[OH+])NC1 Intermediate Fragment 
54 223.1441042681 C#CC1=NC(C(O)C([OH2+])CCCCC)=CN1
55 221.1284542041 C#CC1=NC(C(O)=C([OH2+])CCCCC)=CN1
56 219.1128041401 C#CC1=NC(C(O)=C([OH2+])C=CCCC)=CN1
57 197.1284542041 CCCCCC([OH2+])=C(O)C1=CNC=N1
58 195.1128041401 CCCC=CC([OH2+])=C(O)C1=CNC=N1
59 191.0815040121 CC=CC#CC([OH2+])=C(O)C1=CNC=N1
60 238.1550033001 CCCCCC(O)C(O)C1=NC(=CC#[NH+])NC1
61 264.1342678561 CCCCCC(O)C(O)C1=NC(=C=C=[NH+]C=O)N=C1
62 266.1499179201 C=C=NC(=[OH+])N1CNC=C1C(O)=C(O)CCCCC Intermediate Fragment 
63 266.1499179201 C=NC(=[OH+])N1C(=C)NC=C1C(O)=C(O)CCCCC Intermediate Fragment 
64 211.1441042681 C=C1N=CC(C(O)C([OH2+])CCCCC)=N1
65 266.1499179201 C=C=C1NC=C(C(O)=C(O)CCCCC)N1C(N)=[OH+] Intermediate Fragment 
66 266.1499179201 CCCCCC(O)C(O)C=C=NC1=CC=NC([OH2+])=N1 Intermediate Fragment 
67 124.0505382321 C=[NH+]C1=CC=NC(O)=N1
68 155.1066561401 C#CC(O)=C([OH2+])CCCCC
69 170.1175551721 CCCCCC(O)=C(O)C#C[NH3+]
70 266.1499179201 CCCCCC(O)C(O)C(=C=N)N1C=CC=NC1=[OH+] Intermediate Fragment 
71 168.1019051081 CCCC=CC(O)=C(O)C#C[NH3+]
72 166.0862550441 CCCC#CC(O)=C(O)C#C[NH3+]
73 97.0396392001 [OH2+]C1=NC=CC=N1
74 239.1390188881 CCCCCC(O)C(O)=CN1C=CC=NC1=[OH+]
75 249.1233688241 C=C(C(O)=C(O)C=CCCC)N1C=CC=NC1=[OH+]
76 266.1499179201 C=C(C(O)=C(O)CCCCC)N1C(=[OH+])N=CC=C1N Intermediate Fragment 
77 153.0910060761 C#CC(O)=C([OH2+])C=CCCC
78 151.0753560121 C#CC(O)=C([OH2+])C#CCCC
79 264.1342678561 C=C(C(O)=C(O)C=CCCC)N1C(=O)N=CC=C1[NH3+]
80 266.1499179201 C=NC1=CC=NC(=[OH+])N1C=C(O)C(O)CCCCC Intermediate Fragment 
81 246.1237031721 CCCCC=C=C(O)C1=CNC2=CC=NC(=[OH+])N21
82 115.0389705041 OC1C=COC1=C[OH2+]
83 117.0546205681 OC1C=COC1C[OH2+]
84 87.0440558841 [OH2+]C1C=COC1
85 89.0597059481 [OH2+]C1CCOC1
86 99.0440558841 C=C1OCC=C1[OH2+]
87 99.0440558841 [OH2+]C=C1C=CCO1
88 117.0546205681 C=COC(=C[OH2+])CO Intermediate Fragment 
89 91.0389705041 OCC(=[OH+])CO
90 45.0334912001 C=C[OH2+]
91 117.0546205681 C=C=C(O)C(O)C[OH2+] Intermediate Fragment 
92 99.0440558841 C=C=C(O)C=C[OH2+]
93 59.0491412641 CC=C[OH2+]
94 57.0334912001 CC#C[OH2+]
95 61.0284058201 OCC=[OH+]
96 117.0546205681 OC=C=C(O)CC[OH2+] Intermediate Fragment 
97 43.0178411361 C#C[OH2+]
98 89.0597059481 C=C(O)CC[OH2+]
99 117.0546205681 OC=C=COCC[OH2+] Intermediate Fragment 
100 119.0702706321 OC1CCOC1C[OH2+]
101 101.0597059481 CC1OCC=C1[OH2+]
102 101.0597059481 [OH2+]CC1C=CCO1
103 119.0702706321 OCC=C(O)CC[OH2+] Intermediate Fragment 
104 101.0597059481 C=C=C(O)CC[OH2+]
105 63.0440558841 OCC[OH2+]
106 59.0855267721 CCC[CH4+]
107 43.0542266441 CC=[CH3+]
108 91.0753560121 CCC([OH2+])CO
109 103.0753560121 CCCC([OH2+])=CO
110 115.1117415201 CCCCCC=C[OH2+]
111 115.1117415201 C=C([OH2+])CCCCC
112 113.0960914561 CCCCCC#C[OH2+]
113 113.0960914561 C=C([OH2+])C=CCCC
114 111.0804413921 CCCC=CC#C[OH2+]
115 67.0542266441 [CH2+]#CC=CC
116 250.0822322841 O=C1N(C2C=C(O)C(=C=[OH+])O2)C=CC2NCCN12
117 232.0716676001 C=C1OC(N2C=CC3=NC=CN3C2=[OH+])C=C1O
118 250.0822322841 O=C(C=[OH+])C(O)=C=CN1C=CC2NCCN2C1=O Intermediate Fragment 
119 162.0661882961 C#CN1C=CC2NC=CN2C1=[OH+]
120 252.0978823481 OC1=CC(N2C=CC3NCCN3C2O)OC1=C=[OH+]
121 234.0873176641 O=C1N(C2C=CC(=C=[OH+])O2)C=CC2NCCN12
122 252.0978823481 O=C(C=[OH+])C(O)=C=CN1C=CC2NCCN2C1O Intermediate Fragment 
123 252.0978823481 OC(=C=C(O)N1C=CC2NCCN2C1O)C#C[OH2+] Intermediate Fragment 
124 178.0611029161 C=C([OH2+])N1C=CC2=NC=CN2C1=O
125 75.0440558841 OCC=C[OH2+]
126 208.0716676001 O=C1N(C(=[OH+])C#CO)C=CC2NCCN12
127 252.0978823481 OCN1CCNC1C=CN=C1C=C(O)C(=C=[OH+])O1 Intermediate Fragment 
128 254.1135324121 OC1=CC(N2CCC3NCCN3C2O)OC1=C=[OH+]
129 256.1291824761 OC1=CC(N2CCC3NCCN3C2O)OC1=C[OH2+]
130 258.1448325401 OC1=CC(N2CCC3NCCN3C2O)OC1C[OH2+]
131 85.1011768361 CCCCC=[CH3+]
132 83.0855267721 [CH2+]#CCCCC
133 280.0927969681 O=C1N(C2C=C(O)C(=C=[OH+])O2)C=CC2NCC(CO)N12
134 282.1084470321 OCC1CNC2C=CN(C3C=C(O)C(=C=[OH+])O3)C(O)N12
135 284.1240970961 OCC1CNC2CCN(C3C=C(O)C(=C=[OH+])O3)C(O)N12
136 286.1397471601 OCC1CNC2CCN(C3C=C(O)C(=C[OH2+])O3)C(O)N12
137 288.1553972241 OCC1CNC2CCN(C3C=C(O)C(C[OH2+])O3)C(O)N12
138 310.1033616521 O=C1N(C2C=C(O)C(=C=[OH+])O2)C=CC2NCC(C(O)CO)N12
139 312.1190117161 OCC(O)C1CNC2C=CN(C3C=C(O)C(=C=[OH+])O3)C(O)N21
140 314.1346617801 OCC(O)C1CNC2CCN(C3C=C(O)C(=C=[OH+])O3)C(O)N21
141 316.1503118441 OCC(O)C1CNC2CCN(C3C=C(O)C(=C[OH2+])O3)C(O)N21
142 318.1659619081 OCC(O)C1CNC2CCN(C3C=C(O)C(C[OH2+])O3)C(O)N21
143 340.1503118441 CCC(O)C(O)C1CNC2C=CN(C3C=C(O)C(=C=[OH+])O3)C(O)N21
144 364.1866973521 CCCCCCC(O)C1CNC2C=CN(C3C=C(O)C(=C=[OH+])O3)C(=O)N21
145 364.1866973521 CCCCCCC(O)C1CNC2C=CN(C=C=C(O)C(=O)C=[OH+])C(=O)N21 Intermediate Fragment 
146 364.1866973521 CCCCCC(O)CC1CNC2C=CN(C3C=C(O)C(=C=[OH+])O3)C(=O)N12
147 382.1972620361 C=C(OC(=C=[OH+])CO)N1C=CC2NCC(C(O)C(O)CCCCC)N2C1=O Intermediate Fragment 
148 290.1499179201 C#CN1C=CC2NC=C(C(O)=C(O)CCCCC)N2C1=[OH+]
149 292.1655679841 C#CN1C=CC2NC=C(C(O)C(O)CCCCC)N2C1=[OH+]
150 294.1812180481 C#CN1C=CC2NCC(C(O)C(O)CCCCC)N2C1=[OH+]
151 296.1968681121 C#CN1C=CC2NCC(C(O)C(O)CCCCC)N2C1[OH2+]
152 308.1604826041 C=C([OH2+])N1C=CC2NC=C(C(O)=C(O)CCCCC)N2C1=O
153 310.1761326681 C=C([OH2+])N1C=CC2NC=C(C(O)C(O)CCCCC)N2C1=O
154 382.1972620361 C=C(O)C(=C=[OH+])OCN1C=CC2NCC(C(O)C(O)CCCCC)N2C1=O Intermediate Fragment 
155 296.1604826041 CCCCCC(O)C(O)C1=CNC2C=CN(C=[OH+])C(=O)N12
156 294.1448325401 CCCCCC(O)=C(O)C1=CNC2C=CN(C=[OH+])C(=O)N12
157 382.1972620361 CCCCCC(O)C(O)C1CNC2C=CN(C=C=C(O)C(=O)C=[OH+])C(O)N21 Intermediate Fragment 
158 298.2125181761 C#CN1CCC2NCC(C(O)C(O)CCCCC)N2C1[OH2+]
159 89.0233204401 O=CC(=[OH+])CO
160 73.0284058201 OCC#C[OH2+]
161 93.0546205681 OCC([OH2+])CO
162 284.1968681121 CCCCCC(O)C(O)C1CNC2C=CN(C)C(=[OH+])N21
163 282.1812180481 CCCCCC(O)C(O)C1=CNC2C=CN(C)C(=[OH+])N12
164 280.1655679841 CCCCCC(O)=C(O)C1=CNC2C=CN(C)C(=[OH+])N12
165 278.1499179201 CCCC=CC(O)=C(O)C1=CNC2C=CN(C)C(=[OH+])N12
166 276.1342678561 CCCC#CC(O)=C(O)C1=CNC2C=CN(C)C(=[OH+])N12
167 364.1866973521 CCCCCC(O)C(O)C1CNC2C=CN(C=C=C(O)C#C[OH2+])C(=O)N21
168 346.1761326681 C#CC(O)=C=CN1C=CC2NC=C(C(O)C(O)CCCCC)N2C1=[OH+]
169 234.0873176641 O=C1N(C=C=C(O)C#C[OH2+])C=CC2NCCN12
170 236.1029677281 OC(=C=CN1C=CC2NCCN2C1O)C#C[OH2+]
171 346.1761326681 CCCCCCC(O)C1=CNC2C=CN(C=C=C(O)C#C[OH2+])C(=O)N12
172 346.1761326681 CCCCCC(O)C(O)C1=CNC2C=CN(CC#CC#C[OH2+])C(=O)N12
173 322.1761326681 CCCCCC(O)C(O)C1=CNC2C=CN(CC#CO)C(=[OH+])N12
174 320.1604826041 CCCCCC(O)=C(O)C1=CNC2C=CN(CC#CO)C(=[OH+])N12
175 318.1448325401 CCCC=CC(O)=C(O)C1=CNC2C=CN(CC#CO)C(=[OH+])N12
176 326.2074327961 CCCCCC(O)C(O)C1CNC2C=CN(CC#CO)C([OH2+])N21
177 324.1917827321 CCCCCC(O)C(O)C1CNC2C=CN(CC#CO)C(=[OH+])N21
178 192.0767529801 OC#CCN1C=CC2NC=CN2C1=[OH+]
179 306.1812180481 CCCCCCC(O)C1=CNC2C=CN(CC#CO)C(=[OH+])N12
180 190.0611029161 OC#CCN1C=CC2=NC=CN2C1=[OH+]
181 222.0873176641 OC#CCN1C=CC2NC=C(CO)N2C1=[OH+]
182 304.1655679841 CCCCCC=C(O)C1=CNC2C=CN(CC#CO)C(=[OH+])N12
183 304.1655679841 C#CCN1C=CC2NC=C(C(O)=C(O)CCCCC)N2C1=[OH+]
184 322.1761326681 CCCCCC(O)C(O)C1=NC(=C=CN(C=[OH+])CC#CO)NC1 Intermediate Fragment 
185 294.1812180481 CCCCCC(O)C(O)C1CNC(C#C[NH+]=CC#CO)N1
186 322.1761326681 CCCCCC(O)C(O)C(=C=N)N1CC=CN(CC#CO)C1=[OH+] Intermediate Fragment 
187 322.1761326681 C=C(C(O)=C(O)CCCCC)N1C(=[OH+])N(CC#CO)C=CC1N Intermediate Fragment 
188 302.1499179201 CCCCC=C=C(O)C1=CNC2C=CN(CC#CO)C(=[OH+])N12
189 59.0127557561 O=C=C[OH2+]
190 41.0021910721 [C+]#CO
191 380.1816119721 CCCCCC(O)C(O)C1CNC2C=CN(C=C=C(O)C(=[OH+])C=O)C(=O)N21
192 382.1972620361 CCCCCC(O)C(O)C1CNC2C=CN(C(O)=C=C(O)C#C[OH2+])C(O)N21 Intermediate Fragment 
193 71.0127557561 O=CC#C[OH2+]
194 55.0178411361 C#CC=[OH+]
195 77.0597059481 OCCC[OH2+]
196 298.1761326681 CCCCCC(O)C(O)C1CNC2C=CN(C=[OH+])C(=O)N21
197 164.0454528521 O=C1N(C=[OH+])C=CC2=NC=CN12
198 194.0560175361 O=CC1=CNC2C=CN(C=[OH+])C(=O)N12
199 276.1342678561 CCCCC=C=C(O)C1=CNC2C=CN(C=[OH+])C(=O)N12
200 294.1448325401 CCCCCC(O)C(O)C1=NC(=C=CN(C=O)C=[OH+])N=C1 Intermediate Fragment 
201 292.1291824761 CCCC=CC(O)=C(O)C1=CNC2C=CN(C=[OH+])C(=O)N12
202 340.1866973521 CCCCCC(O)C(O)C1CNC2C=CN(C(=[OH+])C#CO)C(O)N21
203 322.1761326681 C#CC(=[OH+])N1C=CC2NCC(C(O)C(O)CCCCC)N2C1=O
204 338.1710472881 CCCCCC(O)C(O)C1CNC2C=CN(C(=[OH+])C#CO)C(=O)N21
205 206.0560175361 O=C1N(C(=[OH+])C#CO)C=CC2NC=CN12
206 320.1604826041 C#CC(=[OH+])N1C=CC2NC=C(C(O)C(O)CCCCC)N2C1=O
207 338.1710472881 CCCCCC(O)C(O)C1CNC(=C=CN(C=O)C(=[OH+])C#CO)N1 Intermediate Fragment 
208 336.1553972241 CCCCCC(O)C(O)C1=CNC2C=CN(C(=[OH+])C#CO)C(=O)N12
209 318.1448325401 CCCCCC=C(O)C1=CNC2C=CN(C(=[OH+])C#CO)C(=O)N12
210 318.1448325401 C#CC(=[OH+])N1C=CC2NC=C(C(O)=C(O)CCCCC)N2C1=O
211 47.0491412641 CC[OH2+]
212 382.1972620361 CCCCCC(O)C(O)C1CNC2C=CN(C(=C=CO)OC#C[OH2+])C(O)N21 Intermediate Fragment 
213 382.1972620361 C=C1NCC(C(O)C(O)CCCCC)N1C(=O)N(C)C1C=C(O)C(=C=[OH+])O1 Intermediate Fragment 
214 382.1972620361 C=CN(C(=O)N1CNCC1C(O)C(O)CCCCC)C1C=C(O)C(=C=[OH+])O1 Intermediate Fragment 
215 382.1972620361 CCCCCC(O)C(O)C1CNC(=C=CN(CO)C2C=C(O)C(=C=[OH+])O2)N1 Intermediate Fragment 
216 229.1910544601 C=CC1NCC(C(O)C([OH2+])CCCCC)N1
217 227.1754043961 C#CC1NCC(C(O)C([OH2+])CCCCC)N1
218 225.1597543321 C#CC1=NC(C(O)C([OH2+])CCCCC)CN1
219 174.0760842841 C[NH+](CO)C1C=C(O)C(=CO)O1
220 186.0760842841 CC[NH+](CO)C1C=C(O)C(=C=O)O1
221 70.0287401681 C=C=[NH+]C=O
222 186.0760842841 CC[NH+](CO)C(O)=C=C(O)C#CO Intermediate Fragment 
223 188.0917343481 CC[NH+](CO)C1C=C(O)C(=CO)O1
224 354.2023474161 CCCCCC(O)C(O)C1CNC(CC[NH+]=C2C=C(O)C(=C=O)O2)N1
225 336.1917827321 C=C1OC(=[NH+]C#CC2NCC(C(O)C(O)CCCCC)N2)C=C1O
226 336.1917827321 CCCCCC(O)C(O)C1CNC(C=C[NH+]=C2C=CC(=C=O)O2)N1
227 354.2023474161 C=C(O)C(=C=O)OC=[NH+]C=CC1NCC(C(O)C(O)CCCCC)N1 Intermediate Fragment 
228 354.2023474161 CCCCCC(O)C(O)C1CNC(CC[NH+]=C=C=C(O)C(=O)C=O)N1 Intermediate Fragment 
229 354.2023474161 CCCCCC(O)C(O)C1CNC(CC=[NH+]C(O)=C=C(O)C#CO)N1 Intermediate Fragment 
230 282.1812180481 C=C(O)[NH+]=C=C=C1NCC(C(O)C(O)CCCCC)N1
231 280.1655679841 C=C(O)[NH+]=C=C=C1N=C(C(O)C(O)CCCCC)CN1
232 336.1917827321 CCCCCC(O)C(O)C1CNC(C=C[NH+]=C=C=C(O)C#CO)N1
233 308.1604826041 CCCCCC(O)C(O)C1CNC(=C=C=[NH+]C(=O)C#CO)N1
234 354.2023474161 CCCCCC(O)C(O)C1CNC(CC=[NH+]C(=C=CO)OC#CO)N1 Intermediate Fragment 
235 352.1866973521 CCCCCC(O)C(O)C1CNC(C=C[NH+]=C2C=C(O)C(=C=O)O2)N1
236 382.1972620361 CCCCCC(O)C(O)C1CNC(C=CN=C2C=C(O)C(=C=[OH+])O2)N1CO Intermediate Fragment 
237 382.1972620361 CCCCCC(O)C(O)CCNC1=NC(O)N(C2C=C(O)C(=C=[OH+])O2)C=C1 Intermediate Fragment 
238 240.0978823481 C[NH2+]C1C=CN(C2C=C(O)C(=C=O)O2)C(O)N1
239 238.0822322841 C[NH2+]C1=NC(O)N(C2C=C(O)C(=C=O)O2)C=C1
240 122.0348881681 C#[N+]C1=CC=NC(O)=N1
241 211.0713332521 OC1=CC(N2C=CCNC2O)OC1=C=[OH+]
242 211.0713332521 O=C(C=[OH+])C(O)=C=CN1C=CCNC1O Intermediate Fragment 
243 209.0556831881 OC1=CC(N2C=CC=NC2O)OC1=C=[OH+]
244 382.1972620361 CCCCCC(O)C(O)C(CN)N1CC=CN(C2C=C(O)C(=C=[OH+])O2)C1=O Intermediate Fragment 
245 174.1488553001 CCCCCC(O)C(O)C=C[NH3+]
246 172.1332052361 CCCCCC(O)C(O)C#C[NH3+]
247 355.1863630041 CCCCCC(O)C(O)CN1CC=CN(C2C=C(O)C(=C=[OH+])O2)C1O
248 365.1707129401 C=C(C(O)C(O)CCCCC)N1CC=CN(C2C=C(O)C(=C=[OH+])O2)C1=O
249 382.1972620361 CCCCCC(O)C(O)CN1C(=O)N(C2C=C(O)C(=C=[OH+])O2)C=CC1NC Intermediate Fragment 
