#In-silico ESI-MS/MS [M+H]+ Spectra
#PREDICTED BY CFM-ID 4.0.8
#InChI=1S/C10H13N5O5/c11-9-13-7-6(8(18)14-9)12-10(19)15(7)5-1-3(17)4(2-16)20-5/h3-5,16-17H,1-2H2,(H,12,19)(H3,11,13,14,18)/t3-,4-,5-/m1/s1
#InChiKey=HCAJQHYUCKICQH-UOWFLXDJSA-N
energy0
168.05160 34.53 3 58 52 50 40 45 32 60 55 134 (23.917 0.063479 0.058143 0.04377 0.013758 0.011471 0.010182 0.0070159 0.001583 7.8106e-08)
284.09894 100.00 0 110 154 80 97 173 182 174 205 207 188 177 184 176 197 (68.756 0.54811 0.19189 0.14185 0.0668 0.06522 0.030581 0.024886 0.020489 0.0084644 0.0057131 0.0053496 0.0035863 0.0034916 0.0012661)
energy1
150.04104 7.37 29 31 (3.1669 1.475)
168.05160 100.00 3 60 55 52 58 32 40 45 50 134 (56.936 1.7305 0.96524 0.92654 0.83922 0.64958 0.34517 0.29235 0.2637 0.00012733)
266.08838 11.08 4 14 151 10 22 17 18 79 19 24 11 16 74 23 152 77 76 (5.6025 0.47666 0.31401 0.12447 0.098086 0.06692 0.064198 0.047514 0.042726 0.04042 0.035285 0.035188 0.013658 0.0081066 0.0072762 0.00052175 0.00014558)
284.09894 8.63 0 154 80 97 110 173 182 184 205 177 188 174 207 197 176 (4.7295 0.24994 0.16838 0.10344 0.038148 0.031073 0.028562 0.027248 0.018124 0.012061 0.0097535 0.0065471 0.0063208 0.0034522 0.0023678)
energy2
43.01784 3.40 112 (0.91757)
45.03349 4.53 67 (1.2194)
55.01784 3.92 113 (1.0554)
57.03349 20.72 72 (5.5843)
61.02841 4.27 158 (1.15)
73.02841 8.11 161 111 (2.0746 0.11115)
98.03489 8.73 46 (2.3526)
109.00325 5.72 34 (1.5403)
112.05054 3.75 126 (1.0097)
123.03014 9.99 41 (2.6931)
125.04579 19.63 189 191 56 42 (1.8023 1.3618 1.2163 0.91033)
126.02980 4.34 35 43 135 (0.70576 0.41041 0.052693)
140.05669 8.35 57 33 (2.1649 0.085728)
150.04104 30.42 31 29 (5.2127 2.9843)
151.02505 7.89 30 59 38 48 137 (1.525 0.36449 0.13829 0.073142 0.024611)
153.04070 3.47 123 129 131 (0.52921 0.36342 0.043016)
166.03595 6.35 7 39 61 (1.5118 0.10125 0.098532)
168.05160 100.00 3 52 58 60 32 45 40 55 50 134 (6.4753 6.4 3.4844 2.3907 2.2275 2.0905 1.4802 1.4483 0.94711 0.0039803)
192.05160 4.35 88 (1.172)
194.06725 15.33 94 84 (3.04 1.0907)
196.04652 6.17 133 139 140 103 138 141 (0.46408 0.41134 0.35145 0.29233 0.072775 0.071581)
196.08290 6.92 95 (1.8652)
208.08290 7.22 107 (1.9454)
228.10912 5.20 109 (1.4017)

0 284.0989449681 [NH2+]=c1nc(O)c2nc(O)n(C3CC(O)C(CO)O3)c2[nH]1
1 254.0883802841 [NH2+]=C1N=C(O)C2=C(N1)N(C1C=C(O)CO1)C(O)N2
2 252.0727302201 [NH2+]=C1N=C(O)C2=C(N1)N(C1C=C(O)CO1)C(O)=N2
3 168.0516008521 [NH2+]=C1N=C(O)C2=NC(O)N=C2N1
4 266.0883802841 C=C1OC(N2C3=C(NC2O)C(O)=NC(=[NH2+])N3)C=C1O
5 248.0778156001 C=C1C=CC(N2C(O)=NC3=C2NC(=[NH2+])N=C3O)O1
6 170.0672509161 [NH3+]C1N=C(O)C2=NC(O)N=C2N1
7 166.0359507881 [NH2+]=C1N=C(O)C2=NC(=O)N=C2N1
8 99.0440558841 C=C1OC=CC1[OH2+]
9 249.0618311881 C=C1OC(N2C(O)=NC3=C(O)N=CN=C32)C=C1[OH2+]
10 266.0883802841 C=C(C=O)OC(=C)N1C2=C(NC1O)C(O)=NC(=[NH2+])N2 Intermediate Fragment 
11 266.0883802841 C#COC(=C=C=O)N1C2=C(NC1O)C(O)NC([NH3+])N2 Intermediate Fragment 
12 240.0727302201 [NH3+]C1N=C(O)C2=C(N1)N(C(=O)C#CO)C(O)N2
13 224.0778156001 [NH2+]=C1N=C(O)C2=C(N1)N(CC#CO)C(O)N2
14 266.0883802841 C#CC(O)=C=C(O)N1C2=C(NC1O)C(O)=NC([NH3+])N2 Intermediate Fragment 
15 210.0621655361 C=C(O)N1C2=NC(=[NH2+])N=C(O)C2=NC1O
16 266.0883802841 C=C(O)C(O)=C=CN1C2=C(NC1O)C(O)=NC(=[NH2+])N2 Intermediate Fragment 
17 266.0883802841 C=C1OC(N2C(O)=NC(C=O)=C2NC(N)=[NH2+])C=C1O Intermediate Fragment 
18 266.0883802841 C=C1OC(N2C=C(C(O)=NC(N)=[NH2+])N=C2O)C=C1O Intermediate Fragment 
19 266.0883802841 C=C1OC(N2C(NC(=[NH2+])N=C=O)=CNC2O)C=C1O Intermediate Fragment 
20 198.0873176641 C=C1OC(N2C([NH3+])CNC2O)=CC1=O
21 223.0825666321 C=C1OC(N2C(NC#[NH+])=CNC2O)C=C1O
22 266.0883802841 C=C1OC(N(C=O)C2=C(N)C(O)=NC(=[NH2+])N2)C=C1O Intermediate Fragment 
23 266.0883802841 C=C1OC(N(C(=N)O)C2=CC(O)=NC(=[NH2+])N2)C=C1O Intermediate Fragment 
24 266.0883802841 C=C1OC(=NC(O)NC2=CNC(=[NH2+])N=C2O)C=C1O Intermediate Fragment 
25 174.0985510441 [NH3+]C1NC(O)C2=NC(O)NC2N1
26 174.0985510441 NC(O)NC1=CC(O)=NC([NH3+])N1 Intermediate Fragment 
27 174.0985510441 NC(O)NC1=CNC([NH3+])N=C1O Intermediate Fragment 
28 172.0829009801 [NH3+]C1NC2=NC(O)N=C2C(O)N1
29 150.0410361681 [NH2+]=C1N=CC2=NC(=O)N=C2N1
30 151.0250517561 OC1=NC2=NC=NC(=[OH+])C2=N1
31 150.0410361681 [NH2+]=C1N=C(O)C2=NC=NC2=N1
32 168.0516008521 N=C(N)NC1=C(C#[O+])N=C(O)N1 Intermediate Fragment 
33 140.0566862321 NC(=[NH2+])N=C1C=NC(O)=N1
34 109.0032536921 O=C1N=CC(C#[O+])=N1
35 126.0298027881 [NH2+]=C1N=C(O)N=C1C=O
36 43.0290745161 [NH+]#CN
37 45.0447245801 NC=[NH2+]
38 151.0250517561 N#CNC1=C(C#[O+])N=C(O)N1
39 166.0359507881 N=C(N)N=C1N=C(O)N=C1C#[O+]
40 168.0516008521 N=C(O)C1=C(NC#[NH+])NC(O)=N1 Intermediate Fragment 
41 123.0301371361 [NH+]#CN=C1C=NC(O)=N1
42 125.0457872001 [NH+]#CN=C1C=NC(O)N1
43 126.0298027881 [NH2+]=C(O)C1=NC(=O)N=C1
44 141.0407018201 N=C(O)C1=NC(O)=NC1=[NH2+]
45 168.0516008521 [NH+]#CN=C(O)C1=C(N)NC(O)=N1 Intermediate Fragment 
46 98.0348881681 [NH2+]=C1C=NC(O)=N1
47 100.0505382321 [NH2+]=C1C=NC(O)N1
48 151.0250517561 [NH+]#CN=C(O)C1=NC(=O)N=C1
49 124.0141527241 N=C1N=C(O)N=C1C#[O+]
50 168.0516008521 NC(=[NH2+])N=C(O)C1=NC(=O)N=C1 Intermediate Fragment 
51 83.0239891361 [OH+]=C1N=CC=N1
52 168.0516008521 [NH2+]=C(N=C=O)NC1=CN=C(O)N1 Intermediate Fragment 
53 86.0348881681 NC(=[NH2+])N=C=O
54 71.0239891361 [NH2+]=CN=C=O
55 168.0516008521 NC1=C(N=C=O)NC(=[NH2+])N=C1O Intermediate Fragment 
56 125.0457872001 N=C1C=NC(=[NH2+])N=C1O
57 140.0566862321 N=C1C(N)=NC(=[NH2+])N=C1O
58 168.0516008521 N=C(O)N=C1C=NC(=[NH2+])N=C1O Intermediate Fragment 
59 151.0250517561 N=C1N=CC(=[N+]=C=O)C(O)=N1
60 168.0516008521 NC1=C(N=C=O)C(O)=NC(=[NH2+])N1 Intermediate Fragment 
61 166.0359507881 N=C1N=C(N)C(=[N+]=C=O)C(O)=N1
62 115.0389705041 OC1C=COC1=C[OH2+]
63 117.0546205681 OC1C=COC1C[OH2+]
64 87.0440558841 [OH2+]C1C=COC1
65 99.0440558841 [OH2+]C=C1C=CCO1
66 117.0546205681 C=COC(=C[OH2+])CO Intermediate Fragment 
67 45.0334912001 C=C[OH2+]
68 117.0546205681 OC=C=COCC[OH2+] Intermediate Fragment 
69 117.0546205681 OC=C=C(O)CC[OH2+] Intermediate Fragment 
70 99.0440558841 C=C=C(O)C=C[OH2+]
71 117.0546205681 C=C=C(O)C(O)C[OH2+] Intermediate Fragment 
72 57.0334912001 CC#C[OH2+]
73 119.0702706321 OC1CCOC1C[OH2+]
74 266.0883802841 [NH3+]C1N=CC2=C(N1)N(C1C=C(O)C(=C=O)O1)C(O)N2
75 152.0566862321 [NH2+]=C1N=CC2=NC(O)N=C2N1
76 266.0883802841 [NH3+]C1N=CC2=C(N1)N(C(O)=C=C(O)C#CO)C(O)N2 Intermediate Fragment 
77 266.0883802841 [NH3+]C1N=CC2=C(N1)N(C=C=C(O)C(O)=C=O)C(O)N2 Intermediate Fragment 
78 267.0723958721 OC1=CC(N2C3=C(NC2O)C(O)=NCN3)OC1=C=[OH+]
79 266.0883802841 [NH3+]C1N=C(O)C2=C(N1)N(C1C=C(O)C(=C=O)O1)CN2
80 284.0989449681 C=C(OC(=C=O)C=O)N1C2=C(NC1O)C(O)NC([NH3+])N2 Intermediate Fragment 
81 256.1040303481 C=C(OC#CO)N1C2=C(NC1O)C(O)NC([NH3+])N2
82 254.0883802841 C=C(OC#CO)N1C2=C(NC1O)C(O)=NC([NH3+])N2
83 212.0778156001 C=C(O)N1C2=C(NC1O)C(O)=NC(=[NH2+])N2
84 194.0672509161 C#CN1C2=C(NC1O)C(O)=NC(=[NH2+])N2
85 212.0778156001 C=C(O)N(C(=N)O)C1=CC(O)=NC(=[NH2+])N1 Intermediate Fragment 
86 101.0345538201 [CH+]=C(O)NC(=N)O
87 195.0512665041 C=C(O)[N+](=C=O)C1=CC(O)=NC(=N)N1
88 192.0516008521 C#CN1C(O)=NC2=C1NC(=[NH2+])N=C2O
89 210.0621655361 C=C(O)N1C(NC(=[NH2+])N=C=O)=CN=C1O Intermediate Fragment 
90 210.0621655361 [CH+]=C(O)N(C(=N)O)C1=CC(O)=NC(=N)N1 Intermediate Fragment 
91 167.0563518841 [CH+]=C(O)NC1=CC(O)=NC(=N)N1
92 208.0465154721 [CH+]=C(O)N1C(O)=NC2=C1NC(=N)N=C2O
93 75.0440558841 OCC=C[OH2+]
94 194.0672509161 C#CN1C(NC(=[NH2+])N=C=O)=CNC1O Intermediate Fragment 
95 196.0829009801 C#CN1C2=C(NC1O)C(O)=NC([NH3+])N2
96 198.0985510441 C#CN1C2=C(NC1O)C(O)NC([NH3+])N2
97 284.0989449681 [NH3+]C1NC(O)C2NC(O)N(C(=C=C=O)OC#CO)C2N1 Intermediate Fragment 
98 238.0570801561 [NH2+]=C1N=C(O)C2=C(N1)N(COC#CO)C(O)=N2
99 180.0516008521 CN1C(=O)N=C2C(O)=NC(=[NH2+])N=C21
100 242.0883802841 [NH3+]C1NC2=C(NC(O)N2C(=O)C#CO)C(O)N1
101 224.0778156001 C#CC(=O)N1C2=C(NC1O)C(O)=NC([NH3+])N2
102 242.0883802841 [NH3+]C1N=C(O)C(NC(O)N=C(O)C#CO)=CN1 Intermediate Fragment 
103 196.0465154721 [NH2+]=C1N=C(O)C2=C(N1)N(C=O)C(O)=N2
104 238.0570801561 [NH2+]=C1N=C(O)C2=C(N1)N(C(=O)C#CO)C(O)N2
105 222.0621655361 [NH2+]=C1N=C(O)C2=C(N1)N(CC#CO)C(O)=N2
106 226.0934656641 [NH3+]C1N=C(O)C2=C(N1)N(CC#CO)C(O)N2
107 208.0829009801 C#CCN1C2=C(NC1O)C(O)=NC(=[NH2+])N2
108 226.0934656641 [NH3+]C1N=C(O)C(NC(O)N=CC#CO)=CN1 Intermediate Fragment 
109 228.1091157281 [NH3+]C1NC2=C(NC(O)N2CC#CO)C(O)N1
110 284.0989449681 [NH3+]C1NC2=C(NC(O)N2C(O)=C=C(O)C#CO)C(O)N1 Intermediate Fragment 
111 73.0284058201 OCC#C[OH2+]
112 43.0178411361 C#C[OH2+]
113 55.0178411361 C#CC=[OH+]
114 71.0127557561 O=CC#C[OH2+]
115 68.9971056921 [O+]#CC#CO
116 214.0934656641 C=C(O)N1C2=C(NC1O)C(O)=NC([NH3+])N2
117 216.1091157281 C=C(O)N1C2=C(NC1O)C(O)NC([NH3+])N2
118 200.0778156001 [NH3+]C1N=C(O)C2=C(N1)N(C=O)C(O)N2
119 198.0621655361 [NH2+]=C1N=C(O)C2=C(N1)N(C=O)C(O)N2
120 181.0356164401 O=CN1C(O)=NC2=C([OH2+])N=CN=C21
121 198.0621655361 NC(=[NH2+])NC1=C(C=O)N=C(O)N1C=O Intermediate Fragment 
122 198.0621655361 [NH2+]=C(N=C=O)NC1=CNC(O)N1C=O Intermediate Fragment 
123 153.0407018201 [NH+]#CNC1=CN=C(O)N1C=O
124 198.0621655361 NC1=C(N(C=O)C=O)NC(=[NH2+])N=C1O Intermediate Fragment 
125 198.0621655361 N=C(O)N(C=O)C1=CC(O)=NC(=[NH2+])N1 Intermediate Fragment 
126 112.0505382321 [NH2+]=C1N=C(O)C=CN1
127 181.0356164401 N=C1N=C(O)C=C([N+](=C=O)C=O)N1
128 155.0563518841 [NH3+]C1N=C(O)C=C(N=C=O)N1
129 153.0407018201 [NH2+]=C1N=C(O)C=C(N=C=O)N1
130 198.0621655361 [NH2+]=C1N=C(O)C(NC(O)N=C=O)=CN1 Intermediate Fragment 
131 153.0407018201 [NH2+]=C1N=CC(N=C=O)C(O)=N1
132 178.0359507881 [CH2+]N1C(=O)N=C2C(O)=NC(=N)N=C21
133 196.0465154721 [NH2+]=C(N=C=O)NC1=CN=C(O)N1C=O Intermediate Fragment 
134 168.0516008521 NC(=[NH2+])N=C1C=NC(=O)N1C=O
135 126.0298027881 [NH2+]=C1C=NC(=O)N1C=O
136 73.0396392001 [NH3+]CN=C=O
137 151.0250517561 [NH+]#CN=C1C=NC(=O)N1C=O
138 196.0465154721 N=C1N=C(O)C(N)=C(N(C#[O+])C=O)N1 Intermediate Fragment 
139 196.0465154721 N=C1N=C(O)C=C(N(C#[O+])C(=N)O)N1 Intermediate Fragment 
140 196.0465154721 [NH2+]=C1N=C(O)C(N=C(O)N=C=O)=CN1 Intermediate Fragment 
141 196.0465154721 [NH2+]=C1N=C(O)C(N=CO)=C(N=C=O)N1 Intermediate Fragment 
142 194.0308654081 N=C1N=C(O)C2=C(N1)N(C#[O+])C(O)=N2
143 194.0308654081 N=C(N=C=O)NC1=CN=C(O)N1C#[O+] Intermediate Fragment 
144 194.0308654081 [NH2+]=C1N=CC(=NC(=O)N=C=O)C(O)=N1 Intermediate Fragment 
145 87.0440558841 C=C(O)C=C[OH2+]
146 89.0597059481 C=C(O)CC[OH2+]
147 71.0491412641 C=CC(=C)[OH2+]
148 71.0491412641 C#CCC[OH2+]
149 91.0753560121 CC(O)CC[OH2+]
150 73.0647913281 C=C([OH2+])CC
151 266.0883802841 [NH3+]C1N=C(O)C2=C(N1)N(C=C=C(O)C#CO)C(O)N2
152 266.0883802841 [NH3+]C1N=C(O)C(NC(O)N=C=C=C(O)C#CO)=CN1 Intermediate Fragment 
153 282.0832949041 [NH3+]C1N=C(O)C2=C(N1)N(C(O)=C=C(O)C#CO)C(O)N2
154 284.0989449681 [NH3+]C1NC2=C(NC(O)N2C=C=C(O)C(O)=C=O)C(O)N1 Intermediate Fragment 
155 93.0546205681 OCC(O)C[OH2+]
156 75.0440558841 C=C(O)C[OH2+]
157 91.0389705041 OCC(O)=C[OH2+]
158 61.0284058201 OC=C[OH2+]
159 59.0127557561 OC#C[OH2+]
160 31.0178411361 C=[OH+]
161 73.0284058201 C=C(O)C=[OH+]
162 89.0233204401 OCC(O)=C=[OH+]
163 87.0076703761 O=CC(O)=C=[OH+]
164 200.1142011081 C#CN1C(O)NC2C(O)NC([NH3+])NC21
165 184.0829009801 CN1C2=NC([NH3+])N=C(O)C2=NC1O
166 182.0672509161 CN1C2=NC(=[NH2+])N=C(O)C2=NC1O
167 180.0516008521 [CH2+]N1C(NC(=N)N=C=O)=CN=C1O Intermediate Fragment 
168 137.0457872001 CN1C(=O)N=CC1=NC#[NH+]
169 178.0359507881 [CH2+]N1C(=O)N=CC1=NC(=N)N=C=O Intermediate Fragment 
170 105.0546205681 C=C(O)C(O)C[OH2+]
171 63.0440558841 OCC[OH2+]
172 282.0832949041 [NH3+]C1N=C(O)C2=C(N1)N(C=C=C(O)C(O)=C=O)C(O)N2
173 284.0989449681 C=C(O)C(=C=O)OCN1C2=C(NC1O)C(O)=NC([NH3+])N2 Intermediate Fragment 
174 284.0989449681 NC([NH3+])NC1=C(C=O)NC(O)N1C1C=C(O)C(=C=O)O1 Intermediate Fragment 
175 225.0505978081 O=CC1=CN(C2C=C(O)C(=C=[OH+])O2)C(O)N1
176 284.0989449681 N=C(O)C1=C(NC[NH3+])N(C2C=C(O)C(=C=O)O2)C(O)N1 Intermediate Fragment 
177 284.0989449681 NC1=C(C(O)=NC[NH3+])NC(O)N1C1C=C(O)C(=C=O)O1 Intermediate Fragment 
178 212.0665822201 [NH3+]C1CNC(O)N1C1=CC(=O)C(=C=O)O1
179 214.0822322841 [NH3+]C1CNC(O)N1C1=CC(O)C(=C=O)O1
180 216.0978823481 [NH3+]C1CNC(O)N1C1=CC(O)C(=CO)O1
181 242.0771469041 [NH3+]C1=C(CO)NC(O)N1C1C=C(O)C(=C=O)O1
182 284.0989449681 NC([NH3+])N=C(O)C1=CN(C2C=C(O)C(=C=O)O2)C(O)N1 Intermediate Fragment 
183 267.0723958721 [NH2+]=CN=C(O)C1=CN(C2C=C(O)C(=C=O)O2)C(O)N1
184 284.0989449681 [NH3+]C(N=CO)NC1=CNC(O)N1C1C=C(O)C(=C=O)O1 Intermediate Fragment 
185 210.0509321561 [NH3+]C1=CNC(O)N1C1=CC(=O)C(=C=O)O1
186 237.0618311881 [NH+]#CNC1=CNC(O)N1C1C=C(O)C(=C=O)O1
187 239.0774812521 [NH2+]=CNC1=CNC(O)N1C1C=C(O)C(=C=O)O1
188 284.0989449681 NC1=C(N(CO)C2C=C(O)C(=C=O)O2)NC([NH3+])N=C1O Intermediate Fragment 
189 125.0457872001 N=C=C=NC([NH3+])N=C=O Intermediate Fragment 
190 80.0243234841 N#CC=NC#[NH+]
191 125.0457872001 N=C(N)N=C=C(N)C#[O+] Intermediate Fragment 
192 127.0614372641 N=C1C=NC([NH3+])N=C1O
193 129.0770873281 N=C1C=NC([NH3+])NC1O
194 256.1040303481 NC1C(O)NC([NH3+])NC1N=C1C=C(O)C(=C=O)O1
195 238.0934656641 C=C1OC(=NC2=C(N)C(O)=NC([NH3+])N2)C=C1O
196 238.0934656641 NC1=C(N=C2C=CC(=C=O)O2)NC([NH3+])NC1O
197 284.0989449681 NC(O)N(C1=CC(O)=NC([NH3+])N1)C1C=C(O)C(=C=O)O1 Intermediate Fragment 
198 173.0556831881 [NH3+]C(O)NC1C=C(O)C(=C=O)O1
199 171.0400331241 [NH3+]C(O)N=C1C=C(O)C(=C=O)O1
200 128.0342194721 [NH3+]C1C=C(O)C(=C=O)O1
201 267.0723958721 [NH2+]=C1N=C(O)C=C(N(CO)C2C=C(O)C(=C=O)O2)N1
202 241.0931313161 [NH3+]C1NC(O)CC(N=C2C=C(O)C(=C=O)O2)N1
203 241.0931313161 NC(O)C=C(N=C1C=C(O)C(=C=O)O1)NC[NH3+] Intermediate Fragment 
204 239.0774812521 [NH3+]C1NC(N=C2C=C(O)C(=C=O)O2)=CC(O)N1
205 284.0989449681 [NH3+]C1NC=C(NC(O)N=C2C=C(O)C(=C=O)O2)C(O)N1 Intermediate Fragment 
206 155.0563518841 [NH2+]=C1N=CC(N=CO)C(O)=N1
207 284.0989449681 [NH3+]C1NC(N=C2C=C(O)C(=C=O)O2)=C(NCO)C(O)N1 Intermediate Fragment 
