#In-silico ESI-MS/MS [M+H]+ Spectra
#PREDICTED BY CFM-ID 4.0.8
#SMILES=n1cnc2c(c1N(CCOCO)CO)ncn2[C@@H]1O[C@H](CO)[C@@H](C1)O
#InChiKey=ZELWWYXFRUOTJU-GMTAPVOTSA-N
energy0
208.08290 28.40 93 77 31 (4.4178 1.6211 0.00020882)
210.09855 96.16 94 82 (18.515 1.9352)
240.10912 61.97 127 132 138 140 146 142 141 143 (13.159 0.0073528 0.0045329 0.0030702 0.0029647 0.0020862 0.00066391 0.00019878)
296.13533 19.44 76 173 57 (4.1118 0.014397 0.008968)
308.13533 26.07 65 102 88 84 81 101 83 71 (1.7725 1.5627 0.86385 0.45987 0.39456 0.27551 0.11463 0.099803)
310.15098 13.63 155 89 72 111 116 170 (1.6291 0.6615 0.37995 0.20112 0.023593 0.0045089)
326.14590 37.79 95 78 109 85 106 104 151 105 103 107 (5.3063 2.4103 0.21271 0.081224 0.014666 0.0049026 0.004231 0.0015759 0.000499 4.6959e-05)
356.15646 100.00 0 180 167 157 179 163 159 165 156 175 164 162 (20.379 0.70895 0.11945 0.029876 0.022415 0.003069 0.0015166 0.0014516 0.00064859 0.00034172 0.0002585 0.00012461)
energy1
164.05669 33.33 15 (6.0792)
166.07234 36.33 16 (6.627)
192.08799 58.88 68 (10.74)
194.10364 18.32 69 (3.3425)
208.08290 90.13 93 77 31 (11.257 5.1784 0.0060125)
210.09855 42.41 94 82 (5.3696 2.3675)
222.09855 100.00 117 90 (12.287 5.9547)
240.10912 33.45 127 132 138 140 142 146 143 141 (6.0105 0.042165 0.014854 0.013376 0.0087238 0.0051605 0.0046222 0.0031217)
278.12477 9.79 66 58 (1.771 0.014596)
308.13533 19.51 81 101 88 102 83 65 84 71 (2.0354 0.39443 0.32848 0.3155 0.18384 0.17542 0.12493 0.0010359)
energy2
121.05087 8.24 3 (1.143)
164.05669 64.31 15 (8.9192)
166.07234 80.08 16 (11.106)
170.10364 11.79 21 (1.6355)
172.11929 9.18 22 (1.2726)
192.08799 8.58 68 (1.1904)
194.10364 6.96 69 (0.96518)
208.08290 78.05 93 77 31 (8.5116 1.1689 1.1448)
210.09855 100.00 94 82 (12.983 0.88553)
222.09855 18.13 117 90 (1.7753 0.73956)
250.09347 9.27 14 (1.285)
252.10912 23.26 18 108 (1.8906 1.3353)
256.14042 7.69 38 (1.0667)
264.10912 34.57 20 24 23 33 (3.219 0.88229 0.39612 0.29654)
266.12477 7.43 35 176 154 36 (0.63356 0.34806 0.028245 0.021111)
268.14042 8.54 40 45 44 (0.67699 0.37702 0.13022)
278.12477 13.57 66 58 (1.4229 0.45846)
280.14042 13.60 67 113 (1.7891 0.097179)
294.11968 10.52 79 56 100 174 (1.1588 0.23844 0.06038 0.001058)
296.13533 15.00 76 173 57 (1.5964 0.48223 0.0010449)
308.13533 50.54 88 102 81 101 84 83 65 71 (4.8583 0.86199 0.72307 0.38212 0.12518 0.058359 0.00026471 0.00017856)

0 356.1564598441 OCOCC[NH+](CO)c1ncnc2c1ncn2C1CC(O)C(CO)O1
1 122.0811696641 OC[NH2+]CCOCO
2 235.0825666321 OC1CC(N2C=NC3=CN=CN=C32)OC1=C[OH2+]
3 121.0508725801 C1=NC2=NC=[NH+]CC2=N1
4 237.0982166961 OC1CC(N2C=NC3=CN=CN=C32)OC1C[OH2+]
5 219.0876520121 [OH2+]C=C1CCC(N2C=NC3=CN=CN=C32)O1
6 237.0982166961 O=C(CC(O)CC[OH2+])N1C=NC2=CN=CN=C21 Intermediate Fragment 
7 241.1295168241 OC1CC(N2CNC3CN=CN=C32)OC1C[OH2+]
8 77.0597059481 CC[OH+]CO
9 45.0334912001 C=C[OH2+]
10 59.0491412641 C=C[OH+]C
11 75.0440558841 C=C[OH+]CO
12 57.0334912001 C#C[OH+]C
13 280.1040303481 O=C=[NH+]C1=C2NCN(C3CC(O)C(CO)O3)C2=NC=N1
14 250.0934656641 [NH3+]C1=C2N=CN(C3CC(O)C(=CO)O3)C2=NC=N1
15 164.0566862321 O=C=[NH+]C1=C2NCNC2=NC=N1
16 166.0723362961 OC=[NH+]C1=C2NCNC2=NC=N1
17 282.1196804121 OC=[NH+]C1=C2NCN(C3CC(O)C(CO)O3)C2=NC=N1
18 252.1091157281 [NH3+]C1=C2N=CN(C3CC(O)C(CO)O3)C2=NC=N1
19 254.1247657921 [NH3+]C1=C2NCN(C3CC(O)C(CO)O3)C2=NC=N1
20 264.1091157281 C=[NH+]C1=C2N=CN(C3CC(O)C(CO)O3)C2=NC=N1
21 170.1036364241 OC[NH2+]C1N=CN=C2NCNC21
22 172.1192864881 OC[NH2+]C1N=CNC2NCNC21
23 264.1091157281 CC1OC(N2CNC3=C([NH+]=C=O)N=CN=C32)CC1O
24 264.1091157281 O=C=[NH+]C1=C2NCN(C3CCC(CO)O3)C2=NC=N1
25 282.1196804121 N=C=NC1=C(C=[NH+]C=O)NCN1C1CC(O)C(CO)O1 Intermediate Fragment 
26 282.1196804121 O=C[NH+]=CN=C=NC1=CNCN1C1CC(O)C(CO)O1 Intermediate Fragment 
27 225.0982166961 [NH+]#CN=C1C=NCN1C1CC(O)C(CO)O1
28 282.1196804121 CNC1=C([NH+]=C=O)N=CN=C1NC1CC(O)C(CO)O1 Intermediate Fragment 
29 282.1196804121 O=C=[NH+]C1=C2NCN(CCC(O)C(O)CO)C2=NC=N1 Intermediate Fragment 
30 282.1196804121 CC(OC(CO)CO)N1CNC2=C([NH+]=C=O)N=CN=C21 Intermediate Fragment 
31 208.0829009801 CC(O)N1CNC2=C([NH+]=C=O)N=CN=C21
32 282.1196804121 O=C=[NH+]C1=C2NCN(C(O)CC(O)CCO)C2=NC=N1 Intermediate Fragment 
33 264.1091157281 O=C=[NH+]C1=C2N=CN(CCC(O)CCO)C2=NC=N1
34 284.1353304761 OC[NH2+]C1=C2NCN(C3CC(O)C(CO)O3)C2=NC=N1
35 266.1247657921 C=[NH+]C1=C2NCN(C3CC(O)C(CO)O3)C2=NC=N1
36 266.1247657921 CC1OC(N2CNC3=C([NH+]=CO)N=CN=C32)CC1O
37 286.1509805401 OC[NH2+]C1N=CN=C2C1NCN2C1CC(O)C(CO)O1
38 256.1404158561 [NH3+]C1N=CN=C2C1NCN2C1CC(O)C(CO)O1
39 258.1560659201 [NH3+]C1N=CNC2C1NCN2C1CC(O)C(CO)O1
40 268.1404158561 C[NH2+]C1=C2NCN(C3CC(O)C(CO)O3)C2=NC=N1
41 119.0702706321 OC1CCOC1C[OH2+]
42 168.0879863601 OC[NH2+]C1=C2NCNC2=NC=N1
43 174.1349365521 OC[NH2+]C1NCNC2NCNC21
44 268.1404158561 CC1OC(N2CNC3=C([NH2+]CO)N=CN=C32)CC1O
45 268.1404158561 OC[NH2+]C1=C2NCN(C3CCC(CO)O3)C2=NC=N1
46 286.1509805401 OC[NH2+]CN=C=NC1=CNCN1C1CC(O)C(CO)O1 Intermediate Fragment 
47 286.1509805401 OC[NH2+]C1=C2NCN(CCC(O)C(O)CO)C2=NC=N1 Intermediate Fragment 
48 286.1509805401 OCCC(O)CC(O)N1CNC2=C([NH2+]CO)N=CN=C21 Intermediate Fragment 
49 288.1666306041 OC[NH2+]C1N=CNC2C1NCN2C1CC(O)C(CO)O1
50 270.1560659201 C[NH2+]C1N=CN=C2C1NCN2C1CC(O)C(CO)O1
51 270.1560659201 OC[NH2+]C1N=CN=C2C1NCN2C1CCC(CO)O1
52 288.1666306041 OC[NH2+]CN=C=NC1CNCN1C1CC(O)C(CO)O1 Intermediate Fragment 
53 288.1666306041 CNC1C(NC2CC(O)C(CO)O2)=NC=NC1[NH2+]CO Intermediate Fragment 
54 288.1666306041 OC[NH2+]C1N=CN=C2C1NCN2CCC(O)C(O)CO Intermediate Fragment 
55 288.1666306041 OCCC(O)CC(O)N1CNC2C1=NC=NC2[NH2+]CO Intermediate Fragment 
56 294.1196804121 C[NH+](C=O)C1=C2N=CN(C3CC(O)C(CO)O3)C2=NC=N1
57 296.1353304761 C[NH+](C=O)C1=C2NCN(C3CC(O)C(CO)O3)C2=NC=N1
58 278.1247657921 C[NH+](C)C1=C2N=CN(C3CC(O)C(=CO)O3)C2=NC=N1
59 178.0723362961 C[NH+](C=O)C1=C2N=CNC2=NC=N1
60 180.0879863601 C[NH+](C=O)C1=C2NCNC2=NC=N1
61 298.1509805401 C[NH+](CO)C1=C2NCN(C3CC(O)C(CO)O3)C2=NC=N1
62 49.0284058201 OC[OH2+]
63 31.0178411361 C=[OH+]
64 47.0127557561 OC=[OH+]
65 308.1353304761 C#C[NH+](CO)C1=C2NCN(C3CC(O)C(CO)O3)C2=NC=N1
66 278.1247657921 C=C=[NH+]C1=C2NCN(C3CC(O)C(CO)O3)C2=NC=N1
67 280.1404158561 CC=[NH+]C1=C2NCN(C3CC(O)C(CO)O3)C2=NC=N1
68 192.0879863601 C#C[NH+](CO)C1=C2NCNC2=NC=N1
69 194.1036364241 C=C[NH+](CO)C1=C2NCNC2=NC=N1
70 290.1247657921 C#C[NH+](C=O)C1=C2NCN(C3CCC(CO)O3)C2=NC=N1
71 308.1353304761 C#C[NH+](C=O)C1=C2NCN(CCC(O)C(O)CO)C2=NC=N1 Intermediate Fragment 
72 310.1509805401 C=C[NH+](CO)C1=C2NCN(C3CC(O)C(CO)O3)C2=NC=N1
73 292.1404158561 C#C[NH+](C)C1=C2NCN(C3CC(O)C(CO)O3)C2=NC=N1
74 312.1666306041 CC[NH+](CO)C1=C2NCN(C3CC(O)C(CO)O3)C2=NC=N1
75 324.1302450961 OC#C[NH+](CO)C1=C2NCN(C3CC(O)C(CO)O3)C2=NC=N1
76 296.1353304761 OCC=[NH+]C1=C2NCN(C3CC(O)C(CO)O3)C2=NC=N1
77 208.0829009801 OC#C[NH+](CO)C1=C2NCNC2=NC=N1
78 326.1458951601 OC=C[NH+](CO)C1=C2NCN(C3CC(O)C(CO)O3)C2=NC=N1
79 294.1196804121 OC=C=[NH+]C1=C2NCN(C3CC(O)C(CO)O3)C2=NC=N1
80 298.1509805401 OCC[NH2+]C1=C2NCN(C3CC(O)C(CO)O3)C2=NC=N1
81 308.1353304761 C[NH+](C#CO)C1=C2NCN(C3CC(O)C(CO)O3)C2=NC=N1
82 210.0985510441 OC=C[NH+](CO)C1=C2NCNC2=NC=N1
83 308.1353304761 CC1OC(N2CNC3=C([NH+](C#CO)CO)N=CN=C32)CC1O
84 308.1353304761 OC#C[NH+](CO)C1=C2NCN(C3CCC(CO)O3)C2=NC=N1
85 326.1458951601 OC#C[NH+](CO)C1=C2NCN(C(O)CC(O)CCO)C2=NC=N1 Intermediate Fragment 
86 328.1615452241 OCC[NH+](CO)C1=C2NCN(C3CC(O)C(CO)O3)C2=NC=N1
87 338.1458951601 COC#C[NH+](CO)C1=C2NCN(C3CC(O)C(CO)O3)C2=NC=N1
88 308.1353304761 COC=C=[NH+]C1=C2NCN(C3CC(O)C(CO)O3)C2=NC=N1
89 310.1509805401 COCC=[NH+]C1=C2NCN(C3CC(O)C(CO)O3)C2=NC=N1
90 222.0985510441 COC#C[NH+](CO)C1=C2NCNC2=NC=N1
91 224.1142011081 COC=C[NH+](CO)C1=C2NCNC2=NC=N1
92 324.1302450961 OCOC=C=[NH+]C1=C2NCN(C3CC(O)C(CO)O3)C2=NC=N1
93 208.0829009801 OCOC=C=[NH+]C1=C2NCNC2=NC=N1
94 210.0985510441 OCOCC=[NH+]C1=C2NCNC2=NC=N1
95 326.1458951601 OCOCC=[NH+]C1=C2NCN(C3CC(O)C(CO)O3)C2=NC=N1
96 282.1560659201 CC[NH2+]C1=C2NCN(C3CC(O)C(CO)O3)C2=NC=N1
97 117.0546205681 OC1CCOC1=C[OH2+]
98 214.1298511721 OCOCC[NH2+]C1N=CN=C2NCNC21
99 216.1455012361 OCOCC[NH2+]C1N=CNC2NCNC21
100 294.1196804121 OCOC=C=[NH+]C1=C2NCN(C3CC(O)CO3)C2=NC=N1
101 308.1353304761 CC1OC(N2CNC3=C([NH+]=C=COCO)N=CN=C32)CC1O
102 308.1353304761 OCOC=C=[NH+]C1=C2NCN(C3CCC(CO)O3)C2=NC=N1
103 326.1458951601 N=C=NC1=C(C=[NH+]C=COCO)NCN1C1CC(O)C(CO)O1 Intermediate Fragment 
104 326.1458951601 OCOC=C[NH+]=CN=C=NC1=CNCN1C1CC(O)C(CO)O1 Intermediate Fragment 
105 326.1458951601 CNC1=C([NH+]=C=COCO)N=CN=C1NC1CC(O)C(CO)O1 Intermediate Fragment 
106 326.1458951601 OCOC=C=[NH+]C1=C2NCN(CCC(O)C(O)CO)C2=NC=N1 Intermediate Fragment 
107 326.1458951601 CC(OC(CO)CO)N1CNC2=C([NH+]=C=COCO)N=CN=C21 Intermediate Fragment 
108 252.1091157281 CC(O)N1CNC2=C([NH+]=C=COCO)N=CN=C21
109 326.1458951601 OCCC(O)CC(O)N1CNC2=C([NH+]=C=COCO)N=CN=C21 Intermediate Fragment 
110 328.1615452241 OCOCC[NH2+]C1=C2NCN(C3CC(O)C(CO)O3)C2=NC=N1
111 310.1509805401 CC1OC(N2CNC3=C([NH+]=CCOCO)N=CN=C32)CC1O
112 338.1458951601 C[NH+](C#COCO)C1=C2NCN(C3CC(O)C(CO)O3)C2=NC=N1
113 280.1404158561 C[NH+](C)C1=C2N=CN(C3CC(O)C(CO)O3)C2=NC=N1
114 290.1247657921 C#C[NH+](C)C1=C2N=CN(C3CC(O)C(CO)O3)C2=NC=N1
115 294.1560659201 C=C[NH+](C)C1=C2NCN(C3CC(O)C(CO)O3)C2=NC=N1
116 310.1509805401 C[NH+](C=CO)C1=C2NCN(C3CC(O)C(CO)O3)C2=NC=N1
117 222.0985510441 C[NH+](C#COCO)C1=C2NCNC2=NC=N1
118 224.1142011081 C[NH+](C=COCO)C1=C2NCNC2=NC=N1
119 320.1353304761 C[NH+](C#COC=O)C1=C2NCN(C3CCC(CO)O3)C2=NC=N1
120 338.1458951601 C[NH+](C#COC=O)CN=C=NC1=CNCN1C1CC(O)C(CO)O1 Intermediate Fragment 
121 338.1458951601 C[NH+](C#COC=O)C1=C2NCN(CCC(O)C(O)CO)C2=NC=N1 Intermediate Fragment 
122 320.1353304761 C[NH+](C#COC=O)C1=C2N=CN(CCC(O)CCO)C2=NC=N1
123 99.0440558841 C=C1OCC=C1[OH2+]
124 117.0546205681 CCC(O)C(=O)C=[OH+] Intermediate Fragment 
125 117.0546205681 O=CCC(O)C=C[OH2+] Intermediate Fragment 
126 238.0934656641 OCOC#C[NH+](CO)C1=C2NCNC2=NC=N1
127 240.1091157281 OCOC=C[NH+](CO)C1=C2NCNC2=NC=N1
128 182.1036364241 C[NH+](CO)C1=C2NCNC2=NC=N1
129 196.1192864881 CC[NH+](CO)C1=C2NCNC2=NC=N1
130 212.1142011081 OCC[NH+](CO)C1=C2NCNC2=NC=N1
131 212.1142011081 OCOCC[NH2+]C1=C2NCNC2=NC=N1
132 240.1091157281 OCOC#C[NH+](CO)CN=C=NC1=CNCN1 Intermediate Fragment 
133 157.0607685681 C=[NH+]CN(C#COC=O)CO
134 159.0764186321 C=[NH+]CN(C#COCO)CO
135 172.0716676001 N=C=[NH+]CN(C#COCO)CO
136 107.0352225161 [NH+]#CN=C1C=NC=N1
137 132.0655196001 C[NH+](C#COCO)CO
138 240.1091157281 N=C=NC(C1=CNCN1)[NH+](C#COCO)CO Intermediate Fragment 
139 213.0982166961 [NH3+]C(C1=CNCN1)N(C#COC=O)CO
140 240.1091157281 C=NC(=C1NCNC1=N)[NH+](C#COCO)CO Intermediate Fragment 
141 240.1091157281 C=NC1=C(C(N)[NH+](C#COC=O)CO)NCN1 Intermediate Fragment 
142 240.1091157281 NCNC1=C([NH+](C#COCO)CO)N=CN=C1 Intermediate Fragment 
143 240.1091157281 CNC1=C([NH+](C#COCO)CO)N=CN=C1N Intermediate Fragment 
144 213.0982166961 NC1=NC=NC([NH+](C=COCO)CO)=C1
145 223.0825666321 CNC1=C([NH+](C#COC=O)CO)N=CN=C1
146 240.1091157281 CNC1=NC=NC([NH+](C#COCO)CO)=C1N Intermediate Fragment 
147 242.1247657921 OCOCC[NH+](CO)C1=C2NCNC2=NC=N1
148 244.1404158561 OCOCC[NH+](CO)C1N=CN=C2NCNC21
149 246.1560659201 OCOCC[NH+](CO)C1N=CNC2NCNC21
150 324.1302450961 OCOC#C[NH+](CO)C1=C2NCN(C3CC(O)CO3)C2=NC=N1
151 326.1458951601 OCOC=C[NH+](CO)C1=C2NCN(C3CC(O)CO3)C2=NC=N1
152 338.1458951601 CC1OC(N2CNC3=C([NH+](C#COCO)CO)N=CN=C32)CC1O
153 338.1458951601 OCOC#C[NH+](CO)C1=C2NCN(C3CCC(CO)O3)C2=NC=N1
154 266.1247657921 OC=[NH+]C1=C2NCN(C3CCC(CO)O3)C2=NC=N1
155 310.1509805401 OCOCC=[NH+]C1=C2NCN(C3CCC(CO)O3)C2=NC=N1
156 356.1564598441 N=C=NC1=C(C[NH+](C#COCO)CO)NCN1C1CC(O)C(CO)O1 Intermediate Fragment 
157 356.1564598441 OCOC#C[NH+](CO)CN=C=NC1=CNCN1C1CC(O)C(CO)O1 Intermediate Fragment 
158 225.0982166961 [NH+]#CN=C1C=NCN1C(=O)CC(O)CCO Intermediate Fragment 
159 356.1564598441 N=C=NC(C1=CN(C2CC(O)C(CO)O2)CN1)[NH+](C#COCO)CO Intermediate Fragment 
160 329.1455608121 [NH3+]C(C1=CN(C2CC(O)C(CO)O2)CN1)N(C#COC=O)CO
161 183.0764186321 OC1CC(N2C=CN=C2)OC1=C[OH2+]
162 356.1564598441 C=NC1=C(C(N)[NH+](C#COC=O)CO)NCN1C1CC(O)C(CO)O1 Intermediate Fragment 
163 356.1564598441 NCN(C1=NC=NC([NH+](C#COCO)CO)=C1)C1CC(O)C(CO)O1 Intermediate Fragment 
164 356.1564598441 OCOC#C[NH+](CO)C1=C(NCNC2CC(O)C(CO)O2)C=NC=N1 Intermediate Fragment 
165 356.1564598441 CNC1=C([NH+](C#COCO)CO)N=CN=C1NC1CC(O)C(CO)O1 Intermediate Fragment 
166 225.0982166961 CNC1=C([NH+](C#COCO)CO)N=CN=C1
167 356.1564598441 OCOC#C[NH+](CO)C1=C2NCN(CCC(O)C(O)CO)C2=NC=N1 Intermediate Fragment 
168 338.1458951601 O=COC#C[NH+](CO)C1=C2NCN(CCC(O)CCO)C2=NC=N1
169 292.1404158561 C#C[NH+](C=O)C1=C2NCN(CCC(O)CCO)C2=NC=N1
170 310.1509805401 OCCC(O)CCN1CNC2=C([NH+]=C=COCO)N=CN=C21
171 320.1353304761 CCC(O)CCN1CNC2=C([NH+](C#COC=O)C=O)N=CN=C21
172 298.1509805401 OCCCN1CNC2=C([NH+](C=COCO)CO)N=CN=C21
173 296.1353304761 OCCCN1CNC2=C([NH+](C#COCO)CO)N=CN=C21
174 294.1196804121 O=COC#C[NH+](CO)C1=C2NCN(CCCO)C2=NC=N1
175 356.1564598441 CC(OC(CO)CO)N1CNC2=C([NH+](C#COCO)CO)N=CN=C21 Intermediate Fragment 
176 266.1247657921 CCN1CNC2=C([NH+](C#COCO)CO)N=CN=C21
177 282.1196804121 CC(O)N1CNC2=C([NH+](C#COCO)CO)N=CN=C21
178 284.1353304761 CC(O)N1CNC2=C([NH+](C=COCO)CO)N=CN=C21
179 356.1564598441 OCCOC(CCO)N1CNC2=C([NH+](C#COCO)CO)N=CN=C21 Intermediate Fragment 
180 356.1564598441 OCCC(O)CC(O)N1CNC2=C([NH+](C#COCO)CO)N=CN=C21 Intermediate Fragment 
181 75.0440558841 OCC=C[OH2+]
