#In-silico ESI-MS/MS [M+H]+ Spectra
#PREDICTED BY CFM-ID 4.0.8
#SMILES=n1cnc2c(c1NC(=O)C)ncn2[C@@H]1O[C@H](CO)[C@@H](C1)O
#InChiKey=DKVIBEFOBOVION-IWSPIJDZSA-N
energy0
178.07234 100.00 46 56 77 70 48 71 74 76 68 66 16 (71.903 0.21813 0.12021 0.12014 0.077538 0.068459 0.030238 0.014197 0.013132 0.0075541 0.0012148)
294.11968 20.49 0 178 169 143 142 94 107 133 134 160 161 135 141 132 (14.537 0.21747 0.060884 0.038513 0.0041675 0.0032988 0.0031011 0.0016944 0.0015842 0.00084942 0.00071267 0.00058716 0.00023798 8.9622e-05)
energy1
136.06177 49.67 6 (27.554)
178.07234 100.00 46 76 56 48 68 77 70 71 74 66 16 (53.483 0.39737 0.37186 0.24037 0.22243 0.20961 0.18008 0.18003 0.12442 0.05812 0.005764)
energy2
45.03349 7.58 172 (2.3364)
55.01784 3.70 182 (1.1389)
57.03349 17.18 39 (5.2946)
71.04914 7.82 190 191 (1.6707 0.74073)
94.03997 9.67 57 (2.9814)
107.03522 7.95 54 (2.4516)
121.05087 4.77 2 (1.4711)
134.04612 5.81 5 (1.7903)
136.06177 100.00 6 (30.818)
151.06144 6.15 72 50 75 67 (1.4597 0.18486 0.15331 0.09604)
162.04104 3.22 32 (0.99179)
178.07234 51.87 46 56 76 48 70 16 68 77 66 74 71 (4.7259 4.5336 2.5715 1.1685 0.6879 0.64798 0.62542 0.43435 0.31305 0.14482 0.13179)
184.11929 3.14 87 23 (0.80236 0.16557)
204.08799 4.71 156 153 165 (1.0021 0.29596 0.15383)
224.11420 6.97 166 (2.1477)
226.12985 6.97 167 (2.1477)
234.09855 10.60 12 19 11 146 176 (1.7468 0.88357 0.59093 0.024367 0.01999)
238.12985 3.01 149 (0.92728)

0 294.1196804121 CC(=O)[NH2+]c1ncnc2c1ncn2C1CC(O)C(CO)O1
1 233.0669165681 OC1CC(N2C=NC3=CN=CN=C32)OC1=C=[OH+]
2 121.0508725801 C1=NC2=NC=[NH+]CC2=N1
3 235.0825666321 OC1CC(N2C=NC3=CN=CN=C32)OC1=C[OH2+]
4 248.0778156001 [NH3+]C1=C2N=CN(C3CC(O)C(=C=O)O3)C2=NC=N1
5 134.0461215481 [NH2+]=C1N=CN=C2N=CN=C12
6 136.0617716121 [NH2+]=C1N=CN=C2NCN=C12
7 250.0934656641 [NH3+]C1=C2N=CN(C3CC(O)C(=CO)O3)C2=NC=N1
8 252.1091157281 [NH3+]C1=C2N=CN(C3CC(O)C(CO)O3)C2=NC=N1
9 142.1087218041 [NH3+]C1N=CNC2NCNC12
10 222.0985510441 [NH3+]C1=C2N=CN(C3CC(O)CO3)C2=NC=N1
11 234.0985510441 C=C1OC(N2C=NC3=C([NH3+])N=CN=C32)CC1O
12 234.0985510441 [NH3+]C1=C2N=CN(C3CCC(=CO)O3)C2=NC=N1
13 252.1091157281 N=CN(C1=NC=NC([NH3+])=C1)C1CC(O)C(=CO)O1 Intermediate Fragment 
14 252.1091157281 [NH3+]C1=C2N=CN(CCC(O)C(=O)CO)C2=NC=N1 Intermediate Fragment 
15 252.1091157281 CC(OC(=CO)CO)N1C=NC2=C([NH3+])N=CN=C21 Intermediate Fragment 
16 178.0723362961 CC(=O)N1C=NC2=C([NH3+])N=CN=C21
17 252.1091157281 [NH3+]C1=C2N=CN(C(CCO)OC=CO)C2=NC=N1 Intermediate Fragment 
18 252.1091157281 [NH3+]C1=C2N=CN(C(=O)CC(O)CCO)C2=NC=N1 Intermediate Fragment 
19 234.0985510441 [NH3+]C1=C2N=CN(CCC(O)C#CO)C2=NC=N1
20 210.0985510441 [NH3+]C1=C2N=CN(C(O)CCO)C2=NC=N1
21 208.0829009801 [NH3+]C1=C2N=CN(C(=O)CCO)C2=NC=N1
22 206.0672509161 [NH3+]C1=C2N=CN(C(=O)C=CO)C2=NC=N1
23 184.1192864881 CC(O)N1CNC2C1=NC=NC2[NH3+]
24 182.1036364241 CC(O)N1CNC2=C([NH3+])N=CN=C21
25 73.0284058201 OCC#C[OH2+]
26 75.0440558841 OCC=C[OH2+]
27 164.0566862321 [NH3+]C1=C2N=CN(C=O)C2=NC=N1
28 89.0597059481 CC(O)C=C[OH2+]
29 276.1091157281 C=C=[NH+]C1=C2N=CN(C3CC(O)C(CO)O3)C2=NC=N1
30 162.0774216761 C=C=[NH+]C1=C2NCNC2=NC=N1
31 278.0883802841 O=C=[NH+]C1=C2N=CN(C3CC(O)C(CO)O3)C2=NC=N1
32 162.0410361681 O=C[NH+]=C1N=CN=C2N=CN=C21
33 164.0566862321 O=C[NH+]=C1N=CN=C2NCN=C21
34 117.0546205681 OC1CCOC1=C[OH2+]
35 99.0440558841 C=C1OCC=C1[OH2+]
36 99.0440558841 [OH+]=C=C1CCCO1
37 117.0546205681 CCC(O)C(=O)C=[OH+] Intermediate Fragment 
38 99.0440558841 CC=C(O)C#C[OH2+]
39 57.0334912001 CC#C[OH2+]
40 117.0546205681 O=CCC(O)C=C[OH2+] Intermediate Fragment 
41 117.0546205681 OCCCOC#C[OH2+] Intermediate Fragment 
42 117.0546205681 CCOC(=C=[OH+])CO Intermediate Fragment 
43 115.0389705041 OC1CCOC1=C=[OH+]
44 113.0233204401 O=C1CCOC1=C=[OH+]
45 176.0566862321 [CH2+]C(O)=NC1=C2N=CNC2=NC=N1
46 178.0723362961 CC(O)=[NH+]C1=C2N=CNC2=NC=N1
47 160.0617716121 C=C=[NH+]C1=C2N=CNC2=NC=N1
48 178.0723362961 CC(=O)[NH+]=CC1=C(N=C=N)NC=N1 Intermediate Fragment 
49 161.0457872001 C#[N+]C1=NC=NC1=C=NC(C)=O
50 151.0614372641 CC(=O)N=C=C1N=CNC1=[NH2+]
51 136.0505382321 CC(=O)[NH+]=C=C1C=NC=N1
52 134.0348881681 [CH2+]C(=O)N=C=C1C=NC=N1
53 70.0287401681 C#[N+]C(C)=O
54 107.0352225161 [NH+]#CN=C1C=NC=N1
55 109.0508725801 [NH+]#CN=C1C=NCN1
56 178.0723362961 CC(=O)[NH+]=CN=C=NC1=CN=CN1 Intermediate Fragment 
57 94.0399735481 C#[N+]C1=CN=CN1
58 83.0239891361 [CH2+]C(=O)N=C=N
59 85.0396392001 CC(=O)N=C=[NH2+]
60 82.0399735481 [NH2+]=C1C=NC=N1
61 97.0396392001 C#[N+]C=NC(C)=O
62 108.0192381041 [CH2+]C(=O)N=C=NC#N
63 110.0348881681 CC(=O)N=C=[NH+]C#N
64 72.0443902321 C=[NH+]C(C)=O
65 176.0566862321 CC(=O)[N+]#CN=C=NC1=CN=CN1
66 178.0723362961 CC(=O)[NH+]=C(N=C=N)C1=CNC=N1 Intermediate Fragment 
67 151.0614372641 [CH2+]C(=O)N=C(N)C1=CNC=N1
68 178.0723362961 C=NC(N=C([CH2+])O)=C1N=CNC1=N Intermediate Fragment 
69 149.0457872001 [CH2+]C(=O)N=C=C1N=CNC1=N
70 178.0723362961 C=NC1=C(C(N)=NC([CH2+])=O)N=CN1 Intermediate Fragment 
71 178.0723362961 CC(O)=[NH+]C1=CC(N=C=N)=NC=N1 Intermediate Fragment 
72 151.0614372641 [CH2+]C(O)=NC1=CC(N)=NC=N1
73 136.0505382321 [CH2+]C(O)=NC1=CC=NC=N1
74 178.0723362961 CC(O)=[NH+]C1=C(N=C=N)C=NC=N1 Intermediate Fragment 
75 151.0614372641 CC(=O)[NH+]=C1N=CN=CC1=N
76 178.0723362961 C=NC1=C(N=C([CH2+])O)N=CN=C1N Intermediate Fragment 
77 178.0723362961 C=NC1=NC=NC(N=C([CH2+])O)=C1N Intermediate Fragment 
78 149.0457872001 [CH2+]C(=O)N=C1N=CN=CC1=N
79 180.0879863601 CC(O)=[NH+]C1=C2NCNC2=NC=N1
80 138.0774216761 [NH2+]=C1N=CN=C2NCNC12
81 180.0879863601 CC(=O)[NH+]=CN=C=NC1=CNCN1 Intermediate Fragment 
82 182.1036364241 CC(O)[NH2+]C1=C2NCNC2=NC=N1
83 60.0443902321 CC(=[NH2+])O
84 140.0930717401 [NH3+]C1N=CN=C2NCNC21
85 164.0930717401 CC=[NH+]C1=C2NCNC2=NC=N1
86 182.1036364241 CC(O)[NH+]=CN=C=NC1=CNCN1 Intermediate Fragment 
87 184.1192864881 CC(O)[NH2+]C1N=CN=C2NCNC21
88 166.1087218041 CC[NH2+]C1=C2NCNC2=NC=N1
89 262.0934656641 CC(O)=[NH+]C1=C2N=CN(C3CC(O)=CO3)C2=NC=N1
90 264.1091157281 CC(O)=[NH+]C1=C2N=CN(C3CC(O)CO3)C2=NC=N1
91 266.1247657921 CC(O)=[NH+]C1=C2NCN(C3CC(O)CO3)C2=NC=N1
92 276.1091157281 C=C1OC(N2C=NC3=C([NH+]=C(C)O)N=CN=C32)CC1O
93 276.1091157281 CC(O)=[NH+]C1=C2N=CN(C3CCC(=CO)O3)C2=NC=N1
94 294.1196804121 CC(=O)[NH+]=CC1=C(N=C=N)N(C2CC(O)C(CO)O2)C=N1 Intermediate Fragment 
95 277.0931313161 C=[NH+]C1=C(C=NC(C)=O)N=CN1C1CC(O)C(=C=O)O1
96 163.0614372641 C=[NH+]C1=NC=NC1=C=NC(C)=O
97 165.0770873281 C=[NH+]C1NC=NC1=C=NC(C)=O
98 267.1087813801 CC(=O)N=C=C1N=CN(C2CC(O)C(CO)O2)C1=[NH2+]
99 252.0978823481 CC(=O)[NH+]=CC1=CN(C2CC(O)C(=CO)O2)C=N1
100 74.0600402961 C=[NH+]C(C)O
101 56.0494756121 C=C[NH+]=C
102 221.0669165681 [NH+]#CN=C1C=NCN1C1CC(O)C(=C=O)O1
103 223.0825666321 [NH+]#CN=C1C=NCN1C1CC(O)C(=CO)O1
104 225.0982166961 [NH+]#CN=C1C=NCN1C1CC(O)C(CO)O1
105 208.0716676001 C=[NH+]C1=CN=CN1C1CC(O)C(=C=O)O1
106 225.0982166961 [NH+]#CN=C1C=NCN1C(=O)CC(O)CCO Intermediate Fragment 
107 294.1196804121 CC(=O)[NH+]=CN=C=NC1=CN=CN1C1CC(O)C(CO)O1 Intermediate Fragment 
108 210.0873176641 C=[NH+]C1=CN=CN1C1CC(O)C(=CO)O1
109 183.0764186321 OC1CC(N2C=CN=C2)OC1=C[OH2+]
110 210.0873176641 C=[NH+]C(=C)N(C=N)C1CC(O)C(=C=O)O1 Intermediate Fragment 
111 210.0873176641 C=[NH+]C1=CN=CN1CCC(O)C(=O)C=O Intermediate Fragment 
112 210.0873176641 C=[NH+]C1=CN=CN1C(=O)CC(O)C=CO Intermediate Fragment 
113 181.0607685681 OC1CC(N2C=CN=C2)OC1=C=[OH+]
114 96.0556236121 C=[NH+]C1=CN=CN1
115 98.0712736761 C=[NH+]C1=CNCN1
116 208.0716676001 C=[NH+]C1=CN=CN1CC=C(O)C(=O)C=O Intermediate Fragment 
117 206.0560175361 C=[NH+]C1=CN=CN1C1C=C(O)C(=C=O)O1
118 206.0560175361 C=[NH+]C1=CN=CN1C=C=C(O)C(=O)C=O Intermediate Fragment 
119 204.0403674721 C#[N+]C1=CN=CN1C1C=C(O)C(=C=O)O1
120 198.0873176641 [NH2+]=C1C=NCN1C1CC(O)C(=CO)O1
121 180.0767529801 C=C1OC(N2CN=CC2=[NH2+])C=C1O
122 198.0873176641 [NH2+]=C1C=NCN1C(=O)CC(O)C=CO Intermediate Fragment 
123 124.0505382321 [CH2+]C(=O)N1CN=CC1=N
124 196.0716676001 [NH2+]=C1C=NCN1C1CC(O)C(=C=O)O1
125 185.0920686961 OC1CC(N2C=CN=C2)OC1C[OH2+]
126 183.0764186321 O=C(C=[OH+])C(O)CCN1C=CN=C1 Intermediate Fragment 
127 183.0764186321 O=C(CC(O)C=C[OH2+])N1C=CN=C1 Intermediate Fragment 
128 163.0502038841 [CH+]=C1OC(N2C=CN=C2)C=C1O
129 181.0607685681 O=C(C=[OH+])C(O)=CCN1C=CN=C1 Intermediate Fragment 
130 179.0451185041 O=C1CC(N2C=CN=C2)OC1=C=[OH+]
131 112.0505382321 CC(=O)N=C[NH2+]C#N
132 294.1196804121 CC(=O)[NH+]=C(N=C=N)C1=CN(C2CC(O)C(CO)O2)C=N1 Intermediate Fragment 
133 294.1196804121 C=NC([NH+]=C(C)O)=C1N=CN(C2CC(O)C(=CO)O2)C1=N Intermediate Fragment 
134 294.1196804121 C=NC1=C(C(N)=[NH+]C(C)=O)N=CN1C1CC(O)C(=CO)O1 Intermediate Fragment 
135 294.1196804121 CC(O)=[NH+]C1=CC(N(C=N)C2CC(O)C(=CO)O2)=NC=N1 Intermediate Fragment 
136 277.0931313161 CC(O)=[NH+]C1=CC(N(C)C2C=C(O)C(=C=O)O2)=NC=N1
137 140.0818383601 CC(O)[NH2+]C1=CC=NC=N1
138 138.0661882961 CC(O)=[NH+]C1=CC=NC=N1
139 120.0556236121 C=C=[NH+]C1=CC=NC=N1
140 136.0505382321 C=CN=C=NC#[N+]C(C)=O Intermediate Fragment 
141 294.1196804121 CC(O)=[NH+]C1=C(N=C=NC2CC(O)C(CO)O2)C=NC=N1 Intermediate Fragment 
142 294.1196804121 C=NC1=C([NH+]=C(C)O)N=CN=C1N=C1CC(O)C(CO)O1 Intermediate Fragment 
143 294.1196804121 CC(O)=[NH+]C1=C2N=CN(CCC(O)C(=O)CO)C2=NC=N1 Intermediate Fragment 
144 276.1091157281 CC(O)=[NH+]C1=C2N=CN(CCC(O)C#CO)C2=NC=N1
145 258.0985510441 C#CC(O)=CCN1C=NC2=C([NH+]=C(C)O)N=CN=C21
146 234.0985510441 CC(O)=[NH+]C1=C2N=CN(CC=CO)C2=NC=N1
147 232.0829009801 CC(O)=[NH+]C1=C2N=CN(CC#CO)C2=NC=N1
148 258.0985510441 CC(O)=[NH+]C1=C2N=CN(CC=CC#CO)C2=NC=N1
149 238.1298511721 CC(O)=[NH+]C1=C2NCN(CCCO)C2=NC=N1
150 236.1142011081 CC(O)=[NH+]C1=C2N=CN(CCCO)C2=NC=N1
151 218.1036364241 C=CCN1C=NC2=C([NH+]=C(C)O)N=CN=C21
152 192.0879863601 [NH3+]C1=C2N=CN(CC=CO)C2=NC=N1
153 204.0879863601 C=CN1C=NC2=C([NH+]=C(C)O)N=CN=C21
154 190.0723362961 [CH2+]C(O)=NC1=C2N=CN(C)C2=NC=N1
155 206.1036364241 CCN1C=NC2=C([NH+]=C(C)O)N=CN=C21
156 204.0879863601 C=CN1C=NC=C1N=C=NC=[NH+]C(C)=O Intermediate Fragment 
157 202.0723362961 C#CN1C=NC2=C([NH+]=C(C)O)N=CN=C21
158 202.0723362961 C#CN1C=NC=C1N=C=NC=[NH+]C(C)=O Intermediate Fragment 
159 91.0389705041 OCC(=[OH+])CO
160 294.1196804121 CC(O)=[NH+]C1=C2N=CN(COC(=CO)C(C)O)C2=NC=N1 Intermediate Fragment 
161 294.1196804121 CC(O)=[NH+]C1=C2N=CN(C(C)OC(=CO)CO)C2=NC=N1 Intermediate Fragment 
162 218.0672509161 [CH2+]C(O)=NC1=C2N=CN(C(C)=O)C2=NC=N1
163 220.0829009801 CC(=O)N1C=NC2=C([NH+]=C(C)O)N=CN=C21
164 222.0985510441 CC(O)=[NH+]C1=C2N=CN(C(C)O)C2=NC=N1
165 204.0879863601 C=C=[NH+]C1=C2N=CN(C(C)O)C2=NC=N1
166 224.1142011081 CC(O)=[NH+]C1=C2NCN(C(C)O)C2=NC=N1
167 226.1298511721 CC(O)[NH2+]C1=C2NCN(C(C)O)C2=NC=N1
168 264.1091157281 CC(O)=[NH+]C1=C2N=CN(C(C)OC=CO)C2=NC=N1
169 294.1196804121 CC(O)=[NH+]C1=C2N=CN(C(CCO)OC=CO)C2=NC=N1 Intermediate Fragment 
170 47.0491412641 CC[OH2+]
171 29.0385765801 C=[CH3+]
172 45.0334912001 C=C[OH2+]
173 248.0778156001 CC(O)=[NH+]C1=C2N=CN(C(=O)C=CO)C2=NC=N1
174 250.0934656641 CC(O)=[NH+]C1=C2N=CN(C(=O)CCO)C2=NC=N1
175 252.1091157281 CC(O)=[NH+]C1=C2N=CN(C(O)CCO)C2=NC=N1
176 234.0985510441 C=C=[NH+]C1=C2N=CN(C(O)CCO)C2=NC=N1
177 250.0934656641 CC(O)=[NH+]C1=C2N=CN(COC=CO)C2=NC=N1
178 294.1196804121 CC(O)=[NH+]C1=C2N=CN(C(=O)CC(O)CCO)C2=NC=N1 Intermediate Fragment 
179 68.9971056921 [O+]#CC#CO
180 71.0127557561 O=CC#C[OH2+]
181 43.0178411361 C#C[OH2+]
182 55.0178411361 C#CC=[OH+]
183 210.0985510441 CC(O)=[NH+]C1=C2NCN(CO)C2=NC=N1
184 208.0829009801 CC(O)=[NH+]C1=C2N=CN(CO)C2=NC=N1
185 206.0672509161 CC(O)=[NH+]C1=C2N=CN(C=O)C2=NC=N1
186 206.0672509161 CC(=O)[NH+]=CN=C=NC1=CN=CN1C=O Intermediate Fragment 
187 204.0516008521 CC(O)=NC1=C2N=CN(C#[O+])C2=NC=N1
188 87.0440558841 CC(O)C#C[OH2+]
189 69.0334912001 C=CC#C[OH2+]
190 71.0491412641 C#CC(C)[OH2+]
191 71.0491412641 CCC#C[OH2+]
192 91.0753560121 CC(O)CC[OH2+]
193 73.0647913281 C=CC(C)[OH2+]
194 73.0647913281 CCC=C[OH2+]
