#In-silico ESI-MS/MS [M+H]+ Spectra
#PREDICTED BY CFM-ID 4.0.8
#SMILES=N12C=Nc3c(C1=NC=C(C2)C=O)ncn3[C@@H]1O[C@H](CO)[C@@H](C1)O
#InChiKey=DKFDLBWYVAAYOI-GMTAPVOTSA-N
energy0
202.07234 100.00 30 33 46 72 64 37 67 60 69 59 44 55 52 32 (65.301 0.13563 0.07885 0.060666 0.046367 0.021636 0.0070834 0.0036935 0.0036561 0.0035067 0.0030035 0.0029438 0.0010831 0.00036205)
318.11968 41.37 0 171 162 135 92 88 132 97 89 111 104 153 154 125 102 110 94 130 (26.559 0.39733 0.11124 0.070366 0.0081811 0.0044213 0.0034495 0.0031655 0.0023583 0.0021783 0.0017451 0.0015519 0.0013021 0.00084779 0.00068099 0.00064149 0.00043959 0.00013934)
energy1
202.07234 100.00 30 46 60 69 64 37 72 55 59 67 32 33 44 52 (82.028 0.6092 0.35704 0.2694 0.23203 0.2086 0.17333 0.16825 0.14514 0.08101 0.07362 0.070356 0.057168 0.054589)
energy2
43.01784 3.91 175 (0.93657)
45.03349 10.25 165 (2.4545)
55.01784 4.20 176 (1.0056)
57.03349 24.63 23 (5.8978)
59.04914 5.86 178 (1.4021)
71.04914 11.10 190 191 (1.8411 0.81624)
94.03997 7.92 39 (1.8956)
134.04612 15.56 50 (3.7252)
148.06177 3.55 49 53 (0.78836 0.062784)
172.06177 24.32 2 (5.8227)
174.07742 15.56 3 (3.7255)
175.06144 11.56 35 65 114 68 (0.99699 0.83837 0.66332 0.27022)
178.10872 4.24 75 (1.0156)
184.06177 7.99 31 (1.9126)
186.07742 24.79 14 (5.9355)
200.05669 5.48 29 185 71 45 36 (0.69471 0.26369 0.15626 0.14944 0.047951)
202.07234 100.00 30 46 69 37 60 44 72 33 55 59 64 67 52 32 (8.1363 3.6869 3.1267 2.8902 1.5959 1.0457 0.66948 0.6072 0.58211 0.49567 0.48189 0.33646 0.16601 0.12492)
204.08799 4.35 73 (1.0418)
226.07234 5.68 141 (1.3596)
228.08799 4.64 140 158 (0.63243 0.4798)
242.10364 3.77 145 (0.90172)
248.11420 10.31 159 (2.4678)
249.09822 4.69 105 (1.1236)
250.12985 10.31 160 (2.4678)
262.12985 4.54 143 (1.0881)
272.11420 7.78 7 10 6 (0.85261 0.72217 0.28843)

0 318.1196804121 OCC1OC(n2cnc3c2N=CN2CC(C=[OH+])=CN=C32)CC1O
1 286.0934656641 OC1CC(N2C=NC3=C2N=CN2CC=CN=C32)OC1=C=[OH+]
2 172.0617716121 C1=C[NH+]2C=NC3=NC=NC3=C2N=C1
3 174.0774216761 C1=C[NH+]2C=NC3NC=NC3=C2N=C1
4 288.1091157281 OC1CC(N2C=NC3=C2N=CN2CC=CN=C32)OC1=C[OH2+]
5 290.1247657921 OC1CC(N2C=NC3=C2N=CN2CC=CN=C32)OC1C[OH2+]
6 272.1142011081 C=C1OC(N2C=NC3=C2N=CN2CC=CN=C32)CC1[OH2+]
7 272.1142011081 [OH2+]C=C1CCC(N2C=NC3=C2N=CN2CC=CN=C32)O1
8 290.1247657921 CC(OC(=C[OH2+])CO)N1C=NC2=C1N=CN1CC=CN=C21 Intermediate Fragment 
9 290.1247657921 O=C(CC(O)CC[OH2+])N1C=NC2=C1N=CN1CC=CN=C21 Intermediate Fragment 
10 272.1142011081 OC(C#C[OH2+])CCN1C=NC2=C1N=CN1CC=CN=C21
11 75.0440558841 OCC=C[OH2+]
12 89.0597059481 CC(O)C=C[OH2+]
13 300.1091157281 CC1=CN=C2C3=C(N=CN2C1)N(C1CC(O)C(=C=[OH+])O1)C=N3
14 186.0774216761 [CH4+]C1=CN2C=NC3=NC=NC3=C2N=C1
15 119.0702706321 OC1CCOC1C[OH2+]
16 101.0597059481 C=C1OCCC1[OH2+]
17 101.0597059481 [OH2+]C=C1CCCO1
18 119.0702706321 O=CCC(O)CC[OH2+] Intermediate Fragment 
19 117.0546205681 OC=CC(O)CC=[OH+]
20 99.0440558841 C=C1OCC=C1[OH2+]
21 117.0546205681 CCC(O)C(=O)C=[OH+] Intermediate Fragment 
22 99.0440558841 CC=C(O)C#C[OH2+]
23 57.0334912001 CC#C[OH2+]
24 117.0546205681 OCCCOC#C[OH2+] Intermediate Fragment 
25 115.0389705041 OC1CCOC1=C=[OH+]
26 87.0440558841 [OH2+]C1=COCC1
27 113.0233204401 O=C1CCOC1=C=[OH+]
28 111.0076703761 O=C1C=COC1=C=[OH+]
29 200.0566862321 [O+]#CC1=CN=C2C3=C(N=CN2C1)NC=N3
30 202.0723362961 [OH+]=CC1=CN=C2C3=C(N=CN2C1)NC=N3
31 184.0617716121 [CH2+]C1=CN2C=NC3=NC=NC3=C2N=C1
32 202.0723362961 CN1C=C(C#[O+])C=NC1=C1N=CNC1=N Intermediate Fragment 
33 202.0723362961 N=CN1CC(C#[O+])=CN=C1C1=CNC=N1 Intermediate Fragment 
34 173.0457872001 [O+]#CC1=CN=C(C2=CNC=N2)N=C1
35 175.0614372641 [OH+]=CC1=CN=C(C2=CNC=N2)N=C1
36 200.0566862321 N#CN1CC(C#[O+])=CN=C1C1=CNC=N1
37 202.0723362961 [O+]#CC1=CN=CN(C=NC2=CN=CN2)C1 Intermediate Fragment 
38 96.0556236121 C=[NH+]C1=CN=CN1
39 94.0399735481 C#[N+]C1=CN=CN1
40 107.0239891361 [O+]#CC1=CN=CN=C1
41 109.0396392001 [OH+]=CC1=CN=CN=C1
42 69.0447245801 C1=C[NH+]=CN1
43 134.0348881681 N#CN1C=NC=C(C#[O+])C1
44 202.0723362961 C=NC1=C(C2=NC=C(C=[OH+])C=N2)N=CN1 Intermediate Fragment 
45 200.0566862321 C#[N+]C1=C(C2=NC=C(C=O)C=N2)N=CN1
46 202.0723362961 C=C(C#[O+])CN1C=NC2=C(N=CN2)C1=N Intermediate Fragment 
47 186.0410361681 N=C1C2=C(N=CN1C#CC#[O+])NC=N2
48 150.0774216761 CN1C=NC2=C(N=CN2)C1=[NH2+]
49 148.0617716121 [CH2+]N1C=NC2=C(N=CN2)C1=N
50 134.0461215481 [NH2+]=C1N=CN=C2N=CN=C12
51 69.0334912001 C=C(C)C#[O+]
52 202.0723362961 CN=C1C2=C(N=CN1C=C=C=[OH+])NC=N2 Intermediate Fragment 
53 148.0617716121 C[NH+]=C1N=CN=C2N=CN=C21
54 146.0461215481 C=[N+]=C1N=CN=C2N=CN=C21
55 202.0723362961 CN1C=NC2=C(N=CN2)C1=NC=C=C=[OH+] Intermediate Fragment 
56 133.0508725801 [CH2+]N1C=NC2=NC=NC2=C1
57 135.0665226441 [CH4+]N1C=NC2=NC=NC2=C1
58 160.0617716121 C#[N+]C1=C2N=CN=C2N=CN1C
59 202.0723362961 CC(=C=NC1=C2N=CNC2=NC=N1)C=[OH+] Intermediate Fragment 
60 202.0723362961 N=C=C(C#[O+])CN1C=NC2=C(C1)N=CN2 Intermediate Fragment 
61 171.0301371361 [O+]#CC#CN1C=NC2=NC=NC2=C1
62 121.0508725801 C1=NC2=NC=[NH+]CC2=N1
63 82.0287401681 C=C(C#[NH+])C=O
64 202.0723362961 N=C=NC1=CC2=NC=C(C=[OH+])CN2C=N1 Intermediate Fragment 
65 175.0614372641 [NH2+]=C1C=C2N=CC(C=O)=CN2C=N1
66 160.0505382321 [O+]#CC1=CN=C2C=CN=CN2C1
67 202.0723362961 N=C=NC1=CN=CN2CC(C=[OH+])=CN=C12 Intermediate Fragment 
68 175.0614372641 NC1=CN=CN2CC(C#[O+])=CN=C12
69 202.0723362961 C=NC1=C(N)N=CN2CC(C#[O+])=CN=C12 Intermediate Fragment 
70 173.0457872001 N=C1C=C2N=CC(C#[O+])=CN2C=N1
71 200.0566862321 C#[N+]C1=C2N=CC(C=O)=CN2C=NC1=N
72 202.0723362961 C=NC1=C(N)C2=NC=C(C#[O+])CN2C=N1 Intermediate Fragment 
73 204.0879863601 [OH+]=CC1=CN=C2C3=C(N=CN2C1)NCN3
74 206.1036364241 [OH2+]CC1=CN=C2C3=C(N=CN2C1)NCN3
75 178.1087218041 C1=NC2=C(NCN2)C2=NCCC[NH+]12
76 208.1192864881 [OH2+]CC1CN=C2C3=C(N=CN2C1)NCN3
77 176.0930717401 C1=CN=C2C3=C(N=C[NH+]2C1)NCN3
78 180.1243718681 C1=NC2=C(NCN2)C2NCCC[NH+]12
79 190.1087218041 [CH4+]C1=CN=C2C3=C(N=CN2C1)NCN3
80 208.1192864881 C=NC1=C(C2=NC=C(C[OH2+])CN2)NCN1 Intermediate Fragment 
81 208.1192864881 C=C(C[OH2+])CN1C=NC2=C(NCN2)C1=N Intermediate Fragment 
82 286.0934656641 OC1=COC(N2C=NC3=C2N=CN2CC(C=[OH+])=CN=C32)C1
83 288.1091157281 OC1COC(N2C=NC3=C2N=CN2CC(C=[OH+])=CN=C32)C1
84 290.1247657921 OC1COC(N2CNC3=C2N=CN2CC(C=[OH+])=CN=C32)C1
85 300.1091157281 C=C1OC(N2C=NC3=C2N=CN2CC(C=[OH+])=CN=C32)CC1O
86 300.1091157281 CC(=O)C(O)=CCN1C=NC2=C1N=CN1CC(C=[OH+])=CN=C21 Intermediate Fragment 
87 300.1091157281 OC=C1CCC(N2C=NC3=C2N=CN2CC(C=[OH+])=CN=C32)O1
88 318.1196804121 CN1C=C(C=[OH+])C=NC1=C1N=CN(C2CC(O)C(=CO)O2)C1=N Intermediate Fragment 
89 318.1196804121 N=CN1CC(C=[OH+])=CN=C1C1=CN(C2CC(O)C(=CO)O2)C=N1 Intermediate Fragment 
90 291.1087813801 OC=C1OC(N2C=NC(C3=NC=C(C=[OH+])CN3)=C2)CC1O
91 183.0764186321 OC1CC(N2C=CN=C2)OC1=C[OH2+]
92 318.1196804121 OC=C1OC(N2C=NC=C2N=CN2C=NC=C(C=[OH+])C2)CC1O Intermediate Fragment 
93 136.0505382321 [NH+]#CN1C=NC=C(C=O)C1
94 318.1196804121 C=NC1=C(C2=NC=C(C=[OH+])CN2)N=CN1C1CC(O)C(=CO)O1 Intermediate Fragment 
95 210.0873176641 C=[NH+]C1=CN=CN1C1CC(O)C(=CO)O1
96 212.1029677281 C=[NH+]C1=CN=CN1C1CC(O)C(CO)O1
97 318.1196804121 C=C(C=[OH+])CN1C=NC2=C(N=CN2C2CC(O)C(=CO)O2)C1=N Intermediate Fragment 
98 250.0934656641 [NH3+]C1=C2N=CN(C3CC(O)C(=CO)O3)C2=NC=N1
99 250.0934656641 [NH3+]C1=C2N=CN(CCC(O)C(=O)C=O)C2=NC=N1 Intermediate Fragment 
100 250.0934656641 [NH3+]C1=C2N=CN(C(=O)CC(O)C=CO)C2=NC=N1 Intermediate Fragment 
101 248.0778156001 [NH3+]C1=C2N=CN(C3CC(O)C(=C=O)O3)C2=NC=N1
102 318.1196804121 CN=C1C2=C(N=CN1C=C=C=[OH+])N(C1CC(O)C(CO)O1)C=N2 Intermediate Fragment 
103 264.1091157281 C=[NH+]C1=C2N=CN(C3CC(O)C(CO)O3)C2=NC=N1
104 318.1196804121 CN1C=NC2=C(N=CN2C2CC(O)C(CO)O2)C1=NC=C=C=[OH+] Intermediate Fragment 
105 249.0982166961 CN1C=NC2=C(C1)N=CN2C1CC(O)C(=C=[OH+])O1
106 264.1091157281 CN1C=NC2=C(N=CN2C2CC(O)C(=CO)O2)C1=[NH2+]
107 264.1091157281 CN1C=NC2=C(N=CN2C(=O)CC(O)C=CO)C1=[NH2+] Intermediate Fragment 
108 266.1247657921 CN1C=NC2=C(N=CN2C2CC(O)C(CO)O2)C1=[NH2+]
109 276.1091157281 C[NH+]=C1C2=C(N=CN1C)N(C1CC(O)C(=C=O)O1)C=N2
110 318.1196804121 CC(=C=NC1=C2N=CN(C3CC(O)C(CO)O3)C2=NC=N1)C=[OH+] Intermediate Fragment 
111 318.1196804121 N=C=C(C=[OH+])CN1C=NC2=C(C1)N=CN2C1CC(O)C(=CO)O1 Intermediate Fragment 
112 301.0931313161 C=C(C=[OH+])CN1C=NC2=C(C1)N=CN2C1C=C(O)C(=C=O)O1
113 291.1087813801 OCC1OC(N2C=NC3=C2N=CN(C#CC=[OH+])C3)CC1O
114 175.0614372641 [OH+]=CC#CN1C=NC2=C(C1)N=CN2
115 289.0931313161 OC=C1OC(N2C=NC3=C2N=CN(C#CC=[OH+])C3)CC1O
116 287.0774812521 O=C=C1OC(N2C=NC3=C2N=CN(C#CC=[OH+])C3)CC1O
117 251.1138667601 CN1C=NC2=C(C1)N=CN2C1CC(O)C(=C[OH2+])O1
118 233.1033020761 C=C1OC(N2C=NC3=C2N=CN(C)C3)C=C1[OH2+]
119 233.1033020761 CN1C=NC2=C(C1)N=CN2C1CCC(=C=[OH+])O1
120 251.1138667601 CN1C=NC2=C(C1)N=CN2C(=O)CC(O)C=C[OH2+] Intermediate Fragment 
121 239.1138667601 OC1CC(N2CNC3=CN=CN=C32)OC1C[OH2+]
122 237.0982166961 OC1CC(N2C=NC3=CN=CN=C32)OC1C[OH2+]
123 237.0982166961 O=C(CC(O)CC[OH2+])N1C=NC2=CN=CN=C21 Intermediate Fragment 
124 84.0443902321 C=C(C#[NH+])CO
125 318.1196804121 N=CN(C1=CC2=NC=C(C=[OH+])CN2C=N1)C1CC(O)C(=CO)O1 Intermediate Fragment 
126 301.0931313161 C[NH+](C1=CC2=NC=C(C=O)CN2C=N1)C1C=C(O)C(=C=O)O1
127 291.1087813801 O=CC1=CN=C2C=C([NH+]=C3CC(O)C(CO)O3)N=CN2C1
128 162.0661882961 [OH+]=CC1=CN=C2C=CN=CN2C1
129 159.0764186321 [NH+]#CNC1CC(O)C(CO)O1
130 318.1196804121 OCC1OC(N=C=NC2=CN=CN3CC(C=[OH+])=CN=C23)CC1O Intermediate Fragment 
131 144.0655196001 C=[NH+]C1CC(O)C(=CO)O1
132 318.1196804121 C=NC1=C(N=C2CC(O)C(CO)O2)N=CN2CC(C=[OH+])=CN=C12 Intermediate Fragment 
133 189.0770873281 C=[NH+]C1=CN=CN2CC(C=O)=CN=C12
134 187.0614372641 C#[N+]C1=CN=CN2CC(C=O)=CN=C12
135 318.1196804121 O=C(CO)C(O)CCN1C=NC2=C1N=CN1CC(C=[OH+])=CN=C21 Intermediate Fragment 
136 300.1091157281 OC#CC(O)CCN1C=NC2=C1N=CN1CC(C=[OH+])=CN=C21
137 282.0985510441 C#CC(O)=CCN1C=NC2=C1N=CN1CC(C=[OH+])=CN=C21
138 258.0985510441 OC=CCN1C=NC2=C1N=CN1CC(C=[OH+])=CN=C21
139 256.0829009801 OC#CCN1C=NC2=C1N=CN1CC(C=[OH+])=CN=C21
140 228.0879863601 C=CN1C=NC2=C1N=CN1CC(C=[OH+])=CN=C21
141 226.0723362961 C#CN1C=NC2=C1N=CN1CC(C=[OH+])=CN=C21
142 282.0985510441 OC#CC=CCN1C=NC2=C1N=CN1CC(C=[OH+])=CN=C21
143 262.1298511721 OCCCN1CNC2=C1N=CN1CC(C=[OH+])=CN=C21
144 260.1142011081 OCCCN1C=NC2=C1N=CN1CC(C=[OH+])=CN=C21
145 242.1036364241 C=CCN1C=NC2=C1N=CN1CC(C=[OH+])=CN=C21
146 234.1349365521 CCN1CNC2=C1N=CN1CC(C[OH2+])=CN=C21
147 232.1192864881 CCN1CNC2=C1N=CN1CC(C=[OH+])=CN=C21
148 230.1036364241 CCN1C=NC2=C1N=CN1CC(C=[OH+])=CN=C21
149 212.0930717401 C#CN1C=NC2=C1N=CN1CC([CH4+])=CN=C21
150 91.0389705041 OCC(=[OH+])CO
151 220.1192864881 CN1CNC2=C1N=CN1CC(C[OH2+])=CN=C21
152 218.1036364241 CN1CNC2=C1N=CN1CC(C=[OH+])=CN=C21
153 318.1196804121 CC(O)C(=CO)OCN1C=NC2=C1N=CN1CC(C=[OH+])=CN=C21 Intermediate Fragment 
154 318.1196804121 CC(OC(=CO)CO)N1C=NC2=C1N=CN1CC(C=[OH+])=CN=C21 Intermediate Fragment 
155 242.0672509161 CC(=O)N1C=NC2=C1N=CN1CC(C#[O+])=CN=C21
156 244.0829009801 CC(=O)N1C=NC2=C1N=CN1CC(C=[OH+])=CN=C21
157 246.0985510441 CC(O)N1C=NC2=C1N=CN1CC(C=[OH+])=CN=C21
158 228.0879863601 [CH2+]C1=CN=C2C3=C(N=CN2C1)N(C(C)=O)C=N3
159 248.1142011081 CC(O)N1CNC2=C1N=CN1CC(C=[OH+])=CN=C21
160 250.1298511721 CC(O)N1CNC2=C1N=CN1CC(C[OH2+])=CN=C21
161 288.1091157281 CC(OC=CO)N1C=NC2=C1N=CN1CC(C=[OH+])=CN=C21
162 318.1196804121 OC=COC(CCO)N1C=NC2=C1N=CN1CC(C=[OH+])=CN=C21 Intermediate Fragment 
163 47.0491412641 CC[OH2+]
164 29.0385765801 C=[CH3+]
165 45.0334912001 C=C[OH2+]
166 272.0778156001 O=C(C=CO)N1C=NC2=C1N=CN1CC(C=[OH+])=CN=C21
167 274.0934656641 O=C(CCO)N1C=NC2=C1N=CN1CC(C=[OH+])=CN=C21
168 276.1091157281 OCCC(O)N1C=NC2=C1N=CN1CC(C=[OH+])=CN=C21
169 274.0934656641 OC=COCN1C=NC2=C1N=CN1CC(C=[OH+])=CN=C21
170 272.0778156001 OC#COCN1C=NC2=C1N=CN1CC(C=[OH+])=CN=C21
171 318.1196804121 O=C(CC(O)CCO)N1C=NC2=C1N=CN1CC(C=[OH+])=CN=C21 Intermediate Fragment 
172 68.9971056921 [O+]#CC#CO
173 71.0127557561 O=CC#C[OH2+]
174 73.0284058201 OCC#C[OH2+]
175 43.0178411361 C#C[OH2+]
176 55.0178411361 C#CC=[OH+]
177 77.0597059481 OCCC[OH2+]
178 59.0491412641 C=CC[OH2+]
179 234.0985510441 OCN1CNC2=C1N=CN1CC(C=[OH+])=CN=C21
180 216.0879863601 CN1C=NC2=C1N=CN1CC(C=[OH+])=CN=C21
181 232.0829009801 OCN1C=NC2=C1N=CN1CC(C=[OH+])=CN=C21
182 214.0723362961 CN1C=NC2=C1N=CN1CC(C#[O+])=CN=C21
183 230.0672509161 O=CN1C=NC2=C1N=CN1CC(C=[OH+])=CN=C21
184 228.0516008521 O=CN1C=NC2=C1N=CN1CC(C#[O+])=CN=C21
185 200.0566862321 [O+]#CN1C=NC2=C1N=CN1CC=CN=C21
186 228.0516008521 C=NC1=C(N=C=O)N=CN2CC(C#[O+])=CN=C12 Intermediate Fragment 
187 87.0440558841 CC(O)C#C[OH2+]
188 69.0334912001 C#CC(=C)[OH2+]
189 69.0334912001 C=CC#C[OH2+]
190 71.0491412641 C#CC(C)[OH2+]
191 71.0491412641 CCC#C[OH2+]
192 91.0753560121 CC(O)CC[OH2+]
193 73.0647913281 C=CC(C)[OH2+]
194 73.0647913281 CCC=C[OH2+]
195 316.1040303481 O=C(CC(O)C=CO)N1C=NC2=C1N=CN1CC(C=[OH+])=CN=C21
