#In-silico ESI-MS/MS [M+H]+ Spectra
#PREDICTED BY CFM-ID 4.0.8
#SMILES=N12C=Nc3c(C1=NCC2O)ncn3[C@H]1C[C@H]([C@H](O1)CO)O
#InChiKey=ZJKZWKPXHMKGKA-AIPQFCGWSA-N
energy0
178.07234 100.00 15 31 26 50 40 18 22 43 36 46 34 28 16 (48.047 0.12158 0.077473 0.042829 0.032734 0.021506 0.0085787 0.0050008 0.0039832 0.0025811 0.0023864 0.0014628 0.00020083)
294.11968 78.22 0 80 179 103 180 105 154 93 76 99 71 74 78 95 94 70 98 (37.263 0.16485 0.15285 0.12206 0.039577 0.026068 0.025563 0.01282 0.0098009 0.0068035 0.0020431 0.0018086 0.0015976 0.0011895 0.00031743 0.00025241 0.0001955)
energy1
160.06177 66.18 2 127 (37.102 2.9493e-06)
178.07234 100.00 15 31 46 22 40 28 36 18 50 34 26 43 16 (52.831 2.0184 0.17688 0.15533 0.15235 0.14409 0.12568 0.1241 0.1138 0.075951 0.061627 0.05319 0.027983)
energy2
45.03349 5.83 10 (1.5199)
57.03349 4.31 167 (1.1252)
94.03997 5.21 24 (1.3588)
134.04612 73.48 32 (19.165)
148.06177 10.56 33 112 (2.2127 0.54253)
151.06144 4.92 48 44 19 (0.81098 0.29553 0.17674)
160.06177 45.30 2 127 (11.355 0.45847)
162.07742 9.99 3 (2.6053)
164.09307 4.07 55 (1.0614)
176.05669 13.64 14 39 21 17 49 27 (1.6815 0.81982 0.6587 0.18315 0.12584 0.088417)
178.07234 100.00 36 15 46 18 34 26 22 50 28 31 16 40 43 (15.352 4.1867 1.9148 0.95858 0.78534 0.47903 0.45915 0.40999 0.38403 0.33124 0.31737 0.29511 0.20605)
180.08799 6.54 51 53 52 (1.2122 0.3406 0.15388)
182.10364 4.42 54 59 57 56 58 (0.75423 0.17065 0.10295 0.070972 0.052875)
190.07234 4.52 104 139 (1.0252 0.15466)
234.09855 16.75 88 140 137 138 (4.3141 0.037154 0.01513 0.0024023)

0 294.1196804121 OCC1OC(n2cnc3c2N=CN2C3=NCC2[OH2+])CC1O
1 276.1091157281 OC1CC(N2C=NC3=C2N=CN2C=CN=C32)OC1C[OH2+]
2 160.0617716121 C1=C[NH+]2C=NC3=C(N=CN3)C2=N1
3 162.0774216761 C1=C[NH+]2C=NC3=C(NCN3)C2=N1
4 119.0702706321 OC1CCOC1C[OH2+]
5 119.0702706321 C=CC(O)C(O)C[OH2+] Intermediate Fragment 
6 117.0546205681 OC1C=COC1C[OH2+]
7 99.0440558841 CC1=C([OH2+])C=CO1
8 99.0440558841 [OH2+]CC1=CC=CO1
9 117.0546205681 C=COC(=CO)C[OH2+] Intermediate Fragment 
10 45.0334912001 C=C[OH2+]
11 117.0546205681 OC=C=C(O)CC[OH2+] Intermediate Fragment 
12 115.0389705041 OC1=C(C[OH2+])OC=C1
13 87.0440558841 [OH2+]C1C=COC1
14 176.0566862321 [OH2+]C1=CN=C2C3=C(N=CN12)NC=N3
15 178.0723362961 [OH2+]C1=CN=C2C3=C(N=CN12)NCN3
16 178.0723362961 CN1C(=[OH+])C=NC1=C1N=CNC1=N Intermediate Fragment 
17 176.0566862321 [CH2+]N1C(=O)C=NC1=C1N=CNC1=N
18 178.0723362961 N=CN1C([OH2+])=CN=C1C1=CNC=N1 Intermediate Fragment 
19 151.0614372641 [OH+]=C1C=NC(C2=CNC=N2)N1
20 161.0457872001 [CH2+]N1C(=O)C=NC1=C1C=NC=N1
21 176.0566862321 [NH+]#CN1C(O)=CN=C1C1=CNC=N1
22 178.0723362961 [OH2+]C1=CN=CN1C=NC1=CN=CN1 Intermediate Fragment 
23 96.0556236121 C=[NH+]C1=CN=CN1
24 94.0399735481 C#[N+]C1=CN=CN1
25 85.0396392001 [OH+]=C1C=NCN1
26 178.0723362961 C=NC1=C(C2=NC=C([OH2+])N2)N=CN1 Intermediate Fragment 
27 176.0566862321 C#[N+]C1=C(C2=NC=C(O)N2)N=CN1
28 178.0723362961 N=C=C([OH2+])N1C=NC2=C(C1)N=CN2 Intermediate Fragment 
29 123.0665226441 C1=[NH+]CC2=NCNC2=N1
30 121.0508725801 C1=NC2=NC=[NH+]CC2=N1
31 178.0723362961 [OH2+]C=C=NC1=C2NCNC2=NC=N1 Intermediate Fragment 
32 134.0461215481 [NH2+]=C1N=CN=C2N=CN=C12
33 148.0617716121 C=[NH+]C1=C2N=CNC2=NC=N1
34 178.0723362961 CN=C1C2=C(N=CN1C=[OH+])NC=N2 Intermediate Fragment 
35 150.0774216761 C=[NH+]C1=C2NCNC2=NC=N1
36 178.0723362961 C=C([OH2+])N1C=NC2=C(N=CN2)C1=N Intermediate Fragment 
37 161.0457872001 [CH+]=C(O)N1C=NC2=NC=NC2=C1
38 136.0617716121 [NH2+]=C1N=CN=C2NCN=C12
39 176.0566862321 [CH+]=C(O)N1C=NC2=C(N=CN2)C1=N
40 178.0723362961 N=CNC1=CC2=NC=C([OH2+])N2C=N1 Intermediate Fragment 
41 161.0457872001 C#[N+]C1=CC2=NC=C(O)N2C=N1
42 136.0505382321 [OH2+]C1=CN=C2C=CN=CN12
43 178.0723362961 NC=NC1=CN=CN2C([OH2+])=CN=C12 Intermediate Fragment 
44 151.0614372641 [NH3+]C1=CN=CN2C(O)=CN=C12
45 161.0457872001 C#[N+]C1=CN=CN2C(O)=CN=C12
46 178.0723362961 C=NC1=C(N)N=CN2C([OH2+])=CN=C12 Intermediate Fragment 
47 149.0457872001 [NH2+]=C1C=C2N=CC(=O)N2C=N1
48 151.0614372641 [NH3+]C1C=C2N=CC(=O)N2C=N1
49 176.0566862321 C#[N+]C1=C(N)N=CN2C(O)=CN=C12
50 178.0723362961 C=NC1=C(N)C2=NC=C([OH2+])N2C=N1 Intermediate Fragment 
51 180.0879863601 [OH2+]C1CN=C2C3=C(N=CN21)NCN3
52 180.0879863601 N=CN1C([OH2+])=CN=C1C1=CNCN1 Intermediate Fragment 
53 180.0879863601 C=C([OH2+])N1C=NC2=C(NCN2)C1=N Intermediate Fragment 
54 182.1036364241 [OH2+]C1CNC2C3=C(N=CN12)NCN3
55 164.0930717401 C1=NC2=C(NCN2)C2=NCC[NH+]12
56 182.1036364241 [OH2+]C1CN=CN1C=NC1=CNCN1 Intermediate Fragment 
57 182.1036364241 C=NC1=C(C2=NCC([OH2+])N2)NCN1 Intermediate Fragment 
58 182.1036364241 [OH2+]CCNC1=C2NCNC2=NC=N1 Intermediate Fragment 
59 182.1036364241 CC([OH2+])N1C=NC2=C(NCN2)C1=N Intermediate Fragment 
60 140.0930717401 [NH3+]C1N=CN=C2NCNC21
61 184.1192864881 [OH2+]C1CNC2C3NCNC3N=CN12
62 262.0934656641 OC1COC(N2C=NC3=C2N=CN2C([OH2+])=CN=C32)C1
63 264.1091157281 OC1COC(N2CNC3=C2N=CN2C([OH2+])=CN=C32)C1
64 266.1247657921 OC1COC(N2CNC3=C2N=CN2C3=NCC2[OH2+])C1
65 276.1091157281 CC1OC(N2C=NC3=C2N=CN2C([OH2+])=CN=C32)CC1O
66 276.1091157281 OCC1CCC(N2C=NC3=C2N=CN2C([OH2+])=CN=C32)O1
67 276.1091157281 OCC1CCC(N2CNC3=C(N=C=C=[OH+])N=CN=C32)O1 Intermediate Fragment 
68 276.1091157281 OCCCC=C(O)N1C=NC2=C1N=CN1C([OH2+])=CN=C21 Intermediate Fragment 
69 258.0985510441 OCCCC#CN1C=NC2=C1N=CN1C([OH2+])=CN=C21
70 294.1196804121 CN1C(=[OH+])C=NC1=C1N=CN(C2CC(O)C(CO)O2)C1=N Intermediate Fragment 
71 294.1196804121 N=CN1C([OH2+])=CN=C1C1=CN(C2CC(O)C(CO)O2)C=N1 Intermediate Fragment 
72 267.1087813801 OCC1OC(N2C=NC(C3=NC=C([OH2+])N3)=C2)CC1O
73 183.0764186321 OC1C=C(N2C=CN=C2)OC1C[OH2+]
74 294.1196804121 OCC1OC(N2C=NC=C2N=CN2C=NC=C2[OH2+])CC1O Intermediate Fragment 
75 210.0873176641 C=[NH+]C1=CN=CN1C1=CC(O)C(CO)O1
76 294.1196804121 C=NC1=C(C2=NC=C([OH2+])N2)N=CN1C1CC(O)C(CO)O1 Intermediate Fragment 
77 212.1029677281 C=[NH+]C1=CN=CN1C1CC(O)C(CO)O1
78 294.1196804121 N=C=C([OH2+])N1C=NC2=C(C1)N=CN2C1CC(O)C(CO)O1 Intermediate Fragment 
79 237.0982166961 OC1CC(N2C=NC3=CN=CN=C32)OC1C[OH2+]
80 294.1196804121 OCC1OC(N2CNC3=C(N=C=C[OH2+])N=CN=C32)CC1O Intermediate Fragment 
81 248.0778156001 [NH3+]C1=C2N=CN(C3=CC(O)=C(CO)O3)C2=NC=N1
82 250.0934656641 [NH3+]C1=C2N=CN(C3=CC(O)C(CO)O3)C2=NC=N1
83 250.0934656641 [NH3+]C1=C2N=CN(C=C=C(O)C(O)CO)C2=NC=N1 Intermediate Fragment 
84 250.0934656641 [NH3+]C1=C2N=CN(C(O)=C=C(O)CCO)C2=NC=N1 Intermediate Fragment 
85 250.0934656641 [NH3+]C1=C2N=CN(C(=C=CO)OCCO)C2=NC=N1 Intermediate Fragment 
86 252.1091157281 [NH3+]C1=C2N=CN(C3CC(O)C(CO)O3)C2=NC=N1
87 252.1091157281 [NH3+]C1=C2N=CN(C=CC(O)C(O)CO)C2=NC=N1 Intermediate Fragment 
88 234.0985510441 [NH3+]C1=C2N=CN(C#CC(O)CCO)C2=NC=N1
89 252.1091157281 [NH3+]C1=C2N=CN(C(O)=CC(O)CCO)C2=NC=N1 Intermediate Fragment 
90 252.1091157281 [NH3+]C1=C2N=CN(C(=CCO)OCCO)C2=NC=N1 Intermediate Fragment 
91 264.1091157281 C=[NH+]C1=C2N=CN(C3CC(O)C(CO)O3)C2=NC=N1
92 266.1247657921 C=[NH+]C1=C2NCN(C3CC(O)C(CO)O3)C2=NC=N1
93 294.1196804121 CN=C1C2=C(N=CN1C=[OH+])N(C1CC(O)C(CO)O1)C=N2 Intermediate Fragment 
94 294.1196804121 C=C([OH2+])N1C=NC2=C(N=CN2C2CC(O)C(CO)O2)C1=N Intermediate Fragment 
95 294.1196804121 N=CN(C1=CC2=NC=C([OH2+])N2C=N1)C1CC(O)C(CO)O1 Intermediate Fragment 
96 277.0931313161 C[NH+](C1=CC2=NC=C(O)N2C=N1)C1=CC(O)=C(CO)O1
97 159.0764186321 [NH+]#CNC1CC(O)C(CO)O1
98 294.1196804121 OCC1OC(NC=NC2=CN=CN3C([OH2+])=CN=C23)CC1O Intermediate Fragment 
99 294.1196804121 C=NC1=C(NC2CC(O)C(CO)O2)N=CN2C([OH2+])=CN=C12 Intermediate Fragment 
100 267.1087813801 OCC1OC([NH2+]C2=CC3=NC=C(O)N3C=N2)CC1O
101 165.0770873281 C[NH2+]C1=CN=CN2C(O)=CN=C12
102 163.0614372641 C=[NH+]C1=CN=CN2C(O)=CN=C12
103 294.1196804121 CC(O)C(CO)OCN1C=NC2=C1N=CN1C([OH2+])=CN=C21 Intermediate Fragment 
104 190.0723362961 CN1C=NC2=C1N=CN1C([OH2+])=CN=C21
105 294.1196804121 OCC(O)C(O)CCN1C=NC2=C1N=CN1C([OH2+])=CN=C21 Intermediate Fragment 
106 105.0546205681 C=C(O)C([OH2+])CO
107 87.0440558841 C=C(O)C=C[OH2+]
108 188.0566862321 [CH2+]N1C=NC2=C1N=CN1C(O)=CN=C21
109 192.0879863601 CN1CNC2=C1N=CN1C([OH2+])=CN=C21
110 192.0879863601 CN1CNC2=C(N=C=C[OH2+])N=CN=C21 Intermediate Fragment 
111 192.0879863601 C=C([OH2+])N1C=NC2=C(N=CN2C)C1=N Intermediate Fragment 
112 148.0617716121 [CH2+]N1C=NC2=C(N)N=CN=C21
113 192.0879863601 CN(C=N)C1=CC2=NC=C([OH2+])N2C=N1 Intermediate Fragment 
114 194.1036364241 CN1CNC2=C1N=CN1C2=NCC1[OH2+]
115 196.1192864881 CN1CNC2=C1N=CN1C([OH2+])CNC21
116 93.0546205681 OCC([OH2+])CO
117 75.0440558841 CC([OH2+])=CO
118 91.0389705041 OC=C([OH2+])CO
119 61.0284058201 OCC=[OH+]
120 73.0284058201 OC#CC[OH2+]
121 59.0127557561 OC#C[OH2+]
122 73.0284058201 CC([OH2+])=C=O
123 89.0233204401 O=CC([OH2+])=CO
124 87.0076703761 O=C=C([OH2+])C=O
125 202.0723362961 C=CN1C=NC2=C1N=CN1C([OH2+])=CN=C21
126 202.0723362961 CCN1C=NC2=C(N=C=C=[OH+])N=CN=C21 Intermediate Fragment 
127 160.0617716121 C#CN1C=NC2=C([NH3+])N=CN=C21
128 202.0723362961 C#CN1C=NC2=C1N=CN(C(=C)[OH2+])C2=N Intermediate Fragment 
129 204.0879863601 CCN1C=NC2=C1N=CN1C([OH2+])=CN=C21
130 204.0879863601 C=CN1C=NC2=C1N=CN(C(=C)[OH2+])C2=N Intermediate Fragment 
131 206.1036364241 CCN1CNC2=C1N=CN1C([OH2+])=CN=C21
132 208.1192864881 CCN1CNC2=C1N=CN1C2=NCC1[OH2+]
133 210.1349365521 CCN1CNC2=C1N=CN1C([OH2+])CNC21
134 63.0440558841 OCC[OH2+]
135 232.0829009801 OCC=CN1C=NC2=C1N=CN1C([OH2+])=CN=C21
136 232.0829009801 OCCCN1C=NC2=C(N=C=C=[OH+])N=CN=C21 Intermediate Fragment 
137 234.0985510441 OCCCN1C=NC2=C1N=CN1C([OH2+])=CN=C21
138 234.0985510441 OCCCN1CNC2=C(N=C=C=[OH+])N=CN=C21 Intermediate Fragment 
139 190.0723362961 [NH3+]C1=C2N=CN(C#CCO)C2=NC=N1
140 234.0985510441 C=C([OH2+])N1C=NC2=C(N=CN2C=CCO)C1=N Intermediate Fragment 
141 192.0879863601 [NH3+]C1=C2N=CN(C=CCO)C2=NC=N1
142 236.1142011081 OCCCN1CNC2=C1N=CN1C([OH2+])=CN=C21
143 218.1036364241 CCCN1C=NC2=C1N=CN1C([OH2+])=CN=C21
144 236.1142011081 OCCCN1CNC2=C(N=C=C[OH2+])N=CN=C21 Intermediate Fragment 
145 236.1142011081 C=C([OH2+])N1C=NC2=C(N=CN2CCCO)C1=N Intermediate Fragment 
146 238.1298511721 OCCCN1CNC2=C1N=CN1C2=NCC1[OH2+]
147 276.1091157281 OCCC(O)C=CN1C=NC2=C1N=CN1C([OH2+])=CN=C21
148 103.0753560121 C=CC(O)CC[OH2+]
149 230.0672509161 OCC#CN1C=NC2=C1N=CN1C([OH2+])=CN=C21
150 258.0985510441 CCC(O)C#CN1C=NC2=C1N=CN1C([OH2+])=CN=C21
151 276.1091157281 OCCC(O)CCN1C=NC2=C(N=C=C=[OH+])N=CN=C21 Intermediate Fragment 
152 248.1142011081 C=[NH+]C1=C2N=CN(C=CC(O)CCO)C2=NC=N1
153 292.1040303481 OCC(O)C(O)C=CN1C=NC2=C1N=CN1C([OH2+])=CN=C21
154 294.1196804121 OCCC(O)CC(O)N1C=NC2=C1N=CN1C([OH2+])=CN=C21 Intermediate Fragment 
155 91.0753560121 CC(O)CC[OH2+]
156 73.0647913281 C=C([OH2+])CC
157 89.0597059481 C=C(O)CC[OH2+]
158 71.0491412641 C=CC(=C)[OH2+]
159 71.0491412641 C#CCC[OH2+]
160 204.0516008521 O=CN1C=NC2=C1N=CN1C([OH2+])=CN=C21
161 206.0672509161 OCN1C=NC2=C1N=CN1C([OH2+])=CN=C21
162 208.0829009801 OCN1CNC2=C1N=CN1C([OH2+])=CN=C21
163 210.0985510441 OCN1CNC2=C1N=CN1C2=NCC1[OH2+]
164 77.0597059481 OCCC[OH2+]
165 59.0491412641 CC=C[OH2+]
166 75.0440558841 OC=CC[OH2+]
167 57.0334912001 CC#C[OH2+]
168 55.0178411361 [CH2+]C#CO
169 218.0672509161 C=C(O)N1C=NC2=C1N=CN1C([OH2+])=CN=C21
170 220.0829009801 CC(O)N1C=NC2=C1N=CN1C([OH2+])=CN=C21
171 222.0985510441 CC(O)N1CNC2=C1N=CN1C([OH2+])=CN=C21
172 224.1142011081 CC(O)N1CNC2=C1N=CN1C2=NCC1[OH2+]
173 226.1298511721 CC(O)N1CNC2=C1N=CN1C([OH2+])CNC21
174 47.0491412641 CC[OH2+]
175 248.0778156001 OCC=C(O)N1C=NC2=C1N=CN1C([OH2+])=CN=C21
176 250.0934656641 OCCC(O)N1C=NC2=C1N=CN1C([OH2+])=CN=C21
177 252.1091157281 OCCC(O)N1CNC2=C1N=CN1C([OH2+])=CN=C21
178 292.1040303481 OCCC(O)C=C(O)N1C=NC2=C1N=CN1C([OH2+])=CN=C21
179 294.1196804121 OCCOC(CCO)N1C=NC2=C1N=CN1C([OH2+])=CN=C21 Intermediate Fragment 
180 294.1196804121 CC(OC(CO)CO)N1C=NC2=C1N=CN1C([OH2+])=CN=C21 Intermediate Fragment 
