#In-silico ESI-MS/MS [M+H]+ Spectra
#PREDICTED BY CFM-ID 4.0.8
#SMILES=[nH]1c(nc2c(c1=O)[n+](cn2[C@@H]1O[C@H](CO)[C@@H](C1)O)C/C=C/c1ccc2c(c1)OCO2)N
#InChiKey=BLTALQXJCJKFAQ-HGXOGYBISA-O
energy0
282.09855 25.00 13 76 (3.5059 2.6323)
284.11420 16.13 82 75 32 (2.8102 1.1183 0.031292)
312.10912 94.78 14 73 80 86 84 28 56 47 46 33 53 64 50 55 39 40 65 51 72 (20.946 1.1545 0.78425 0.19988 0.0601 0.031559 0.021836 0.018478 0.01344 0.012034 0.0069914 0.0068958 0.0061746 0.0060887 0.0019386 0.001905 0.0014222 0.0013278 0.0012403)
314.12477 100.00 87 117 122 115 120 103 110 109 95 102 104 107 99 112 100 113 101 106 (16.684 4.711 0.90116 0.8552 0.44688 0.15645 0.14901 0.12952 0.11741 0.095411 0.081225 0.066749 0.058985 0.031 0.026295 0.020443 0.014971 0.010846)
410.14590 21.49 266 147 135 218 285 148 143 139 141 138 1 (1.6128 1.4638 0.93545 0.31416 0.28125 0.25267 0.16671 0.11514 0.11149 0.016794 0.0074507)
428.15646 78.57 0 265 287 217 290 280 204 232 247 251 216 234 208 261 264 211 213 262 215 229 214 230 (12.755 2.2951 1.7771 0.98363 0.36704 0.31406 0.23878 0.16397 0.13256 0.10305 0.050268 0.039618 0.017803 0.011835 0.010281 0.0096921 0.0093955 0.0077788 0.0044478 0.002121 0.00070943 0.00027697)
energy1
161.05971 34.06 17 163 161 158 159 162 (6.3157 0.66666 0.39637 0.31775 0.26643 0.16641)
166.07234 12.26 23 (2.9265)
266.10364 5.39 78 (1.2869)
280.08290 6.50 85 81 (1.423 0.12944)
282.09855 53.78 13 76 (7.1586 5.6792)
284.11420 17.39 82 75 32 (1.9684 1.4112 0.77192)
296.11420 17.94 119 116 88 (2.3168 1.626 0.33875)
297.09822 8.04 96 94 108 (1.422 0.43182 0.065166)
312.10912 100.00 14 80 73 84 28 33 86 50 53 47 56 40 55 64 39 46 65 72 51 (15.113 3.1911 2.6483 0.83642 0.43922 0.3263 0.24511 0.22267 0.2074 0.15259 0.1441 0.12285 0.08884 0.046271 0.026788 0.024757 0.015766 0.011695 0.0067902)
314.12477 73.53 87 117 115 95 104 110 99 103 107 120 112 122 109 101 100 102 113 106 (9.8304 2.1736 1.2951 0.58316 0.51196 0.48151 0.41164 0.36476 0.36091 0.34063 0.28585 0.27773 0.25018 0.16693 0.10036 0.069824 0.029085 0.018107)
396.13025 6.42 272 132 281 (1.4984 0.02275 0.011736)
energy2
77.03858 20.74 157 172 (1.1257 0.80532)
119.04914 10.90 176 174 (0.52847 0.48684)
135.04406 18.29 25 200 (0.87716 0.82556)
152.05669 27.88 19 (2.5962)
161.05971 27.80 17 159 161 158 163 162 (1.1426 0.58017 0.32137 0.3102 0.14734 0.086587)
163.07536 9.43 16 156 (0.50661 0.37168)
164.05669 15.06 22 (1.4018)
166.07234 95.95 23 (8.9338)
167.10666 12.56 124 154 155 (0.65003 0.28673 0.23285)
168.08799 26.15 92 (2.4347)
170.10364 11.25 125 (1.0477)
224.05669 25.41 63 (2.3659)
226.07234 60.90 62 (5.6705)
230.10364 33.62 259 249 (2.4597 0.67058)
240.08799 10.71 60 (0.99763)
242.10364 9.65 111 (0.89877)
264.08799 10.43 79 (0.97078)
266.10364 23.87 78 (2.2224)
268.11929 35.18 77 (3.276)
270.08732 13.27 30 (1.2353)
280.08290 12.09 85 81 (0.65961 0.46627)
282.09855 16.85 76 13 (1.0063 0.5626)
284.11420 11.49 75 32 82 (0.74097 0.2208 0.10844)
294.09855 16.13 74 83 15 (0.82963 0.50565 0.16641)
296.11420 15.50 88 116 119 (0.51526 0.48783 0.44013)
297.09822 10.94 94 96 108 (0.79712 0.13961 0.082318)
298.12985 12.68 286 267 (0.75002 0.43067)
312.10912 100.00 14 65 56 73 80 47 40 84 33 64 51 28 86 53 55 39 50 46 72 (3.3074 1.7882 0.92037 0.59559 0.36768 0.34611 0.33704 0.25838 0.22253 0.1943 0.17812 0.17195 0.16642 0.16303 0.088769 0.085689 0.06021 0.031441 0.027917)
314.12477 35.44 87 110 95 117 103 101 113 112 99 115 107 120 106 100 109 122 102 104 (0.85117 0.42508 0.24269 0.2064 0.19055 0.17915 0.1775 0.17557 0.14189 0.14152 0.12234 0.09394 0.090141 0.087117 0.066236 0.06004 0.026066 0.022739)
396.13025 15.00 272 281 132 (1.0607 0.33608 7.3348e-05)

0 428.1564598441 NC1=NC2=C(C(=O)N1)[N+](CC=CC1=CC=C3OCOC3=C1)=CN2C1CC(O)C(CO)O1
1 410.1458951601 [NH3+]C1=NC=C2C(=N1)N(C1C=C(O)C(=C=O)O1)CN2C#CC=C1CCC2OCOC2C1
2 119.0702706321 OC1CCOC1C[OH2+]
3 119.0702706321 O=CCC(O)CC[OH2+] Intermediate Fragment 
4 117.0546205681 OC1CCOC1=C[OH2+]
5 99.0440558841 C=C1OCC=C1[OH2+]
6 117.0546205681 CCC(O)C(=O)C=[OH+] Intermediate Fragment 
7 99.0440558841 CC=C(O)C#C[OH2+]
8 117.0546205681 O=CCC(O)C=C[OH2+] Intermediate Fragment 
9 310.0934656641 [NH3+]C1=NC(O)=C2C(=N1)N=CN2C#CC=C1C=CC2=C(C1)OCO2
10 310.0934656641 NC(=NC#[O+])N=C1CN(C#CC=C2C=CC3=C(C2)OCO3)C=N1 Intermediate Fragment 
11 310.0934656641 [NH3+]C1=NC(O)=C2C(=N1)N=CN2C#CC=C1C=CC(OC=O)=CC1 Intermediate Fragment 
12 310.0934656641 [NH3+]C1=NC(O)=C2C(=N1)N=CN2C#CC=C1C=CC=C(OC=O)C1 Intermediate Fragment 
13 282.0985510441 [NH3+]C1=NC(O)=C2C(=N1)N=CN2C#CC=C1C=CC=C(O)C1
14 312.1091157281 [NH3+]C1=NC(O)=C2C(=N1)N=CN2C#CC=C1C=CC2OCOC2C1
15 294.0985510441 [NH3+]C1=NC=C2C(=N1)N=CN2C#CC=C1C=CC2=C(C1)OCO2
16 163.0753560121 [CH2+]#CC=C1C=CC2OCOC2C1
17 161.0597059481 [CH2+]#CC=C1C=CC2=C(C1)OCO2
18 159.0440558841 [C+]#CC=C1C=CC2=C(C1)OCO2
19 152.0566862321 [NH3+]C1=NC(=O)C2=NCNC2=N1
20 147.0440558841 [CH2+]#CC1=CC=C2OCOC2=C1
21 145.0284058201 [C+]#CC1=CC=C2OCOC2=C1
22 164.0566862321 [CH2+]N1C=NC2=NC(N)=NC(O)=C21
23 166.0723362961 CN1C=NC2=NC([NH3+])=NC(O)=C21
24 137.0597059481 [CH3+]=C1C=CC2=C(C1)OCO2
25 135.0440558841 [CH+]=C1C=CC2=C(C1)OCO2
26 176.0566862321 C#CN1C=NC2=NC([NH3+])=NC(O)=C21
27 295.0825666321 [OH2+]C1=C2C(=NC=N1)N=CN2C#CC=C1C=CC2=C(C1)OCO2
28 312.1091157281 N=C([NH3+])N=C1N=CN(C#CC=C2C=CC3OCOC3C2)C1=C=O Intermediate Fragment 
29 295.0825666321 N=C=[NH+]C1=C(C=O)N(C#CC=C2C=CC3=C(C2)OCO3)C=N1
30 270.0873176641 [NH2+]=C1N=CN(C#CC=C2C=CC3OCOC3C2)C1=C=O
31 253.0607685681 [O+]#CC1=CN=CN1C#CC=C1C=CC2=C(C1)OCO2
32 284.1142011081 NC(=[NH2+])N=C1CN(C#CC=C2C=CC3=C(C2)OCO3)C=N1
33 312.1091157281 [NH3+]C(=NC=O)N=C1CN(C#CC=C2C=CC3=C(C2)OCO3)C=N1 Intermediate Fragment 
34 269.1033020761 NC=[NH+]C1=CN(C#CC=C2C=CC3=C(C2)OCO3)C=N1
35 267.0876520121 N=C=[NH+]C1=CN(C#CC=C2C=CC3=C(C2)OCO3)C=N1
36 242.0924030441 [NH2+]=C1CN(C#CC=C2C=CC3=C(C2)OCO3)C=N1
37 227.0815040121 C(C=C1C=CC2=C(C1)OCO2)#[CH+]N1C=CN=C1
38 225.0658539481 C(#CN1C=CN=C1)[C+]=C1C=CC2=C(C1)OCO2
39 312.1091157281 NC([NH3+])=NC(=O)C1=CN=CN1C#CC=C1C=CC2=C(C1)OCO2 Intermediate Fragment 
40 312.1091157281 N=C1N=CN(C#CC=C2C=CC3=C(C2)OCO3)C1=C(O)N=C[NH3+] Intermediate Fragment 
41 285.0982166961 N=C1N=CN(C#CC=C2C=CC3=C(C2)OCO3)C1=C([NH3+])O
42 240.0767529801 N=C1CN(C#C[C+]=C2C=CC3=C(C2)OCO3)C=N1
43 244.1080531081 [NH2+]=C1CN(C#CC=C2C=CC3OCOC3C2)C=N1
44 266.0560175361 N=C1N=CN(C#C[C+]=C2C=CC3=C(C2)OCO3)C1=C=O
45 268.0716676001 [NH2+]=C1N=CN(C#CC=C2C=CC3=C(C2)OCO3)C1=C=O
46 312.1091157281 NC(=O)C1=C(N=C[NH3+])N=CN1C#CC=C1C=CC2=C(C1)OCO2 Intermediate Fragment 
47 312.1091157281 C=NC1=NC([NH3+])=NC(O)=C1N=C=C=C=C1C=CC2OCOC2C1 Intermediate Fragment 
48 139.0614372641 C=[NH+]C1=NC(N)=NC(O)=C1
49 285.0982166961 NC1=NC(O)=C([NH+]=C=C=CC2C=CC3=C(C2)OCO3)C=N1
50 312.1091157281 [NH3+]C1=NC(O)=CC(N=C=NC#CC=C2C=CC3OCOC3C2)=N1 Intermediate Fragment 
51 312.1091157281 N=CN(C#CC=C1C=CC2=C(C1)OCO2)C1=C(O)N=C([NH3+])N=C1 Intermediate Fragment 
52 199.0502038841 N#C[NH+]=C=C=CC1=CC=C2OCOC2=C1
53 312.1091157281 CN(C#C[C+]=C1C=CC2=C(C1)OCO2)C1=C(O)N=C(N)N=C1N Intermediate Fragment 
54 186.0549549161 C#[N+]C#CC=C1C=CC2=C(C1)OCO2
55 312.1091157281 C=C1OCOC1=CC(C)=CC#CN1C=NC2=NC([NH3+])=NC(O)=C21 Intermediate Fragment 
56 312.1091157281 C=CC(=CC#CN1C=NC2=NC([NH3+])=NC(O)=C21)CC1=COCO1 Intermediate Fragment 
57 282.0621655361 NC1=NC(O)=C2C(=N1)N=CN2C#CC#C[CH+]C1=COCO1
58 284.0778156001 [NH3+]C1=NC(O)=C2C(=N1)N=CN2C#CC#CCC1=COCO1
59 286.0934656641 [NH3+]C1=NC(O)=C2C(=N1)N=CN2C#CC#CCC1COCO1
60 240.0879863601 C#CC(C)=CC#CN1C=NC2=NC([NH3+])=NC(O)=C21
61 238.0723362961 C#CC(C)=[C+]C#CN1C=NC2=NC(N)=NC(O)=C21
62 226.0723362961 C=CC#CC#CN1C=NC2=NC([NH3+])=NC(O)=C21
63 224.0566862321 C#CC#CC#CN1C=NC2=NC([NH3+])=NC(O)=C21
64 312.1091157281 CC(C=C=C1COCO1)=CC#CN1C=NC2=NC([NH3+])=NC(O)=C21 Intermediate Fragment 
65 312.1091157281 CC1OCOC1C=CC#CC#CN1C=NC2=NC([NH3+])=NC(O)=C21 Intermediate Fragment 
66 200.0566862321 C#CC#CN1C=NC2=NC([NH3+])=NC(O)=C21
67 202.0723362961 C=CC#CN1C=NC2=NC([NH3+])=NC(O)=C21
68 212.0566862321 [CH2+]C#CC#CN1C=NC2=NC(N)=NC(O)=C21
69 214.0723362961 CC#CC#CN1C=NC2=NC([NH3+])=NC(O)=C21
70 296.0778156001 [NH3+]C1=NC(O)=C2C(=N1)N=CN2C#CC#CC#CC1COCO1
71 310.0934656641 CC1OCOC1C#CC#CC#CN1C=NC2=NC([NH3+])=NC(O)=C21
72 312.1091157281 C=CC1OCOC1CC#CC#CN1C=NC2=NC([NH3+])=NC(O)=C21 Intermediate Fragment 
73 312.1091157281 [NH3+]C1=NC(O)=C2C(=N1)N=CN2C#CC=C1C=CC(OCO)=CC1 Intermediate Fragment 
74 294.0985510441 C=[O+]C1=CCC(=CC#CN2C=NC3=NC(N)=NC(O)=C32)C=C1
75 284.1142011081 [NH3+]C1=NC(O)=C2C(=N1)N=CN2C#CC=C1C=CC(O)CC1
76 282.0985510441 [NH3+]C1=NC(O)=C2C(=N1)N=CN2C#CC=C1C=CC(O)=CC1
77 268.1192864881 [NH3+]C1=NC(O)=C2C(=N1)N=CN2C#CC=C1C=CCCC1
78 266.1036364241 [NH3+]C1=NC(O)=C2C(=N1)N=CN2C#CC=C1C=CC=CC1
79 264.0879863601 NC1=NC(O)=C2C(=N1)N=CN2C#C[C+]=C1C=CC=CC1
80 312.1091157281 [NH3+]C1=NC(O)=C2C(=N1)N=CN2C#CC=C1C=CC=C(OCO)C1 Intermediate Fragment 
81 280.0829009801 NC1=NC(O)=C2C(=N1)N=CN2C#C[C+]=C1C=CC=C(O)C1
82 284.1142011081 [NH3+]C1=NC(O)=C2C(=N1)N=CN2C#CC=C1C=CCC(O)C1
83 294.0985510441 C=[O+]C1=CC=CC(=CC#CN2C=NC3=NC(N)=NC(O)=C32)C1
84 312.1091157281 COC1=C(O)C=CC(=CC#CN2C=NC3=NC([NH3+])=NC(O)=C32)C1 Intermediate Fragment 
85 280.0829009801 NC1=NC(O)=C2C(=N1)N=CN2C#C[C+]=C1C=CC(O)=CC1
86 312.1091157281 COC1=C(O)CC(=CC#CN2C=NC3=NC([NH3+])=NC(O)=C32)C=C1 Intermediate Fragment 
87 314.1247657921 [NH3+]C1=NC(O)=C2C(=N1)N=CN2C#CC=C1CCC2OCOC2C1
88 296.1142011081 [NH3+]C1=NC=C2C(=N1)N=CN2C#CC=C1C=CC2OCOC2C1
89 165.0910060761 [CH2+]#CC=C1CCC2OCOC2C1
90 154.0723362961 [NH3+]C1=NC(=O)C2NCNC2=N1
91 149.0597059481 [CH2+]#CC1=CC=C2OCOC2C1
92 168.0879863601 CN1CNC2=NC([NH3+])=NC(O)=C21
93 178.0723362961 C=CN1C=NC2=NC([NH3+])=NC(O)=C21
94 297.0982166961 [OH2+]C1=C2C(=NC=N1)N=CN2C#CC=C1C=CC2OCOC2C1
95 314.1247657921 N=C([NH3+])N=C1N=CN(C#CC=C2CCC3OCOC3C2)C1=C=O Intermediate Fragment 
96 297.0982166961 NC=[NH+]C1=C(C=O)N(C#CC=C2C=CC3=C(C2)OCO3)C=N1
97 255.0764186321 [OH+]=CC1=CN=CN1C#CC=C1C=CC2=C(C1)OCO2
98 286.1298511721 NC(=[NH2+])N=C1CN(C#CC=C2C=CC3OCOC3C2)C=N1
99 314.1247657921 [NH3+]C(=NC=O)N=C1CN(C#CC=C2C=CC3OCOC3C2)C=N1 Intermediate Fragment 
100 314.1247657921 NC([NH3+])=NC(=O)C1=CN=CN1C#CC=C1C=CC2OCOC2C1 Intermediate Fragment 
101 314.1247657921 N=C1N=CN(C#CC=C2C=CC3OCOC3C2)C1=C(O)N=C[NH3+] Intermediate Fragment 
102 314.1247657921 NC(=O)C1=C(N=C[NH3+])N=CN1C#CC=C1C=CC2OCOC2C1 Intermediate Fragment 
103 314.1247657921 C=NC1=NC([NH3+])=NC(O)=C1N=C=C=C=C1CCC2OCOC2C1 Intermediate Fragment 
104 314.1247657921 [NH3+]C1=NC(O)=CC(N=C=NC#CC=C2CCC3OCOC3C2)=N1 Intermediate Fragment 
105 188.0706049801 C=[NH+]C#CC=C1C=CC2=C(C1)OCO2
106 314.1247657921 N=CN(C#CC=C1C=CC2OCOC2C1)C1=C(O)N=C([NH3+])N=C1 Intermediate Fragment 
107 314.1247657921 CN(C#CC=C1C=CC2=C(C1)OCO2)C1=C(O)N=C([NH3+])N=C1N Intermediate Fragment 
108 297.0982166961 C=[N+](C#CC=C1C=CC2=C(C1)OCO2)C1=C(O)N=C(N)N=C1
109 314.1247657921 C=C1OCOC1CC(C)=CC#CN1C=NC2=NC([NH3+])=NC(O)=C21 Intermediate Fragment 
110 314.1247657921 C=CC(=CC#CN1C=NC2=NC([NH3+])=NC(O)=C21)CC1COCO1 Intermediate Fragment 
111 242.1036364241 C=CC(C)=CC#CN1C=NC2=NC([NH3+])=NC(O)=C21
112 314.1247657921 CC(C=CC1COCO1)=CC#CN1C=NC2=NC([NH3+])=NC(O)=C21 Intermediate Fragment 
113 314.1247657921 CC1OCOC1CCC#CC#CN1C=NC2=NC([NH3+])=NC(O)=C21 Intermediate Fragment 
114 228.0879863601 CCC#CC#CN1C=NC2=NC([NH3+])=NC(O)=C21
115 314.1247657921 [NH3+]C1=NC(O)=C2C(=N1)N=CN2C#CC=C1C=CC(OCO)CC1 Intermediate Fragment 
116 296.1142011081 COC1=CCC(=CC#CN2C=NC3=NC([NH3+])=NC(O)=C32)C=C1
117 314.1247657921 [NH3+]C1=NC(O)=C2C(=N1)N=CN2C#CC=C1C=CCC(OCO)C1 Intermediate Fragment 
118 286.1298511721 [NH3+]C1=NC(O)=C2C(=N1)N=CN2C#CC=C1CCCC(O)C1
119 296.1142011081 COC1=CC=CC(=CC#CN2C=NC3=NC([NH3+])=NC(O)=C32)C1
120 314.1247657921 COC1CC(=CC#CN2C=NC3=NC([NH3+])=NC(O)=C32)C=CC1O Intermediate Fragment 
121 298.0934656641 [NH3+]C1=NC(O)=C2C(=N1)N=CN2C#CC=C1C=CC(O)=C(O)C1
122 314.1247657921 COC1C=CC(=CC#CN2C=NC3=NC([NH3+])=NC(O)=C32)CC1O Intermediate Fragment 
123 316.1404158561 [NH3+]C1=NC(O)=C2C(=N1)N=CN2C#CCC1CCC2OCOC2C1
124 167.1066561401 [CH2+]#CCC1CCC2OCOC2C1
125 170.1036364241 CN1CNC2=NC([NH3+])=NC(O)C21
126 318.1560659201 [NH3+]C1=NC(O)=C2C(=N1)N=CN2C=CCC1CCC2OCOC2C1
127 169.1223062041 [CH3+]=CCC1CCC2OCOC2C1
128 153.0910060761 [CH2+]#CC1CCC2OCOC2C1
129 172.1192864881 CN1CNC2NC([NH3+])=NC(O)C21
130 318.1560659201 CCC(CC#CN1C=NC2=NC([NH3+])=NC(O)=C21)CC1COCO1 Intermediate Fragment 
131 318.1560659201 [NH3+]C1=NC(O)=C2C(=N1)N=CN2C#CCC1CCCC(OCO)C1 Intermediate Fragment 
132 396.1302450961 [NH3+]C1=NC(O)=C2C(=N1)N(C1CC(O)=CO1)CN2C#CC=C1C=CC2=C(C1)OCO2
133 398.1458951601 [NH3+]C1=NC(O)=C2C(=N1)N(C1CC(O)=CO1)CN2C#CC=C1C=CC2OCOC2C1
134 400.1615452241 [NH3+]C1=NC(O)=C2C(=N1)N(C1CC(O)=CO1)CN2C#CC=C1CCC2OCOC2C1
135 410.1458951601 C=C1OC(N2CN(C#CC=C3C=CC4OCOC4C3)C3=C(O)N=C([NH3+])N=C32)C=C1O
136 392.1353304761 C=C1C=CC(N2CN(C#CC=C3C=CC4=C(C3)OCO4)C3=C(O)N=C([NH3+])N=C32)O1
137 264.1091157281 C=C1OC(N2CN(C)C3=C(O)N=C([NH3+])N=C32)CC1=O
138 410.1458951601 CC(=O)C(O)=CCN1CN(C#CC=C2C=CC3=C(C2)OCO3)C2=C(O)N=C([NH3+])N=C21 Intermediate Fragment 
139 410.1458951601 C#COC(C=C=O)N1CN(C#CC=C2CCC3OCOC3C2)C2=C(O)N=C([NH3+])N=C21 Intermediate Fragment 
140 368.1353304761 [NH3+]C1=NC(O)=C2C(=N1)N(CC#CO)CN2C#CC=C1C=CC2OCOC2C1
141 410.1458951601 C=C1OC(N2CN(C#CC=C3C=CC(OCO)=CC3)C3=C(O)N=C([NH3+])N=C32)C=C1O Intermediate Fragment 
142 382.1509805401 C=C1OC(N2CN(C#CC=C3C=CC(O)CC3)C3=C(O)N=C([NH3+])N=C32)C=C1O
143 410.1458951601 C=C1OC(N2CN(C#CC=C3C=CC=C(OCO)C3)C3=C(O)N=C([NH3+])N=C32)C=C1O Intermediate Fragment 
144 362.1247657921 [CH+]=C1OC(N2CN(C#CC=C3C=CC=CC3)C3=C(O)N=C(N)N=C32)C=C1O
145 364.1404158561 C=C1OC(N2CN(C#CC=C3C=CC=CC3)C3=C(O)N=C([NH3+])N=C32)C=C1O
146 382.1509805401 C=C1OC(N2CN(C#CC=C3C=CCC(O)C3)C3=C(O)N=C([NH3+])N=C32)C=C1O
147 410.1458951601 [NH3+]C1=NC(O)=C2C(=N1)N(C1C=CC(=C=O)O1)CN2C#CC=C1CCC2OCOC2C1
148 410.1458951601 [NH3+]C1=NC(O)=C2C(=N1)N(C1C=CC(=C=O)O1)CN2C#CC=C1C=CCC(OCO)C1 Intermediate Fragment 
149 382.1509805401 [NH3+]C1=NC(O)=C2C(=N1)N(C1C=CC(=C=O)O1)CN2C#CC=C1CCCC(O)C1
150 169.1223062041 [CH2+]#CCC(C)CCC1COCO1 Intermediate Fragment 
151 169.1223062041 [CH2+]#CCC(CC)CC1COCO1 Intermediate Fragment 
152 169.1223062041 [CH2+]#CCC(C)CC1OCOC1C Intermediate Fragment 
153 169.1223062041 [CH2+]#CCC1CCCC(OCO)C1 Intermediate Fragment 
154 167.1066561401 [CH2+]#CC=CCCC1OCOC1C Intermediate Fragment 
155 167.1066561401 [CH2+]#CC=C(C)CCC1COCO1 Intermediate Fragment 
156 163.0753560121 [CH2+]#CC#CC=CC1OCOC1C Intermediate Fragment 
157 77.0385765801 C=CC#CC#[CH2+]
158 161.0597059481 [CH2+]#CC#CC=C=C1OCOC1C Intermediate Fragment 
159 161.0597059481 [C+]#CC=C(C=C)CC1=COCO1 Intermediate Fragment 
160 89.0385765801 [C+]#CC=C(C)C#C
161 161.0597059481 [CH2+]#CC=C1C=CC(OC=O)=CC1 Intermediate Fragment 
162 161.0597059481 [CH2+]#CC=C1C=CC=C(OC=O)C1 Intermediate Fragment 
163 161.0597059481 [C+]#CC=C1C=CC(O)=C(OC)C1 Intermediate Fragment 
164 266.0883802841 [NH3+]C1=NC(O)=C2N=CN(C3CC(O)C(=CO)O3)C2=N1
165 268.1040303481 [NH3+]C1=NC(O)=C2N=CN(C3CC(O)C(CO)O3)C2=N1
166 268.1040303481 [NH3+]C1=NC(O)=C2N=CN(C(=O)CC(O)CCO)C2=N1 Intermediate Fragment 
167 153.0910060761 [CH2+]#CC(=CC)CC1COCO1 Intermediate Fragment 
168 79.0542266441 C=C=C(C)C#[CH2+]
169 151.0753560121 [CH2+]#CC1=CCC2OCOC2C1
170 149.0597059481 [CH2+]#CC=C=C=C1OCOC1C Intermediate Fragment 
171 149.0597059481 C=C=C(C#[CH2+])CC1=COCO1 Intermediate Fragment 
172 77.0385765801 C#CC(=C)C#[CH2+]
173 149.0597059481 [CH2+]#CC1=CC=C(OCO)C=C1 Intermediate Fragment 
174 119.0491412641 C#CC1=CC=C([OH2+])C=C1
175 149.0597059481 [CH2+]#CC1=CC=CC(OCO)=C1 Intermediate Fragment 
176 119.0491412641 C#CC1=CC=CC([OH2+])=C1
177 147.0440558841 [C+]#CC(=C=C)CC1=COCO1 Intermediate Fragment 
178 75.0229265161 [C+]#CC(=C)C#C
179 145.0284058201 [C+]#CC1=CC=C(OC=O)C=C1 Intermediate Fragment 
180 101.0385765801 [C+]#CC1=CC=CC=C1
181 274.0570801561 [CH2+]N1CN(C2=CC(=O)C(=C=O)O2)C2=NC(N)=NC(O)=C21
182 276.0727302201 CN1CN(C2=CC(=O)C(=C=O)O2)C2=NC([NH3+])=NC(O)=C21
183 278.0883802841 CN1CN(C2CC(=O)C(=C=O)O2)C2=NC([NH3+])=NC(O)=C21
184 280.1040303481 CN1CN(C2CC(O)C(=C=O)O2)C2=NC([NH3+])=NC(O)=C21
185 280.1040303481 CN1CN(CC=C(O)C(=O)C=O)C2=NC([NH3+])=NC(O)=C21 Intermediate Fragment 
186 282.1196804121 CN1CN(C2CC(O)C(=CO)O2)C2=NC([NH3+])=NC(O)=C21
187 264.1091157281 CN1CN(C2CCC(=C=O)O2)C2=NC([NH3+])=NC(O)=C21
188 282.1196804121 CN1CN(CCC(O)C(=O)C=O)C2=NC([NH3+])=NC(O)=C21 Intermediate Fragment 
189 282.1196804121 CC(OC(=C=O)CO)N1CN(C)C2=C(O)N=C([NH3+])N=C21 Intermediate Fragment 
190 282.1196804121 CN1CN(C(=O)CC(O)C=CO)C2=NC([NH3+])=NC(O)=C21 Intermediate Fragment 
191 264.1091157281 CN1CN(CC=C(O)C#CO)C2=NC([NH3+])=NC(O)=C21
192 240.1091157281 CN1CN(C(=O)CCO)C2=NC([NH3+])=NC(O)=C21
193 238.0934656641 CN1CN(C(=O)C=CO)C2=NC([NH3+])=NC(O)=C21
194 236.0778156001 CN1CN(C(=O)C#CO)C2=NC([NH3+])=NC(O)=C21
195 210.0985510441 CC(=O)N1CN(C)C2=C(O)N=C([NH3+])N=C21
196 208.0829009801 [CH2+]C(=O)N1CN(C)C2=C(O)N=C(N)N=C21
197 196.0829009801 CN1CN(C=O)C2=NC([NH3+])=NC(O)=C21
198 194.0672509161 CN1CN(C#[O+])C2=NC(N)=NC(O)=C21
199 141.0910060761 [CH3+]=C1CCC2OCOC2C1
200 135.0440558841 [CH+]=C1C=CC(=O)C(OC)=C1 Intermediate Fragment 
201 292.1040303481 CCN1CN(C2C=C(O)C(=C=O)O2)C2=NC([NH3+])=NC(O)=C21
202 180.0879863601 CCN1C=NC2=NC([NH3+])=NC(O)=C21
203 411.1299107481 O=C=C1OC(N2CN(C#CC=C3CCC4OCOC4C3)C3=C([OH2+])N=CN=C32)C=C1O
204 428.1564598441 N=C([NH3+])N=C1C(=C=O)N(C#CCC2CCC3OCOC3C2)CN1C1C=C(O)C(=C=O)O1 Intermediate Fragment 
205 386.1346617801 [NH2+]=C1C(=C=O)N(C#CCC2CCC3OCOC3C2)CN1C1C=C(O)C(=C=O)O1
206 386.1346617801 [NH2+]=C1C(=C=O)N(C#CCC2CCC3OCOC3C2)CN1C(=O)C=C(O)C#CO Intermediate Fragment 
207 369.1081126841 O=C=C1OC(N2C=C(C=[OH+])N(C#CC=C3C=CC4OCOC4C3)C2)C=C1O
208 428.1564598441 [NH3+]C(=NC=O)N=C1CN(C#CC=C2CCC3OCOC3C2)CN1C1C=C(O)C(=C=O)O1 Intermediate Fragment 
209 385.1506461921 NC=[NH+]C1=CN(C#CC=C2CCC3OCOC3C2)CN1C1C=C(O)C(=C=O)O1
210 358.1397471601 [NH2+]=C1CN(C#CC=C2CCC3OCOC3C2)CN1C1C=C(O)C(=C=O)O1
211 428.1564598441 NC([NH3+])=NC(=O)C1=CN(C2C=C(O)C(=C=O)O2)CN1C#CC=C1CCC2OCOC2C1 Intermediate Fragment 
212 343.1288481281 OC1=CC(N2C=CN(C#CC=C3CCC4OCOC4C3)C2)OC1=C=[OH+]
213 428.1564598441 N=C1C(=C(O)N=C[NH3+])N(C#CC=C2CCC3OCOC3C2)CN1C1C=C(O)C(=C=O)O1 Intermediate Fragment 
214 428.1564598441 [NH3+]C1=NC(O)=CC(N(C=NC#CCC2CCC3OCOC3C2)C2C=C(O)C(=C=O)O2)=N1 Intermediate Fragment 
215 428.1564598441 [NH3+]C1=NC(O)=C(N(C#CCC2CCC3OCOC3C2)C=NC2C=C(O)C(=C=O)O2)C=N1 Intermediate Fragment 
216 428.1564598441 CN(C#CCC1CCC2OCOC2C1)C1=C(O)N=C([NH3+])N=C1N=C1C=C(O)C(=C=O)O1 Intermediate Fragment 
217 428.1564598441 [NH3+]C1=NC(O)=C2C(=N1)N(CC=C(O)C(=O)C=O)CN2C#CC=C1CCC2OCOC2C1 Intermediate Fragment 
218 410.1458951601 [NH3+]C1=NC(O)=C2C(=N1)N(CC=C(O)C#CO)CN2C#CC=C1C=CC2OCOC2C1
219 392.1353304761 C#CC(O)=CCN1CN(C#CC=C2C=CC3=C(C2)OCO3)C2=C(O)N=C([NH3+])N=C21
220 392.1353304761 [NH3+]C1=NC(O)=C2C(=N1)N(CC#CC#CO)CN2C#CC=C1C=CC2OCOC2C1
221 372.1666306041 [NH3+]C1=NC(O)=C2C(=N1)N(CC#CO)CN2C#CCC1CCC2OCOC2C1
222 370.1509805401 [NH3+]C1=NC(O)=C2C(=N1)N(CC#CO)CN2C#CC=C1CCC2OCOC2C1
223 366.1196804121 [NH3+]C1=NC(O)=C2C(=N1)N(CC#CO)CN2C#CC=C1C=CC2=C(C1)OCO2
224 344.1717159841 CCN1CN(C#CC=C2CCC3OCOC3C2)C2=C(O)N=C([NH3+])N=C21
225 342.1560659201 CCN1CN(C#CC=C2C=CC3OCOC3C2)C2=C(O)N=C([NH3+])N=C21
226 340.1404158561 CCN1CN(C#CC=C2C=CC3=C(C2)OCO3)C2=C(O)N=C([NH3+])N=C21
227 338.1247657921 C=CN1CN(C#CC=C2C=CC3=C(C2)OCO3)C2=C(O)N=C([NH3+])N=C21
228 336.1091157281 C#CN1CN(C#CC=C2C=CC3=C(C2)OCO3)C2=C(O)N=C([NH3+])N=C21
229 428.1564598441 C=C(O)C(=C=O)OCN1CN(C#CC=C2CCC3OCOC3C2)C2=C(O)N=C([NH3+])N=C21 Intermediate Fragment 
230 428.1564598441 CC(OC(=C=O)C=O)N1CN(C#CC=C2CCC3OCOC3C2)C2=C(O)N=C([NH3+])N=C21 Intermediate Fragment 
231 356.1353304761 CC(=O)N1CN(C#CC=C2C=CC3OCOC3C2)C2=C(O)N=C([NH3+])N=C21
232 428.1564598441 [NH3+]C1=NC(O)=C2C(=N1)N(C(C=C=O)OC#CO)CN2C#CCC1CCC2OCOC2C1 Intermediate Fragment 
233 386.1458951601 [NH3+]C1=NC(O)=C2C(=N1)N(C(=O)C#CO)CN2C#CCC1CCC2OCOC2C1
234 428.1564598441 [NH3+]C1=NC(O)=C2C(=N1)N(C(=O)C=C(O)C#CO)CN2C#CCC1CCC2OCOC2C1 Intermediate Fragment 
235 384.1302450961 [NH3+]C1=NC(O)=C2C(=N1)N(C(=O)C#CO)CN2C#CC=C1CCC2OCOC2C1
236 382.1145950321 [NH3+]C1=NC(O)=C2C(=N1)N(C(=O)C#CO)CN2C#CC=C1C=CC2OCOC2C1
237 360.1666306041 CC(=O)N1CN(C#CCC2CCC3OCOC3C2)C2=C(O)N=C([NH3+])N=C21
238 358.1509805401 CC(=O)N1CN(C#CC=C2CCC3OCOC3C2)C2=C(O)N=C([NH3+])N=C21
239 354.1196804121 CC(=O)N1CN(C#CC=C2C=CC3=C(C2)OCO3)C2=C(O)N=C([NH3+])N=C21
240 73.0284058201 OCC#C[OH2+]
241 75.0440558841 OCC=C[OH2+]
242 57.0334912001 C#CC[OH2+]
243 344.1353304761 [NH3+]C1=NC(O)=C2C(=N1)N(C=O)CN2C#CC=C1CCC2OCOC2C1
244 342.1196804121 [NH3+]C1=NC(O)=C2C(=N1)N(C=O)CN2C#CC=C1C=CC2OCOC2C1
245 340.1040303481 [NH3+]C1=NC(O)=C2C(=N1)N(C=O)CN2C#CC=C1C=CC2=C(C1)OCO2
246 338.0883802841 NC1=NC(O)=C2C(=N1)N(C#[O+])CN2C#CC=C1C=CC2=C(C1)OCO2
247 428.1564598441 CC(=CC#CN1CN(C2C=C(O)C(=C=O)O2)C2=NC([NH3+])=NC(O)=C21)CC1OCOC1C Intermediate Fragment 
248 342.1196804121 CC(C)=CC#CN1CN(C2C=C(O)C(=C=O)O2)C2=NC([NH3+])=NC(O)=C21
249 230.1036364241 CC(C)=CC#CN1C=NC2=NC([NH3+])=NC(O)=C21
250 340.1040303481 CC(C)=[C+]C#CN1CN(C2C=C(O)C(=C=O)O2)C2=NC(N)=NC(O)=C21
251 428.1564598441 CCC(=CC#CN1CN(C2C=C(O)C(=C=O)O2)C2=NC([NH3+])=NC(O)=C21)CC1COCO1 Intermediate Fragment 
252 398.1095096521 [NH3+]C1=NC(O)=C2C(=N1)N(C1C=C(O)C(=C=O)O1)CN2C#CC#CCC1COCO1
253 400.1251597161 [NH3+]C1=NC(O)=C2C(=N1)N(C1C=C(O)C(=C=O)O1)CN2C#CC=CCC1COCO1
254 402.1408097801 [NH3+]C1=NC(O)=C2C(=N1)N(C1C=C(O)C(=C=O)O1)CN2C#CCCCC1COCO1
255 412.1251597161 CC(=CC#CN1CN(C2C=C(O)C(=C=O)O2)C2=NC([NH3+])=NC(O)=C21)CC1=COCO1
256 356.1353304761 CCC(C)=CC#CN1CN(C2C=C(O)C(=C=O)O2)C2=NC([NH3+])=NC(O)=C21
257 354.1196804121 C=CC(C)=CC#CN1CN(C2C=C(O)C(=C=O)O2)C2=NC([NH3+])=NC(O)=C21
258 342.1196804121 CCC=CC#CN1CN(C2C=C(O)C(=C=O)O2)C2=NC([NH3+])=NC(O)=C21
259 230.1036364241 CCC=CC#CN1C=NC2=NC([NH3+])=NC(O)=C21
260 340.1040303481 CCC#CC#CN1CN(C2C=C(O)C(=C=O)O2)C2=NC([NH3+])=NC(O)=C21
261 428.1564598441 CC(=CC#CN1CN(C2C=C(O)C(=C=O)O2)C2=NC([NH3+])=NC(O)=C21)CCC1COCO1 Intermediate Fragment 
262 428.1564598441 CC1OCOC1CCC=CC#CN1CN(C2C=C(O)C(=C=O)O2)C2=NC([NH3+])=NC(O)=C21 Intermediate Fragment 
263 412.1251597161 [NH3+]C1=NC(O)=C2C(=N1)N(C1C=C(O)C(=C=O)O1)CN2C#CC#CCCC1COCO1
264 428.1564598441 CCC1OCOC1CC=CC#CN1CN(C2C=C(O)C(=C=O)O2)C2=NC([NH3+])=NC(O)=C21 Intermediate Fragment 
265 428.1564598441 [NH3+]C1=NC(O)=C2C(=N1)N(C1C=C(O)C(=C=O)O1)CN2C#CC=C1CCC(OCO)CC1 Intermediate Fragment 
266 410.1458951601 COC1C=CC(=CC#CN2CN(C3C=C(O)C(=C=O)O3)C3=NC([NH3+])=NC(O)=C32)CC1
267 298.1298511721 COC1C=CC(=CC#CN2C=NC3=NC([NH3+])=NC(O)=C32)CC1
268 378.1196804121 [NH3+]C1=NC(O)=C2C(=N1)N(C1C=C(O)C(=C=O)O1)CN2C#CC=C1C=CC=CC1
269 400.1615452241 [NH3+]C1=NC(O)=C2C(=N1)N(C1C=C(O)C(=C=O)O1)CN2C#CCC1CCC(O)CC1
270 400.1615452241 [NH3+]C1=NC(O)=C2C(=N1)N(C(=O)C=C(O)C#CO)CN2C#CCC1CCC(O)CC1 Intermediate Fragment 
271 398.1458951601 [NH3+]C1=NC(O)=C2C(=N1)N(C1C=C(O)C(=C=O)O1)CN2C#CC=C1CCC(O)CC1
272 396.1302450961 [NH3+]C1=NC(O)=C2C(=N1)N(C1C=C(O)C(=C=O)O1)CN2C#CC=C1C=CC(O)CC1
273 384.1666306041 [NH3+]C1=NC(O)=C2C(=N1)N(C1C=C(O)C(=C=O)O1)CN2C#CCC1CCCCC1
274 382.1509805401 [NH3+]C1=NC(O)=C2C(=N1)N(C1C=C(O)C(=C=O)O1)CN2C#CC=C1CCCCC1
275 123.1168269001 [CH2+]#CCC1CCCCC1
276 382.1509805401 [NH3+]C1=NC(O)=C2C(=N1)N(C(=O)C=C(O)C#CO)CN2C#CC=C1CCCCC1 Intermediate Fragment 
277 380.1353304761 [NH3+]C1=NC(O)=C2C(=N1)N(C1C=C(O)C(=C=O)O1)CN2C#CC=C1C=CCCC1
278 362.1247657921 [NH3+]C1=NC(O)=C2C(=N1)N(C1C=CC(=C=O)O1)CN2C#CC=C1C=CC=CC1
279 380.1353304761 [NH3+]C1=NC(O)=C2C(=N1)N(C(=O)C=C(O)C#CO)CN2C#CC=C1C=CCCC1 Intermediate Fragment 
280 428.1564598441 [NH3+]C1=NC(O)=C2C(=N1)N(C1C=C(O)C(=C=O)O1)CN2C#CC=C1CCCC(OCO)C1 Intermediate Fragment 
281 396.1302450961 [NH3+]C1=NC(O)=C2C(=N1)N(C1C=C(O)C(=C=O)O1)CN2C#CC=C1C=CCC(O)C1
282 398.1458951601 [NH3+]C1=NC(O)=C2C(=N1)N(C1C=C(O)C(=C=O)O1)CN2C#CC=C1CCCC(O)C1
283 400.1615452241 [NH3+]C1=NC(O)=C2C(=N1)N(C1C=C(O)C(=C=O)O1)CN2C#CCC1CCCC(O)C1
284 400.1615452241 [NH3+]C1=NC(O)=C2C(=N1)N(C(=O)C=C(O)C#CO)CN2C#CCC1CCCC(O)C1 Intermediate Fragment 
285 410.1458951601 COC1CC=CC(=CC#CN2CN(C3C=C(O)C(=C=O)O3)C3=NC([NH3+])=NC(O)=C32)C1
286 298.1298511721 COC1CC=CC(=CC#CN2C=NC3=NC([NH3+])=NC(O)=C32)C1
287 428.1564598441 COC1CC(=CC#CN2CN(C3C=C(O)C(=C=O)O3)C3=NC([NH3+])=NC(O)=C32)CCC1O Intermediate Fragment 
288 412.1251597161 [NH3+]C1=NC(O)=C2C(=N1)N(C1C=C(O)C(=C=O)O1)CN2C#CC=C1C=CC(O)C(O)C1
289 300.1091157281 [NH3+]C1=NC(O)=C2C(=N1)N=CN2C#CC=C1C=CC(O)C(O)C1
290 428.1564598441 COC1CCC(=CC#CN2CN(C3C=C(O)C(=C=O)O3)C3=NC([NH3+])=NC(O)=C32)CC1O Intermediate Fragment 
291 426.1408097801 [NH3+]C1=NC(O)=C2C(=N1)N(C1C=C(O)C(=C=O)O1)CN2C#CC=C1CCC2OCOC2C1
