#In-silico ESI-MS/MS [M+H]+ Spectra
#PREDICTED BY CFM-ID 4.0.8
#SMILES=[C@H]1(C[C@@H](O[C@@H]1CO)n1ccc(nc1=O)Nc1c2c3c(c4c1cccc4)c1c(cc3C(=O)N2)OCO1)O
#InChiKey=QDPVDXWBXSXPAY-QGPMSJSTSA-N
energy0
373.09313 100.00 6 69 78 71 36 22 73 67 55 63 75 43 58 82 81 66 83 62 61 60 48 51 (83.631 0.53565 0.48055 0.40368 0.38125 0.22045 0.20085 0.11542 0.076621 0.041663 0.03873 0.03636 0.013794 0.013486 0.012575 0.010143 0.0062815 0.0026605 0.0016423 0.0016167 0.0012821 0.00081178)
energy1
345.09822 2.25 34 68 79 (1.5908 0.03269 0.00059882)
371.07748 2.81 7 35 42 70 57 77 80 47 65 (1.8259 0.1966 0.0027257 0.00095987 0.00093742 0.00061678 0.0005459 0.00016133 9.0256e-05)
373.09313 100.00 6 22 36 69 75 78 55 71 73 51 43 67 63 83 82 58 48 62 60 61 66 81 (68.378 1.3564 0.79876 0.44935 0.28937 0.25798 0.16029 0.14469 0.12621 0.075717 0.071577 0.044747 0.044611 0.021332 0.016458 0.011569 0.0069926 0.0055991 0.0055225 0.0052038 0.0045464 0.0041084)
399.10878 5.53 10 (3.9968)
415.10370 2.10 110 111 203 (1.399 0.11945 0.00011988)
energy2
43.01784 5.10 162 (1.6291)
57.03349 7.22 106 (2.3065)
73.02841 4.68 107 129 (0.78883 0.70747)
97.03964 3.13 21 (0.99899)
277.06077 25.10 16 (8.0237)
279.07642 16.85 15 (5.3871)
301.06077 3.36 46 (1.0744)
303.07642 7.39 45 (2.3605)
326.05602 4.58 29 39 (1.2717 0.19177)
328.07167 14.40 30 38 (4.4025 0.20151)
330.08732 4.59 31 37 (1.1374 0.33017)
345.09822 6.57 34 68 79 (1.8587 0.15795 0.08395)
355.08257 7.13 20 141 138 (2.0731 0.12912 0.077055)
356.06658 4.27 23 41 (1.2703 0.095003)
371.07748 11.12 7 35 57 80 42 70 77 47 65 (1.5383 1.2254 0.22897 0.14086 0.13014 0.083914 0.071996 0.07147 0.064502)
373.09313 100.00 6 22 36 48 55 43 78 51 75 63 73 69 71 60 67 58 83 66 81 82 61 62 (9.5681 9.3726 1.9598 1.6885 1.5494 1.3304 1.1691 1.0328 0.6866 0.5902 0.53626 0.50118 0.46165 0.28553 0.26884 0.20706 0.20224 0.12985 0.12761 0.127 0.096654 0.07077)
383.07748 7.64 135 134 139 140 (1.0694 1.0497 0.18078 0.14089)
385.09313 4.72 116 (1.5093)
387.10878 5.51 117 (1.7603)
405.15573 4.54 104 (1.4497)
446.13466 3.48 195 (1.111)

0 489.1404754321 O=C1Nc2c([NH2+]c3ccn(C4CC(O)C(CO)O4)c(=O)n3)c3ccccc3c3c4c(cc1c23)OCO4
1 457.1142606841 O=C1NC2=C3C1=CC1=C(OCO1)C3=C1CC=CC=C1C2=[NH+]C1=NC(=O)N(C2C=C(O)CO2)C=C1
2 459.1299107481 O=C1N=C([NH+]=C2C3=CC=CCC3=C3C4=C(C=C5C3=C2NC5O)OCO4)C=CN1C1C=C(O)CO1
3 461.1455608121 O=C1N=C([NH+]=C2C3=CC=CCC3=C3C4=C(CC5C3=C2NC5O)OCO4)C=CN1C1C=C(O)CO1
4 471.1299107481 C=C1OC(N2C=CC([NH+]=C3C4=CC=CCC4=C4C5=C(C=C6C4=C3NC6O)OCO5)=NC2=O)C=C1O
5 375.1087813801 O=C1NC2C(=[NH+]C3=CC=NC(O)=N3)C3=CC=CCC3C3=C2C1=CC1=C3OCO1
6 373.0931313161 O=C1N=C2C(=[NH+]C3=CC=NC(O)=N3)C3=CC=CCC3C3=C2C1=CC1=C3OCO1
7 371.0774812521 O=C1N=C2C(=[NH+]C3=CC=NC(O)=N3)C3=CC=CC=C3C3=C2C1=CC1=C3OCO1
8 453.1193460641 C=C1C=CC(N2C=CC([NH+]=C3C4=CC=CCC4=C4C5=C(C=C6C(=O)NC3=C64)OCO5)=NC2=O)O1
9 471.1299107481 C=C(CO)OC(=C)N1C=CC([NH+]=C2C3=CC=CCC3=C3C4=C(C=C5C(=O)NC2=C53)OCO4)=NC1=O Intermediate Fragment 
10 399.1087813801 C#CN1C=CC([NH+]=C2C3=CC=CCC3=C3C4=C(C=C5C3=C2NC5O)OCO4)=NC1=O
11 471.1299107481 CC(=O)C(O)=C=CN1C=CC([NH+]=C2C3=CC=CCC3=C3C4=C(C=C5C3=C2NC5O)OCO4)=NC1=O Intermediate Fragment 
12 471.1299107481 C#COC(=C=CO)N1C=CC([NH+]=C2C3=CC=CCC3=C3C4=C(CC5C3=C2NC5O)OCO4)=NC1=O Intermediate Fragment 
13 379.1400815081 OC1=NC([NH+]=C2C3=CC=CCC3C3=C4C2NC(O)C4CC2=C3OCO2)=CC=N1
14 283.1077187601 [NH2+]=C1C2=CC=CCC2C2=C3C(=CC4=C2OCO4)C(O)NC13
15 279.0764186321 [NH2+]=C1C2=CC=CCC2C2=C3C(=CC4=C2OCO4)C(=O)N=C13
16 277.0607685681 [NH2+]=C1C2=NC(=O)C3=CC4=C(OCO4)C(=C32)C2=C1C=CC=C2
17 379.1400815081 N=C=C=C(N=C=O)[NH+]=C1C2=CCCCC2=C2C3=C1NC(O)C3CC1OCOC21 Intermediate Fragment 
18 377.1244314441 OC1=NC([NH+]=C2C3=CC=CCC3C3=C4C(=CC5=C3OCO5)C(O)NC24)=CC=N1
19 375.1087813801 N=C=C=C(N=C=O)[NH+]=C1C2=CC=CCC2=C2C3=C(CC4C2=C1NC4O)OCO3 Intermediate Fragment 
20 355.0825666321 O=C1N=C2C(=[NH+]C3=CC=NC=N3)C3=CC=CC=C3C3=C2C1=CC1=C3OCO1
21 97.0396392001 [OH2+]C1=NC=CC=N1
22 373.0931313161 N=C=C=C(N=C=O)[NH+]=C1C2=CC=CCC2=C2C3=C(C=C4C2=C1NC4O)OCO3 Intermediate Fragment 
23 356.0665822201 C#CC(N=C1C2=CC=CCC2=C2C3=C(C=C4C(=O)NC1=C42)OCO3)=[N+]=C=O
24 346.0822322841 C=C(N=C1C2=CC=CCC2C2=C3C(=CC4=C2OCO4)C(=O)N=C13)[NH+]=C=O
25 344.0665822201 C=C(N=C1C2=NC(=O)C3=CC4=C(OCO4)C(=C32)C2=C1C=CC=C2)[NH+]=C=O
26 332.0665822201 O=C[NH+]=C=NC1=C2NC(=O)C3=CC4=C(OCO4)C(=C32)C2=C1C=CC=C2
27 330.0509321561 O=C=[N+]=C=NC1=C2NC(=O)C3=CC4=C(OCO4)C(=C32)C2=C1C=CC=C2
28 44.0494756121 CC=[NH2+]
29 326.0560175361 N#C[C+]=C=NC1=C2NC(=O)C3=CC4=C(OCO4)C(=C32)C2=C1C=CC=C2
30 328.0716676001 [NH+]#CC=C=NC1=C2NC(=O)C3=CC4=C(OCO4)C(=C32)C2=C1C=CC=C2
31 330.0873176641 [NH+]#CC=C=NC1C2=C3C(=CC4=C(OCO4)C3=C3C=CC=CC31)C(=O)N2
32 341.0669165681 N#C[C+]=C(N)N=C1C2=NC(=O)C3=CC4=C(OCO4)C(=C32)C2=C1C=CC=C2
33 343.0825666321 [NH+]#CC=C(N)N=C1C2=NC(=O)C3=CC4=C(OCO4)C(=C32)C2=C1C=CC=C2
34 345.0982166961 [NH+]#CC=C(N)N=C1C2=CC=CCC2C2=C3C(=CC4=C2OCO4)C(=O)N=C13
35 371.0774812521 [NH+]#CC=C(N=C=O)N=C1C2=CC=CCC2=C2C3=C(C=C4C(=O)NC1=C42)OCO3
36 373.0931313161 NC(=C=C=NC=O)[NH+]=C1C2=CC=CCC2=C2C3=C(C=C4C(=O)NC1=C42)OCO3 Intermediate Fragment 
37 330.0873176641 C#CC(=[NH2+])N=C1C2=CC=CCC2C2=C3C(=CC4=C2OCO4)C(=O)N=C13
38 328.0716676001 C#CC(=[NH2+])N=C1C2=NC(=O)C3=CC4=C(OCO4)C(=C32)C2=C1C=CC=C2
39 326.0560175361 [C+]#CC(=N)N=C1C2=NC(=O)C3=CC4=C(OCO4)C(=C32)C2=C1C=CC=C2
40 304.0716676001 [NH+]#CN=C1C2=CC=CCC2C2=C3C(=CC4=C2OCO4)C(=O)N=C13
41 356.0665822201 O=C[NH+]=C=C=C=NC1=C2NC(=O)C3=CC4=C(OCO4)C(=C32)C2=C1C=CC=C2
42 371.0774812521 NC(=C=C=NC#[O+])N=C1C2=CC=CCC2=C2C3=C(C=C4C(=O)NC1=C42)OCO3
43 373.0931313161 N=C(O)N=C=C=C=[NH+]C1=C2NC(O)C3=CC4=C(OCO4)C(=C32)C2=C1C=CC=C2 Intermediate Fragment 
44 313.0607685681 C#CC#[N+]C1=C2NC(=O)C3=CC4=C(OCO4)C(=C32)C2=C1C=CC=C2
45 303.0764186321 C#C[NH+]=C1C2=CC=CCC2C2=C3C(=CC4=C2OCO4)C(=O)N=C13
46 301.0607685681 C#C[NH+]=C1C2=NC(=O)C3=CC4=C(OCO4)C(=C32)C2=C1C=CC=C2
47 371.0774812521 N=C(O)[NH+]=C=C=C=NC1=C2NC(=O)C3=CC4=C(OCO4)C(=C32)C2=C1C=CC=C2
48 373.0931313161 C=C=NC(=O)N=C=[NH+]C1=C2NC(O)C3=CC4=C(OCO4)C(=C32)C2=C1C=CC=C2 Intermediate Fragment 
49 289.0607685681 C#[N+]C1=C2NC(=O)C3=CC4=C(OCO4)C(=C32)C2=C1C=CC=C2
50 306.0873176641 [NH+]#CN=C1C2=CC=CCC2C2=C3C(=CC4=C2OCO4)C(=O)NC13
51 373.0931313161 C=NC(O)=NC(=C)[NH+]=C1C2=NC(=O)C3=CC4=C(OCO4)C(=C32)C2=C1C=CC=C2 Intermediate Fragment 
52 299.0451185041 [C+]#CN=C1C2=NC(=O)C3=CC4=C(OCO4)C(=C32)C2=C1C=CC=C2
53 318.0873176641 C=C([NH3+])N=C1C2=NC(=O)C3=CC4=C(OCO4)C(=C32)C2=C1C=CC=C2
54 342.0509321561 [CH+]=C(N=C=O)N=C1C2=NC(=O)C3=CC4=C(OCO4)C(=C32)C2=C1C=CC=C2
55 373.0931313161 C=C=C(N=C(N)O)[NH+]=C1C2=NC(=O)C3=CC4=C(OCO4)C(=C32)C2=C1C=CC=C2 Intermediate Fragment 
56 345.0618311881 NC(=O)N=C=[N+]=C1C2=NC(=O)C3=CC4=C(OCO4)C(=C32)C2=C1C=CC=C2
57 371.0774812521 [C+]#CC(=NC(N)=O)N=C1C2=CC=CCC2=C2C3=C(C=C4C(=O)NC1=C42)OCO3
58 373.0931313161 C=C=CC1=C2C3=C(C=C4C(=O)NC(=C42)C(=[NH+]C2=CC=NC(O)=N2)C1=C)OCO3 Intermediate Fragment 
59 347.0774812521 C=C1C(=C)C2=C3C(=CC4=C2OCO4)C(=O)N=C3C1=[NH+]C1=CC=NC(O)=N1
60 373.0931313161 C=C=C1C(=[NH+]C2=CC=NC(O)=N2)C2=C3C(=CC4=C(OCO4)C3=C1C=C)C(=O)N2 Intermediate Fragment 
61 373.0931313161 C=C=C=C=C1C=C2C3=C(C=C4C2=C(NC4O)C1=[NH+]C1=CC=NC(O)=N1)OCO3 Intermediate Fragment 
62 373.0931313161 C=C1OCOC1=C1C2=CC=CC=C2C(=[NH+]C2=CC=NC(O)=N2)C2=NC(=O)C=C21 Intermediate Fragment 
63 373.0931313161 O=C1N=C2C(=CC3=C(C=CC=C3)C2=[NH+]C2=CC=NC(O)=N2)C1=CC1=COCO1 Intermediate Fragment 
64 301.0720019481 [CH+]=C1C(=O)N=C2C1=CC1=C(C=CC=C1)C2=NC1=CC=NC(O)=N1
65 371.0774812521 O=C1N=C2C(=CC3=C(C=CC=C3)C2=NC2=CC=NC(O)=N2)C1=[C+]C1=COCO1
66 373.0931313161 C=C1C(=O)N=C2C(=[NH+]C3=CC=NC(O)=N3)C3=CC=CC=C3C(C3=COCO3)=C12 Intermediate Fragment 
67 373.0931313161 O=C=NC1=C2C=CC3=C(OCO3)C2=C2CC=CC=C2C1=[NH+]C1=CC=NC(O)=N1 Intermediate Fragment 
68 345.0982166961 N=C1C(=[NH+]C2=CC=NC(O)=N2)C2=C(C=CC=C2)C2=C1C=CC1=C2OCO1
69 373.0931313161 NC1=C2C(C#[O+])=CC3=C(OCO3)C2=C2CC=CC=C2C1=NC1=CC=NC(O)=N1 Intermediate Fragment 
70 371.0774812521 N=C1C(=NC2=CC=NC(O)=N2)C2=C(C=CC=C2)C2=C1C(C#[O+])=CC1=C2OCO1
71 373.0931313161 O=COC1=CC=C2C(=O)NC3=C2C1=C1CC=CC=C1C3=[NH+]C1=CC=NC(O)=N1 Intermediate Fragment 
72 343.0825666321 O=C1C=CC2=C3C(=NC2=O)C(=[NH+]C2=CC=NC(O)=N2)C2=CC=CCC2=C13
73 373.0931313161 O=COC1=CC2=C3CC=CC=C3C(=[NH+]C3=CC=NC(O)=N3)C3=C2C(=C1)C(=O)N3 Intermediate Fragment 
74 343.0825666321 O=C1N=C2C(=[NH+]C3=CC=NC(O)=N3)C3=CC=CC=C3C3=C2C1=CC(O)=C3
75 373.0931313161 COC1=CC2=C3C(=NC2=O)C(=[NH+]C2=CC=NC(O)=N2)C2=CC=CCC2=C3C1=O Intermediate Fragment 
76 357.0618311881 O=C1C=C2C(=O)N=C3C(=[NH+]C4=CC=NC(O)=N4)C4=CC=CC=C4C(=C23)C1=O
77 371.0774812521 C=[O+]C1=CC2=C3C(=NC2=O)C(=NC2=CC=NC(O)=N2)C2=CC=CCC2=C3C1=O
78 373.0931313161 COC1=C(O)C=C2C(=O)N=C3C(=[NH+]C4=CC=NC(O)=N4)C4=CC=CC=C4C1=C23 Intermediate Fragment 
79 345.0982166961 O=C1N=C2C(=[NH+]C3=CC=NC(O)=N3)C3=CC=CCC3C3=C2C1=CC(O)=C3
80 371.0774812521 C=[O+]C1=C(O)C=C2C(=O)N=C3C(=NC4=CC=NC(O)=N4)C4=CC=CC=C4C1=C23
81 373.0931313161 O=C1NC(=C=[NH+]C2=CC=NC(O)=N2)C2=C1C=C1OCOC1=C2C1=CC=CC=C1 Intermediate Fragment 
82 373.0931313161 O=C1N=C(C(=[NH+]C2=CC=NC(O)=N2)C2=CC=CC=C2)C2=CC3=C(C=C12)OCO3 Intermediate Fragment 
83 373.0931313161 O=C1NC=C2C1=CC1=C(OCO1)C2=C1CC=CC=C1C#[N+]C1=CC=NC(O)=N1 Intermediate Fragment 
84 115.0389705041 OC1C=COC1=C[OH2+]
85 117.0546205681 OC1C=COC1C[OH2+]
86 99.0440558841 C=C1OCC=C1[OH2+]
87 99.0440558841 [OH2+]C=C1C=CCO1
88 117.0546205681 C=C=C(O)C(O)C[OH2+] Intermediate Fragment 
89 99.0440558841 C=C=C(O)C=C[OH2+]
90 117.0546205681 OC=C=C(O)CC[OH2+] Intermediate Fragment 
91 117.0546205681 OC=C=COCC[OH2+] Intermediate Fragment 
92 119.0702706321 OC1CCOC1C[OH2+]
93 119.0702706321 OCC=C(O)CC[OH2+] Intermediate Fragment 
94 471.1299107481 O=C=C1OC(N2C=CC([NH+]=C3C4=CC=CCC4=C4C5=C(C=C6C4=C3NC6O)OCO5)=NC2)C=C1O
95 285.1233688241 [NH2+]=C1C2=CC=CCC2C2=C3C1NC(O)C3CC1=C2OCO1
96 281.0920686961 [NH2+]=C1C2=CC=CCC2C2=C3C(=CC4=C2OCO4)C(=O)NC13
97 211.0713332521 OC1C=C(N2C=CCNC2O)OC1=C=[OH+]
98 213.0869833161 OC1C=C(N2CCCNC2O)OC1=C=[OH+]
99 264.0655196001 [OH+]=C1NC2=CC3=C(C=CC=C3)C3=C2C1=CC1=C3OCO1
100 489.1404754321 C=C(OC(=C=O)CO)N1C=CC([NH+]=C2C3=CC=CCC3=C3C4=C(CC5C3=C2NC5O)OCO4)=NC1=O Intermediate Fragment 
101 397.0931313161 C#CN1C=CC([NH+]=C2C3=CC=CCC3=C3C4=C(C=C5C(=O)NC2=C53)OCO4)=NC1=O
102 401.1244314441 C#CN1C=CC([NH+]=C2C3=CC=CCC3=C3C4=C(CC5C3=C2NC5O)OCO4)=NC1=O
103 403.1400815081 C#CN1C=CC([NH+]=C2C3=CC=CCC3=C3C4=C2NC(O)C4CC2OCOC32)=NC1=O
104 405.1557315721 C#CN1C=CC([NH+]=C2C3=CCCCC3=C3C4=C2NC(O)C4CC2OCOC32)=NC1=O
105 75.0440558841 OCC=C[OH2+]
106 57.0334912001 C#CC[OH2+]
107 73.0284058201 OCC#C[OH2+]
108 413.0880459361 [CH+]=C(O)N1C=CC(N=C2C3=CC=CCC3=C3C4=C(C=C5C(=O)NC2=C53)OCO4)=NC1=O
109 413.0880459361 C=C(O)N=C=C=C(N=C=O)[NH+]=C1C2=CC=CCC2=C2C3=C(C=C4C(=O)NC1=C42)OCO3 Intermediate Fragment 
110 415.1036960001 C=C(O)N1C=CC([NH+]=C2C3=CC=CCC3=C3C4=C(C=C5C(=O)NC2=C53)OCO4)=NC1=O
111 415.1036960001 C=C(O)N=C=C=C(N=C=O)[NH+]=C1C2=CC=CCC2=C2C3=C(C=C4C2=C1NC4O)OCO3 Intermediate Fragment 
112 417.1193460641 C=C(O)N1C=CC([NH+]=C2C3=CC=CCC3=C3C4=C(C=C5C3=C2NC5O)OCO4)=NC1=O
113 419.1349961281 C=C(O)N1C=CC([NH+]=C2C3=CC=CCC3=C3C4=C(CC5C3=C2NC5O)OCO4)=NC1=O
114 421.1506461921 C=C(O)N1C=CC([NH+]=C2C3=CC=CCC3=C3C4=C2NC(O)C4CC2OCOC32)=NC1=O
115 489.1404754321 C=C(O)C(=C=O)OCN1C=CC([NH+]=C2C3=CC=CCC3=C3C4=C(CC5C3=C2NC5O)OCO4)=NC1=O Intermediate Fragment 
116 385.0931313161 CN1C=CC([NH+]=C2C3=CC=CC=C3C3=C4C(=CC5=C3OCO5)C(=O)N=C24)=NC1=O
117 387.1087813801 CN1C=CC([NH+]=C2C3=CC=CCC3C3=C4C(=CC5=C3OCO5)C(=O)N=C24)=NC1=O
118 403.1036960001 O=CN1C=CC([NH+]=C2C3=CC=CCC3=C3C4=C(C=C5C3=C2NC5O)OCO4)=NC1=O
119 489.1404754321 O=CC(=O)C(O)=C=CN1C=CC([NH+]=C2C3=CC=CCC3=C3C4=C2NC(O)C4CC2OCOC32)=NC1=O Intermediate Fragment 
120 84.9920203121 O=CC(=O)C#[O+]
121 56.9971056921 O=C=C=[OH+]
122 87.0076703761 O=CC(=[OH+])C=O
123 68.9971056921 [O+]#CC#CO
124 89.0233204401 O=CC(=[OH+])CO
125 71.0127557561 O=CC#C[OH2+]
126 61.0284058201 OCC=[OH+]
127 71.0127557561 CC(=O)C#[O+]
128 91.0389705041 OCC(=[OH+])CO
129 73.0284058201 CC(=[OH+])C=O
130 93.0546205681 OCC([OH2+])CO
131 75.0440558841 CC(=[OH+])CO
132 391.1400815081 CN1C=CC([NH+]=C2C3=CC=CCC3C3=C4C(=CC5=C3OCO5)C(O)NC24)=NC1=O
133 389.1244314441 CN1C=CC([NH+]=C2C3=CC=CCC3C3=C4C(=CC5=C3OCO5)C(=O)NC24)=NC1=O
134 383.0774812521 [CH2+]N1C=CC(N=C2C3=CC=CC=C3C3=C4C(=CC5=C3OCO5)C(=O)N=C24)=NC1=O
135 383.0774812521 [CH+]=NC=C=C(N=C=O)N=C1C2=CC=CCC2=C2C3=C(C=C4C(=O)NC1=C42)OCO3 Intermediate Fragment 
136 340.0716676001 C#[N+]C#CC=NC1=C2NC(=O)C3=CC4=C(OCO4)C(=C32)C2=C1C=CC=C2
137 353.0669165681 C#[N+]C#CC(=N)N=C1C2=NC(=O)C3=CC4=C(OCO4)C(=C32)C2=C1C=CC=C2
138 355.0825666321 C=[NH+]C#CC(=N)N=C1C2=NC(=O)C3=CC4=C(OCO4)C(=C32)C2=C1C=CC=C2
139 383.0774812521 [CH+]=NC(O)=NC(=C=C)N=C1C2=NC(=O)C3=CC4=C(OCO4)C(=C32)C2=C1C=CC=C2 Intermediate Fragment 
140 383.0774812521 [CH2+]N1C=CC(N=C2C3=CC=CC=C3C3=C4C(=CC=C3OC=O)C(=O)N=C24)=NC1=O Intermediate Fragment 
141 355.0825666321 [CH2+]N1C=CC(N=C2C3=CC=CC=C3C3=C4C(=CC=C3O)C(=O)N=C24)=NC1=O
142 105.0546205681 C=C(O)C([OH2+])CO
143 471.1299107481 O=C1N=C([NH+]=C2C3=CC=CCC3=C3C4=C(CC5C3=C2NC5O)OCO4)C=CN1C=C=C(O)C#CO
144 453.1193460641 C#CC(O)=C=CN1C=CC([NH+]=C2C3=CC=CCC3=C3C4=C(C=C5C3=C2NC5O)OCO4)=NC1=O
145 101.0597059481 C=C=C(O)CC[OH2+]
146 453.1193460641 O=C1N=C([NH+]=C2C3=CC=CCC3=C3C4=C(C=C5C3=C2NC5O)OCO4)C=CN1CC#CC#CO
147 429.1193460641 O=C1N=C([NH+]=C2C3=CC=CCC3=C3C4=C(C=C5C3=C2NC5O)OCO4)C=CN1CC#CO
148 427.1036960001 O=C1NC2=C3C1=CC1=C(OCO1)C3=C1CC=CC=C1C2=[NH+]C1=NC(=O)N(CC#CO)C=C1
149 425.0880459361 O=C1NC2=C3C1=CC1=C(OCO1)C3=C1CC=CC=C1C2=NC1=NC(=O)N([CH+]C#CO)C=C1
150 471.1299107481 O=C=NC(=C=CN=C=C=C(O)C#CO)[NH+]=C1C2=CC=CCC2=C2C3=C1NC(O)C3CC1OCOC21 Intermediate Fragment 
151 433.1506461921 O=C1N=C([NH+]=C2C3=CC=CCC3=C3C4=C2NC(O)C4CC2OCOC32)C=CN1CC#CO
152 431.1349961281 O=C1N=C([NH+]=C2C3=CC=CCC3=C3C4=C(CC5C3=C2NC5O)OCO4)C=CN1CC#CO
153 413.1244314441 C#CCN1C=CC([NH+]=C2C3=CC=CCC3=C3C4=C(C=C5C3=C2NC5O)OCO4)=NC1=O
154 431.1349961281 NC(=C=CN(C=O)CC#CO)[NH+]=C1C2=CC=CCC2=C2C3=C(C=C4C2=C1NC4O)OCO3 Intermediate Fragment 
155 411.1087813801 C#CCN1C=CC([NH+]=C2C3=CC=CCC3=C3C4=C(C=C5C(=O)NC2=C53)OCO4)=NC1=O
156 429.1193460641 O=C=NC(=C=CN=CC#CO)[NH+]=C1C2=CC=CCC2=C2C3=C(CC4C2=C1NC4O)OCO3 Intermediate Fragment 
157 429.1193460641 NC(=C=CN(C=O)CC#CO)[NH+]=C1C2=CC=CCC2=C2C3=C(C=C4C(=O)NC1=C42)OCO3 Intermediate Fragment 
158 409.0931313161 [C+]#CCN1C=CC(N=C2C3=CC=CCC3=C3C4=C(C=C5C(=O)NC2=C53)OCO4)=NC1=O
159 427.1036960001 O=C=NC(=C=CN=CC#CO)[NH+]=C1C2=CC=CCC2=C2C3=C(C=C4C2=C1NC4O)OCO3 Intermediate Fragment 
160 59.0127557561 O=C=C[OH2+]
161 41.0021910721 [C+]#CO
162 43.0178411361 C#C[OH2+]
163 63.0440558841 OCC[OH2+]
164 45.0334912001 C=C[OH2+]
165 487.1248253681 O=CC(=O)C(O)=C=CN1C=CC([NH+]=C2C3=CC=CCC3=C3C4=C(CC5C3=C2NC5O)OCO4)=NC1=O
166 489.1404754321 O=C1N=C([NH+]=C2C3=CC=CCC3=C3C4=C2NC(O)C4CC2OCOC32)C=CN1C(O)=C=C(O)C#CO Intermediate Fragment 
167 405.1193460641 O=CN1C=CC([NH+]=C2C3=CC=CCC3=C3C4=C(CC5C3=C2NC5O)OCO4)=NC1=O
168 401.0880459361 O=CN1C=CC([NH+]=C2C3=CC=CCC3=C3C4=C(C=C5C(=O)NC2=C53)OCO4)=NC1=O
169 399.0723958721 O=C1NC2=C3C1=CC1=C(OCO1)C3=C1CC=CC=C1C2=NC1=NC(=O)N(C#[O+])C=C1
170 89.0597059481 C=C(O)CC[OH2+]
171 71.0491412641 C=CC(=C)[OH2+]
172 71.0491412641 C#CCC[OH2+]
173 91.0753560121 CC(O)CC[OH2+]
174 447.1299107481 O=C(C#CO)N1C=CC([NH+]=C2C3=CC=CCC3=C3C4=C2NC(O)C4CC2OCOC32)=NC1=O
175 429.1193460641 C#CC(=O)N1C=CC([NH+]=C2C3=CC=CCC3=C3C4=C(CC5C3=C2NC5O)OCO4)=NC1=O
176 445.1142606841 O=C(C#CO)N1C=CC([NH+]=C2C3=CC=CCC3=C3C4=C(CC5C3=C2NC5O)OCO4)=NC1=O
177 427.1036960001 C#CC(=O)N1C=CC([NH+]=C2C3=CC=CCC3=C3C4=C(C=C5C3=C2NC5O)OCO4)=NC1=O
178 445.1142606841 O=C=NC(=C=C=NC(=O)C#CO)[NH+]=C1C2=CC=CCC2=C2C3=C1NC(O)C3CC1OCOC21 Intermediate Fragment 
179 443.0986106201 O=C(C#CO)N1C=CC([NH+]=C2C3=CC=CCC3=C3C4=C(C=C5C3=C2NC5O)OCO4)=NC1=O
180 425.0880459361 C#CC(=O)N1C=CC([NH+]=C2C3=CC=CCC3=C3C4=C(C=C5C(=O)NC2=C53)OCO4)=NC1=O
181 47.0491412641 CC[OH2+]
182 489.1404754321 O=C1N=C([NH+]=C2C3=CC=CCC3=C3C4=C2NC(O)C4CC2OCOC32)C=CN1C(=C=CO)OC#CO Intermediate Fragment 
183 461.1455608121 C=C(OC#CO)N1C=CC([NH+]=C2C3=CC=CCC3=C3C4=C2NC(O)C4CC2OCOC32)=NC1=O
184 489.1404754321 C=C(N=C(O)N(C)C1C=C(O)C(=C=O)O1)[NH+]=C1C2=CC=CCC2=C2C3=C(C=C4C2=C1NC4O)OCO3 Intermediate Fragment 
185 320.1029677281 C=C([NH3+])N=C1C2=CC=CCC2C2=C3C(=CC4=C2OCO4)C(=O)N=C13
186 146.0811696641 C[NH2+]C1C=C(O)C(CO)O1
187 128.0706049801 C[NH2+]C1C=CC(=CO)O1
188 144.0655196001 C[NH2+]C1C=C(O)C(=CO)O1
189 348.0978823481 C=C(N=C1C2=CC=CCC2C2=C3C(=CC4=C2OCO4)C(=O)NC13)[NH+]=C=O
190 350.1135324121 C=C(N=C1C2=CC=CCC2C2=C3C(=CC4=C2OCO4)C(O)NC13)[NH+]=C=O
191 489.1404754321 C=CN(C(=O)N=C=[NH+]C1=C2NC(O)C3CC4OCOC4C(=C23)C2=CC=CC=C21)C1C=C(O)C(=C=O)O1 Intermediate Fragment 
192 489.1404754321 N=C(O)N(C=C=C=[NH+]C1=C2NC(O)C3CC4OCOC4C(=C23)C2=CC=CC=C21)C1C=C(O)C(=C=O)O1 Intermediate Fragment 
193 317.0920686961 C#CC=[NH+]C1=C2NC(O)C3=CC4=C(OCO4)C(=C32)C2=C1C=CC=C2
194 472.1139263361 O=C=C1OC([NH+](C#CC=NC2=C3NC(O)C4CC5=C(OCO5)C(=C34)C3=CC=CC=C32)C=O)C=C1O
195 446.1346617801 O=C=C1OC(=[NH+]C#CC=NC2=C3C=CCCC3=C3C4=C2NC(O)C4CC2OCOC32)C=C1O
196 444.1190117161 O=C=C1OC(=[NH+]C#CC=NC2=C3NC(O)C4CC5OCOC5C(=C34)C3=CC=CC=C32)C=C1O
197 489.1404754321 NC(=C=CN(C=O)C1C=C(O)C(=C=O)O1)[NH+]=C1C2=CC=CCC2=C2C3=C(CC4C2=C1NC4O)OCO3 Intermediate Fragment 
198 461.1455608121 N=C(C#C[NH+]=C1C=C(O)C(=C=O)O1)N=C1C2=CCCCC2=C2C3=C1NC(O)C3CC1OCOC21
199 461.1455608121 NC(=C=C=[NH+]C(O)=C=C(O)C#CO)N=C1C2=CC=CCC2=C2C3=C1NC(O)C3CC1OCOC21 Intermediate Fragment 
200 489.1404754321 O=C=NC(=C=CN=C1C=C(O)C(=C=O)O1)[NH+]=C1C2=CCCCC2=C2C3=C1NC(O)C3CC1OCOC21 Intermediate Fragment 
201 489.1404754321 C=C=C(N=C(O)N=C1C=C(O)C(=C=O)O1)[NH+]=C1C2=CC=CCC2=C2C3=C1NC(O)C3CC1OCOC21 Intermediate Fragment 
202 489.1404754321 O=C=C1OC(N2C=CC([NH+]=C3C4=CC=CCC4=CC4=C3NC(O)C4CC3=COCO3)=NC2=O)C=C1O Intermediate Fragment 
203 415.1036960001 C=C1C(=O)NC2=C1C=C1CC=CC=C1C2=[NH+]C1=NC(=O)N(C2C=C(O)C(=C=O)O2)C=C1
204 489.1404754321 CC1C2=C(NC1O)C(=[NH+]C1=NC(=O)N(C3C=C(O)C(=C=O)O3)C=C1)C1=CC=CCC1=C2C1=COCO1 Intermediate Fragment 
205 417.1193460641 C=C1C2=C(NC1O)C(=[NH+]C1=NC(=O)N(C3C=C(O)C(=C=O)O3)C=C1)C1=CC=CCC1=C2
206 489.1404754321 O=C=C1OC(N2C=CC([NH+]=C3C4=CC=CCC4=C4C(=C3NCO)CCC3=C4OCO3)=NC2=O)C=C1O Intermediate Fragment 
207 461.1455608121 NC1=C2CCC3OCOC3C2=C2CC=CC=C2C1=[NH+]C1=NC(=O)N(C2C=C(O)C(=C=O)O2)C=C1
208 489.1404754321 NC1=C2C(=C3CC=CC=C3C1=[NH+]C1=NC(=O)N(C3C=C(O)C(=C=O)O3)C=C1)C1=C(CC2CO)OCO1 Intermediate Fragment 
209 489.1404754321 O=C=C1OC(N2C=CC([NH+]=C3C4=CC=CCC4=C4C(OCO)=CCC5C4=C3NC5O)=NC2=O)C=C1O Intermediate Fragment 
210 489.1404754321 O=C=C1OC(N2C=CC([NH+]=C3C4=CC=CCC4=C4C=C(OCO)CC5C4=C3NC5O)=NC2=O)C=C1O Intermediate Fragment 
211 489.1404754321 COC1=C(O)C2=C3CC=CC=C3C(=[NH+]C3=NC(=O)N(C4C=C(O)C(=C=O)O4)C=C3)C3=C2C(C1)C(O)N3 Intermediate Fragment 
212 473.1091753041 O=C=C1OC(N2C=CC([NH+]=C3C4=CC=CCC4=C4C(O)=C(O)C=C5C4=C3NC5O)=NC2=O)C=C1O
213 489.1404754321 COC1=C(O)CC2C3=C(NC2O)C(=[NH+]C2=NC(=O)N(C4C=C(O)C(=C=O)O4)C=C2)C2=CC=CCC2=C13 Intermediate Fragment 
214 489.1404754321 O=C=C1OC(N2C=CC([NH+]=C=C3NC(O)C4CC5OCOC5C(C5=CC=CC=C5)=C34)=NC2=O)C=C1O Intermediate Fragment 
215 489.1404754321 O=C=C1OC(N2C=CC([NH+]=CC3=CC=CCC3=C3C4=CNC(O)C4CC4=C3OCO4)=NC2=O)C=C1O Intermediate Fragment 
