#In-silico ESI-MS/MS [M+H]+ Spectra
#PREDICTED BY CFM-ID 4.0.8
#SMILES=n1cnc2c(c1Nc1c3c4c(c5c1c(ccc5)OC)c1c(cc4C(=O)N3)OCO1)ncn2C1OC(CO)C(C1)O
#InChiKey=XHHBEDPFSNICRL-UHFFFAOYSA-N
energy0
427.11493 100.00 33 80 87 81 83 72 101 62 77 89 74 79 39 45 85 93 104 96 59 76 56 66 73 103 71 70 (67.425 0.36942 0.33141 0.2784 0.13852 0.10793 0.10107 0.10101 0.0796 0.057559 0.048258 0.042515 0.040976 0.031498 0.02671 0.025424 0.016679 0.011936 0.011041 0.0069955 0.0063513 0.004659 0.0018349 0.0017 0.00073795 0.0002761)
543.16227 36.15 0 185 177 144 151 137 138 134 141 130 150 132 143 136 120 127 128 123 208 168 169 145 129 149 207 124 (24.284 0.36329 0.10171 0.066337 0.064336 0.057818 0.032484 0.012872 0.011561 0.010156 0.006962 0.004861 0.0042681 0.0038797 0.0029936 0.0028306 0.0026465 0.0019392 0.0017828 0.001419 0.0011905 0.00098086 0.00065533 0.00039754 0.00018016 0.00014972)
energy1
395.08871 9.93 10 (7.7215)
427.11493 100.00 33 96 80 85 59 87 101 62 89 72 93 81 79 83 39 45 74 56 77 66 104 73 76 71 103 70 (73.883 0.52226 0.48089 0.30968 0.29234 0.27609 0.27549 0.23668 0.23661 0.17906 0.16352 0.15484 0.14011 0.13507 0.10843 0.10586 0.080109 0.076387 0.047888 0.044284 0.026067 0.005992 0.0048654 0.0026526 0.0024111 0.00088381)
energy2
45.03349 7.26 180 (2.2267)
55.01784 3.30 190 (1.0108)
57.03349 15.82 25 (4.8537)
59.04914 4.26 192 (1.3064)
71.04914 7.19 202 203 (1.5286 0.67773)
136.06177 7.45 7 (2.2866)
294.07608 2.29 2 (0.7017)
395.08871 3.58 10 (1.0969)
397.10436 6.88 11 82 84 (1.6879 0.30745 0.11458)
399.12001 7.90 37 78 88 (2.118 0.26161 0.043569)
400.10403 6.04 98 41 94 57 (1.1632 0.29786 0.20408 0.18672)
401.13566 6.35 106 (1.9493)
403.15131 2.69 109 (0.82458)
410.08838 7.11 95 40 90 58 (0.74993 0.74936 0.34314 0.33954)
411.08363 10.12 15 86 99 (2.8476 0.22386 0.031567)
413.09928 4.35 16 (1.3331)
425.09928 3.16 32 65 61 55 100 44 (0.33846 0.24482 0.14344 0.12545 0.094578 0.02212)
427.11493 100.00 33 96 62 59 39 45 101 87 56 66 85 83 93 80 74 89 81 72 79 77 103 70 104 76 71 73 (26.205 1.4528 0.38865 0.35335 0.34841 0.32674 0.2454 0.18004 0.17687 0.14634 0.10573 0.082582 0.081822 0.07718 0.076009 0.074461 0.071093 0.053648 0.046303 0.0414 0.040605 0.033458 0.02194 0.019996 0.01443 0.010898)
429.13058 5.80 105 107 (1.6996 0.080755)
431.14623 2.66 108 (0.81684)
433.16188 3.36 110 (1.0303)
451.11493 4.64 157 (1.4236)
453.13058 13.94 156 (4.2753)
473.15679 7.79 174 (2.3897)
475.17244 7.79 175 (2.3897)
483.14114 2.63 154 (0.80751)
487.17244 3.44 159 (1.0537)
515.16736 2.32 139 115 13 135 (0.25706 0.23458 0.16706 0.052)
526.13572 2.81 121 126 146 (0.51789 0.25537 0.087811)

0 543.1622734961 COc1cccc2c1c([NH2+]c1ncnc3c1ncn3C1CC(O)C(CO)O1)c1c3c(cc4c(c32)OCO4)C(=O)N1
1 296.0917343481 C[OH+]C1=CC=CC2=C1C=C1NC(O)C3=CC4=C(OCO4)C2=C13
2 294.0760842841 C[OH+]C1=CC=CC2=C1C=C1NC(=O)C3=CC4=C(OCO4)C2=C13
3 292.0604342201 C=[O+]C1=CC=CC2=C1C=C1NC(=O)C3=CC4=C(OCO4)C2=C13
4 250.0934656641 [NH3+]C1=C2N=CN(C3CC(O)C(=CO)O3)C2=NC=N1
5 252.1091157281 [NH3+]C1=C2N=CN(C3CC(O)C(CO)O3)C2=NC=N1
6 134.0461215481 [NH2+]=C1N=CN=C2N=CN=C12
7 136.0617716121 [NH2+]=C1N=CN=C2NCN=C12
8 252.1091157281 [NH3+]C1=C2N=CN(C(=O)CC(O)CCO)C2=NC=N1 Intermediate Fragment 
9 511.1360587481 O=C1NC2=C3C1=CC1=C(OCO1)C3=C1CC=CC=C1C2=[NH+]C1=C2N=CN(C3CC(O)C(=CO)O3)C2=NC=N1
10 395.0887146321 O=C1N=C2C3=C(C4=CC=CC=C4C2[NH+]=C2N=CN=C4N=CN=C42)C2=C(C=C13)OCO2
11 397.1043646961 O=C1N=C2C3=C(C4=C(C=C13)OCO4)C1CC=CC=C1C2[NH+]=C1N=CN=C2N=CN=C21
12 513.1517088121 O=C1NC2=C3C1=CC1=C(OCO1)C3=C1CC=CC=C1C2=[NH+]C1=C2N=CN(C3CC(O)C(CO)O3)C2=NC=N1
13 515.1673588761 O=C1NC2=C3C1=CC1=C(OCO1)C3=C1CC=CC=C1C2=[NH+]C1=C2NCN(C3CC(O)C(CO)O3)C2=NC=N1
14 527.1309733681 O=C1NC2=C3C1=CC1=C(OCO1)C3=C1CC=CC(O)=C1C2=[NH+]C1=C2N=CN(C3CC(O)C(=CO)O3)C2=NC=N1
15 411.0836292521 O=C1N=C2C3=C(C4=CC=CC(O)=C4C2[NH+]=C2N=CN=C4N=CN=C42)C2=C(C=C13)OCO2
16 413.0992793161 O=C1N=C2C3=C(C4=C(C=C13)OCO4)C1CC=CC(O)=C1C2[NH+]=C1N=CN=C2N=CN=C21
17 525.1517088121 COC1=C2C(=[NH+]C3=C4N=CN(C5CC(O)C(=CO)O5)C4=NC=N3)C3=C4C(=CC5=C(OCO5)C4=C2CC=C1)C=N3
18 119.0702706321 OC1CCOC1C[OH2+]
19 119.0702706321 O=CCC(O)CC[OH2+] Intermediate Fragment 
20 117.0546205681 OC1CCOC1=C[OH2+]
21 99.0440558841 C=C1OCC=C1[OH2+]
22 99.0440558841 [OH+]=C=C1CCCO1
23 117.0546205681 CCC(O)C(=O)C=[OH+] Intermediate Fragment 
24 99.0440558841 CC=C(O)C#C[OH2+]
25 57.0334912001 CC#C[OH2+]
26 117.0546205681 O=CCC(O)C=C[OH2+] Intermediate Fragment 
27 117.0546205681 OCCCOC#C[OH2+] Intermediate Fragment 
28 117.0546205681 CCOC(=C=[OH+])CO Intermediate Fragment 
29 115.0389705041 OC1CCOC1=C=[OH+]
30 113.0233204401 O=C1CCOC1=C=[OH+]
31 111.0076703761 O=C1C=COC1=C=[OH+]
32 425.0992793161 C=[O+]C1=C2C(=NC3=C4N=CNC4=NC=N3)C3=C4C(=CC5=C(OCO5)C4=C2CC=C1)C(=O)N3
33 427.1149293801 COC1=C2C(=[NH+]C3=C4N=CNC4=NC=N3)C3=C4C(=CC5=C(OCO5)C4=C2CC=C1)C(=O)N3
34 307.0713332521 COC1=CC=CC2=C1C(=[NH2+])C1=NC(=O)C3=CC4=C(OCO4)C2=C31
35 305.0556831881 C=[O+]C1=CC=CC2=C1C(=N)C1=NC(=O)C3=CC4=C(OCO4)C2=C31
36 121.0508725801 C1=NC2=NC=[NH+]CC2=N1
37 399.1200147601 O=C1NC2=C([NH+]=C3N=CN=C4NCN=C43)C3=CC=CCC3C3=C2C1=CC1=C3OCO1
38 409.1043646961 C=[O+]C1=C2C(=NC3=C4N=CNC4=NC=N3)C3=C4C(=CC5=C(OCO5)C4=C2CC=C1)C=N3
39 427.1149293801 COC1=C2C(=CC=C1)C1=C3C(=CC4=C1OCO4)C(=O)NC3=C2[NH+]=CC1=C(N=C=N)NC=N1 Intermediate Fragment 
40 410.0883802841 C=NC1=NC=NC1=C=NC1=C2NC(=O)C3=CC4=C(OCO4)C(=C32)C2=CC=CC([O+]=C)=C21
41 400.1040303481 COC1=C2C(=CC=C1)C1=C3C(=CC4=C1OCO4)C(=O)NC3=C2N=C=C1N=CNC1=[NH2+]
42 385.0931313161 COC1=C2C(=CC=C1)C1=C3C(=CC4=C1OCO4)C(=O)NC3=C2[NH+]=C=C1C=NC=N1
43 383.0774812521 C=[O+]C1=C2C(=CC=C1)C1=C3C(=CC4=C1OCO4)C(=O)NC3=C2N=C=C1C=NC=N1
44 425.0992793161 COC1=C2C(=CC=C1)C1=C3C(=CC4=C1OCO4)C(=O)NC3=C2N=C=C1N=CNC1=NC#[NH+]
45 427.1149293801 COC1=C2C(=CC=C1)C1=C3C(=CC4=C1OCO4)C(=O)NC3=C2[NH+]=CN=C=NC1=CN=CN1 Intermediate Fragment 
46 332.0665822201 COC1=CC=CC2=C1C(=NC#[NH+])C1=NC(=O)C3=CC4=C(OCO4)C2=C31
47 334.0822322841 COC1=CC=CC2=C1C(=NC#[NH+])C1NC(=O)C3=CC4=C(OCO4)C2=C31
48 346.0822322841 C#[N+]C=NC1=C2NC(=O)C3=CC4=C(OCO4)C(=C32)C2=C1C(OC)=CC=C2
49 357.0618311881 C=[O+]C1=CC=CC2=C1C(N=C=NC#N)=C1NC(=O)C3=CC4=C(OCO4)C2=C31
50 359.0774812521 COC1=CC=CC2=C1C(N=C=[NH+]C#N)=C1NC(=O)C3=CC4=C(OCO4)C2=C31
51 109.0508725801 [NH+]#CN=C1C=NCN1
52 107.0352225161 [NH+]#CN=C1C=NC=N1
53 319.0713332521 C=NC1=C2NC(=O)C3=CC4=C(OCO4)C(=C32)C2=C1C([O+]=C)=CC=C2
54 321.0869833161 C=[NH+]C1=C2NC(=O)C3=CC4=C(OCO4)C(=C32)C2=C1C(OC)=CC=C2
55 425.0992793161 C=[O+]C1=C2C(=CC=C1)C1=C3C(=CC4=C1OCO4)C(=O)NC3=C2N=CN=C=NC1=CN=CN1
56 427.1149293801 COC1=C2C(=CC=C1)C1=C3C(=CC4=C1OCO4)C(=O)NC3=C2[NH+]=C(N=C=N)C1=CNC=N1 Intermediate Fragment 
57 400.1040303481 COC1=C2C(=CC=C1)C1=C3C(=CC4=C1OCO4)C(=O)N=C3C2=NC(=[NH2+])C1=CNC=N1
58 410.0883802841 C#[N+]C(N=C1C2=NC(=O)C3=CC4=C(OCO4)C(=C32)C2=CC=CC(OC)=C21)=C1C=NC=N1
59 427.1149293801 C=NC(N=C1C2=C3C(=CC4=C(OCO4)C3=C3CC=CC([O+]=C)=C13)C(=O)N2)=C1N=CNC1=N Intermediate Fragment 
60 398.0883802841 C=[O+]C1=C2C(=CC=C1)C1=C3C(=CC4=C1OCO4)C(=O)NC3=C2N=C=C1N=CNC1=N
61 425.0992793161 C#[N+]C(=NC1=C2NC(=O)C3=CC4=C(OCO4)C(=C32)C2=CC=CC(OC)=C21)C1=NC=NC1=N
62 427.1149293801 C=NC1=C(C(N)=NC2=C3NC(=O)C4=CC5=C(OCO5)C(=C43)C3=CC=CC([O+]=C)=C32)N=CN1 Intermediate Fragment 
63 398.0883802841 C=[O+]C1=C2C(=CC=C1)C1=C3C(=CC4=C1OCO4)C(=O)N=C3C2=NC(=N)C1=CNC=N1
64 330.0509321561 C=[O+]C1=CC=CC2=C1C(=NC#N)C1=NC(=O)C3=CC4=C(OCO4)C2=C31
65 425.0992793161 C=NC1=C(C(=N)N=C2C3=NC(=O)C4=CC5=C(OCO5)C(=C43)C3=CC=CC([O+]=C)=C32)N=CN1
66 427.1149293801 C=C=CC1=C2C3=C(C=C4C(=O)NC(=C42)C(=[NH+]C2=C4N=CNC4=NC=N2)C1=COC)OCO3 Intermediate Fragment 
67 381.0730645681 [C+]#CCC1=C2C3=C(C=C4C(=O)NC(=C42)C(N=C2N=CN=C4N=CN=C42)=C1)OCO3
68 383.0887146321 C#CCC1=C2C3=C(C=C4C(=O)NC(=C42)C([NH+]=C2N=CN=C4N=CN=C42)=C1)OCO3
69 399.0836292521 C=[O+]C=C1C(=C)C2=C3C(=CC4=C2OCO4)C(=O)NC3=C1N=C1N=CN=C2N=CN=C21
70 427.1149293801 C=CC1=C2C3=C(C=C4C(=O)NC(=C42)C(=NC2=C4N=CNC4=NC=N2)C1=C(C)[O+]=C)OCO3 Intermediate Fragment 
71 427.1149293801 C=CC([O+]=C)=C1C(=NC2=C3N=CNC3=NC=N2)C2=C3C(=CC4=C(OCO4)C3=C1C)C(=O)N2 Intermediate Fragment 
72 427.1149293801 COC=C=C=CC1=C2C3=C(C=C4C(=O)NC(=C42)C(=[NH+]C2=C4N=CNC4=NC=N2)C1)OCO3 Intermediate Fragment 
73 427.1149293801 C=[O+]C1=C2C(=CC=C1)C(=C1OCOC1=C)C1=C(NC(O)=C1)C2=NC1=C2N=CNC2=NC=N1 Intermediate Fragment 
74 427.1149293801 C=[O+]C1=C2C(=CC3=C(NC(=O)C3=CC3=COCO3)C2=NC2=C3N=CNC3=NC=N2)CC=C1 Intermediate Fragment 
75 355.0938000121 C=[O+]C1=CC=CC2=C1C(N=C1N=CN=C3N=CN=C31)=C1NC(=O)C(=C)C1=C2
76 427.1149293801 C=[O+]C1=C2C(=NC3=C4N=CNC4=NC=N3)C3=C(C(=C)C(=O)N3)C(C3=COCO3)=C2CC=C1 Intermediate Fragment 
77 427.1149293801 COC1=C2C(=[NH+]C3=C4N=CNC4=NC=N3)C(N=C=O)=C3C=CC4=C(OCO4)C3=C2CC=C1 Intermediate Fragment 
78 399.1200147601 COC1=CC=CC2=C1C([NH+]=C1N=CN=C3N=CN=C31)=C(N)C1=C2C2=C(C=C1)OCO2
79 427.1149293801 C=[O+]C1=C2C(=NC3=C4N=CNC4=NC=N3)C=C3C(C(N)=O)=CC4=C(OCO4)C3=C2CC=C1 Intermediate Fragment 
80 427.1149293801 C=[O+]C1=C2C(=NC3=C4N=CNC4=NC=N3)C(N)=C3C(C=O)=CC4=C(OCO4)C3=C2CC=C1 Intermediate Fragment 
81 427.1149293801 COC1=C2C(=[NH+]C3=C4N=CNC4=NC=N3)C3=C4C(=CC=C(OC=O)C4=C2CC=C1)C(=O)N3 Intermediate Fragment 
82 397.1043646961 COC1=C2C(=CC=C1)C1=C3C(=CC=C1O)C(=O)NC3=C2[NH+]=C1N=CN=C2N=CN=C21
83 427.1149293801 COC1=C2C(=[NH+]C3=C4N=CNC4=NC=N3)C3=C4C(=CC(OC=O)=CC4=C2CC=C1)C(=O)N3 Intermediate Fragment 
84 397.1043646961 COC1=C2C(=CC=C1)C1=CC(=O)C=C3C(=O)NC(=C31)C2=[NH+]C1=C2N=CNC2=NC=N1
85 427.1149293801 C=[O+]C1=C2C(=NC3=C4N=CNC4=NC=N3)C3=C4C(=CC(OC)=C(O)C4=C2CC=C1)C(=O)N3 Intermediate Fragment 
86 411.0836292521 C=[O+]C1=C2C(=NC3=C4N=CNC4=NC=N3)C3=C4C(=CC(=O)C(=O)C4=C2CC=C1)C(=O)N3
87 427.1149293801 C=[O+]C1=C2C(=NC3=C4N=CNC4=NC=N3)C3=C4C(=CC(O)=C(OC)C4=C2CC=C1)C(=O)N3 Intermediate Fragment 
88 399.1200147601 COC1=C2C(=[NH+]C3=C4N=CNC4=NC=N3)C3=C4C(=CC(=O)C=C4C2CC=C1)C(=O)N3
89 427.1149293801 COC1=C2C(=[NH+]C3=CC(N=C=N)=NC=N3)C3=C4C(=CC5=C(OCO5)C4=C2CC=C1)C(=O)N3 Intermediate Fragment 
90 410.0883802841 C=NC1=NC=NC(N=C2C3=NC(=O)C4=CC5=C(OCO5)C(=C43)C3=CC=CC([O+]=C)=C32)=C1
91 385.0931313161 COC1=C2C(=CC=C1)C1=C3C(=CC4=C1OCO4)C(=O)N=C3C2=[NH+]C1=CC=NC=N1
92 383.0774812521 C=[O+]C1=C2C(=CC=C1)C1=C3C(=CC4=C1OCO4)C(=O)N=C3C2=NC1=CC=NC=N1
93 427.1149293801 COC1=C2C(=[NH+]C3=C(N=C=N)C=NC=N3)C3=C4C(=CC5=C(OCO5)C4=C2CC=C1)C(=O)N3 Intermediate Fragment 
94 400.1040303481 COC1=C2C(=CC=C1)C1=C3C(=CC4=C1OCO4)C(=O)NC3=C2[NH+]=C1N=CN=CC1=N
95 410.0883802841 C=NC1=C(N=C2C3=NC(=O)C4=CC5=C(OCO5)C(=C43)C3=CC=CC([O+]=C)=C32)N=CN=C1
96 427.1149293801 C=NC1=C(N=C2C3=C4C(=CC5=C(OCO5)C4=C4CC=CC([O+]=C)=C24)C(=O)N3)N=CN=C1N Intermediate Fragment 
97 398.0883802841 C=[O+]C1=C2C(=CC=C1)C1=C3C(=CC4=C1OCO4)C(=O)N=C3C2=NC1=CC(N)=NC=N1
98 400.1040303481 COC1=C2C(=CC=C1)C1=C3C(=CC4=C1OCO4)C(=O)N=C3C2=[NH+]C1=CC(N)=NC=N1
99 411.0836292521 C=[O+]C1=C2C(=CC=C1)C1=C3C(=CC4=C1OCO4)C(=O)N=C3C2=NC1=NC=NC(=N)C1=N
100 425.0992793161 C=NC1=C(N=C2C3=NC(=O)C4=CC5=C(OCO5)C(=C43)C3=CC=CC([O+]=C)=C32)N=CN=C1N
101 427.1149293801 C=NC1=NC=NC(N=C2C3=C4C(=CC5=C(OCO5)C4=C4CC=CC([O+]=C)=C24)C(=O)N3)=C1N Intermediate Fragment 
102 398.0883802841 C=[O+]C1=C2C(=CC=C1)C1=C3C(=CC4=C1OCO4)C(=O)NC3=C2N=C1N=CN=CC1=N
103 427.1149293801 COC1=CC=CC(C2=C3OCOC3=CC3=C2C(=C=[NH+]C2=C4N=CNC4=NC=N2)NC3=O)=C1 Intermediate Fragment 
104 427.1149293801 COC1=C(C#[N+]C2=C3N=CNC3=NC=N2)C(=C2C3=CNC(=O)C3=CC3=C2OCO3)CC=C1 Intermediate Fragment 
105 429.1305794441 COC1=C2C(=[NH+]C3=C4NCNC4=NC=N3)C3=C4C(=CC5=C(OCO5)C4=C2CC=C1)C(=O)N3
106 401.1356648241 OC1NC2=C3C1=CC1=C(OCO1)C3=C1CC=CC=C1C2=[NH+]C1=C2NCNC2=NC=N1
107 429.1305794441 C=NC1=C([NH+]=C2C3=C4C(=CC5=C(OCO5)C4=C4CC=CC(OC)=C24)C(=O)N3)N=CN=C1N Intermediate Fragment 
108 431.1462295081 COC1=C2C(=[NH+]C3=C4NCNC4=NC=N3)C3=C4C(=CC5=C(OCO5)C4=C2CC=C1)C(O)N3
109 403.1513148881 OC1NC2=C3C(=C4CC=CC=C4C2=[NH+]C2=C4NCNC4=NC=N2)C2=C(CC31)OCO2
110 433.1618795721 COC1=C2C(=[NH+]C3=C4NCNC4=NC=N3)C3=C4C(=C2CC=C1)C1=C(CC4C(O)N3)OCO1
111 405.1669649521 OC1NC2=C3C(=C4CC=CC=C4C2=[NH+]C2=C4NCNC4=NC=N2)C2OCOC2CC31
112 417.1305794441 OC1=C2C(=[NH+]C3=C4NCNC4=NC=N3)C3=C4C(=CC5=C(OCO5)C4=C2CC=C1)C(O)N3
113 511.1360587481 COC1=C2C(=[NH+]C3=C4N=CN(C5CC(O)=CO5)C4=NC=N3)C3=C4C(=CC5=C(OCO5)C4=C2CC=C1)C(=O)N3
114 513.1517088121 COC1=C2C(=[NH+]C3=C4N=CN(C5CC(O)CO5)C4=NC=N3)C3=C4C(=CC5=C(OCO5)C4=C2CC=C1)C(=O)N3
115 515.1673588761 COC1=C2C(=[NH+]C3=C4NCN(C5CC(O)CO5)C4=NC=N3)C3=C4C(=CC5=C(OCO5)C4=C2CC=C1)C(=O)N3
116 525.1517088121 C=C1OC(N2C=NC3=C([NH+]=C4C5=C6C(=CC7=C(OCO7)C6=C6CC=CC(OC)=C46)C(=O)N5)N=CN=C32)CC1O
117 525.1517088121 COC1=C2C(=[NH+]C3=C4N=CN(C5CCC(=CO)O5)C4=NC=N3)C3=C4C(=CC5=C(OCO5)C4=C2CC=C1)C(=O)N3
118 493.1254940641 COC1=C2C(=[NH+]C3=C4N=CN(C5=CC=CO5)C4=NC=N3)C3=C4C(=CC5=C(OCO5)C4=C2CC=C1)C(=O)N3
119 495.1411441281 COC1=C2C(=[NH+]C3=C4N=CN(C5CC=CO5)C4=NC=N3)C3=C4C(=CC5=C(OCO5)C4=C2CC=C1)C(=O)N3
120 543.1622734961 COC1=C2C(=CC=C1)C1=C3C(=CC4=C1OCO4)C(=O)NC3=C2[NH+]=CC1=C(N=C=N)N(C2CC(O)C(CO)O2)C=N1 Intermediate Fragment 
121 526.1357244001 C=[NH+]C1=C(C=NC2=C3NC(=O)C4=CC5=C(OCO5)C(=C43)C3=CC=CC(OC)=C32)N=CN1C1CC(O)C(=C=O)O1
122 516.1513744641 COC1=C2C(=CC=C1)C1=C3C(=CC4=C1OCO4)C(=O)NC3=C2N=C=C1N=CN(C2CC(O)C(CO)O2)C1=[NH2+]
123 543.1622734961 COC1=C2C(=CC=C1)C1=C3C(=CC4=C1OCO4)C(=O)NC3=C2[NH+]=CN=C=NC1=CN=CN1C1CC(O)C(CO)O1 Intermediate Fragment 
124 543.1622734961 COC1=C2C(=CC=C1)C1=C3C(=CC4=C1OCO4)C(=O)NC3=C2[NH+]=C(N=C=N)C1=CN(C2CC(O)C(CO)O2)C=N1 Intermediate Fragment 
125 516.1513744641 COC1=C2C(=CC=C1)C1=C3C(=CC4=C1OCO4)C(=O)NC3=C2N=C([NH3+])C1=CN(C2CC(O)C(=CO)O2)C=N1
126 526.1357244001 C=[NH+]C(=NC1=C2NC(=O)C3=CC4=C(OCO4)C(=C32)C2=CC=CC(OC)=C21)C1=CN(C2CC(O)C(=C=O)O2)C=N1
127 543.1622734961 C=NC([NH+]=C1C2=C3C(=CC4=C(OCO4)C3=C3CC=CC(OC)=C13)C(=O)N2)=C1N=CN(C2CC(O)C(=CO)O2)C1=N Intermediate Fragment 
128 543.1622734961 C=NC1=C(C(N)=[NH+]C2=C3NC(=O)C4=CC5=C(OCO5)C(=C43)C3=CC=CC(OC)=C32)N=CN1C1CC(O)C(=CO)O1 Intermediate Fragment 
129 543.1622734961 C=C=CC1=C2C3=C(C=C4C(=O)NC(=C42)C(=[NH+]C2=C4N=CN(C5CC(O)C(CO)O5)C4=NC=N2)C1=COC)OCO3 Intermediate Fragment 
130 543.1622734961 COC=C=C=CC1=C2C3=C(C=C4C(=O)NC(=C42)C(=[NH+]C2=C4N=CN(C5CC(O)C(CO)O5)C4=NC=N2)C1)OCO3 Intermediate Fragment 
131 499.1360587481 C#CCC1=C2C3=C(C=C4C(=O)NC(=C42)C(=[NH+]C2=C4N=CN(C5CC(O)C(=CO)O5)C4=NC=N2)C1)OCO3
132 543.1622734961 COC1=C2C(=CC3=C(NC(=O)C3=CC3=COCO3)C2=[NH+]C2=C3N=CN(C4CC(O)C(=CO)O4)C3=NC=N2)CC=C1 Intermediate Fragment 
133 469.1254940641 C=C1C(=O)NC2=C1C=C1CC=CC(OC)=C1C2=[NH+]C1=C2N=CN(C3C=C(O)C(=C=O)O3)C2=NC=N1
134 543.1622734961 COC1=C2C(=[NH+]C3=C4N=CN(C5CC(O)C(CO)O5)C4=NC=N3)C(N=C=O)=C3C=CC4=C(OCO4)C3=C2CC=C1 Intermediate Fragment 
135 515.1673588761 COC1=C2C(=[NH+]C3=C4N=CN(C5CC(O)C(=CO)O5)C4=NC=N3)C(N)=C3C=CC4=C(OCO4)C3=C2CC=C1
136 543.1622734961 COC1=C2C(=[NH+]C3=C4N=CN(C5CC(O)C(=CO)O5)C4=NC=N3)C=C3C(C(N)=O)=CC4=C(OCO4)C3=C2CC=C1 Intermediate Fragment 
137 543.1622734961 COC1=C2C(=[NH+]C3=C4N=CN(C5CC(O)C(=CO)O5)C4=NC=N3)C(N)=C3C(C=O)=CC4=C(OCO4)C3=C2CC=C1 Intermediate Fragment 
138 543.1622734961 COC1=C2C(=[NH+]C3=C4N=CN(C5CC(O)C(CO)O5)C4=NC=N3)C3=C4C(=CC=C(OC=O)C4=C2CC=C1)C(=O)N3 Intermediate Fragment 
139 515.1673588761 COC1=C2C(=[NH+]C3=C4N=CN(C5CC(O)C(CO)O5)C4=NC=N3)C3=C4C(=CC=C(O)C4=C2CC=C1)C(=O)N3
140 513.1517088121 COC1=C2C(=[NH+]C3=C4N=CN(C5CC(O)C(=CO)O5)C4=NC=N3)C3=C4C(=CC=C(O)C4=C2CC=C1)C(=O)N3
141 543.1622734961 COC1=C2C(=[NH+]C3=C4N=CN(C5CC(O)C(CO)O5)C4=NC=N3)C3=C4C(=CC(OC=O)=CC4=C2CC=C1)C(=O)N3 Intermediate Fragment 
142 513.1517088121 COC1=C2C(=[NH+]C3=C4N=CN(C5CC(O)C(=CO)O5)C4=NC=N3)C3=C4C(=CC(O)=CC4=C2CC=C1)C(=O)N3
143 543.1622734961 COC1=C(O)C2=C3CC=CC(OC)=C3C(=[NH+]C3=C4N=CN(C5CC(O)C(=CO)O5)C4=NC=N3)C3=C2C(=C1)C(=O)N3 Intermediate Fragment 
144 543.1622734961 COC1=C2C(=[NH+]C3=C4N=CN(C5CC(O)C(=CO)O5)C4=NC=N3)C3=C4C(=CC(O)=C(OC)C4=C2CC=C1)C(=O)N3 Intermediate Fragment 
145 543.1622734961 COC1=C2C(=[NH+]C3=CC(N(C=N)C4CC(O)C(=CO)O4)=NC=N3)C3=C4C(=CC5=C(OCO5)C4=C2CC=C1)C(=O)N3 Intermediate Fragment 
146 526.1357244001 COC1=C2C(=[NH+]C3=CC(N(C)C4C=C(O)C(=C=O)O4)=NC=N3)C3=C4C(=CC5=C(OCO5)C4=C2CC=C1)C(=O)N3
147 387.1087813801 COC1=C2C(=[NH+]C3=CC=NC=N3)C3=NC(=O)C4=CC5=C(OCO5)C(=C43)C2CC=C1
148 371.0774812521 O=C1N=C2C(=[NH+]C3=CC=NC=N3)C3=C(O)C=CC=C3C3=C2C1=CC1=C3OCO1
149 543.1622734961 COC1=C2C(=[NH+]C3=C(N=C=NC4CC(O)C(CO)O4)C=NC=N3)C3=C4C(=CC5=C(OCO5)C4=C2CC=C1)C(=O)N3 Intermediate Fragment 
150 543.1622734961 C=NC1=C([NH+]=C2C3=C4C(=CC5=C(OCO5)C4=C4CC=CC(OC)=C24)C(=O)N3)N=CN=C1N=C1CC(O)C(CO)O1 Intermediate Fragment 
151 543.1622734961 COC1=C2C(=[NH+]C3=C4N=CN(CCC(O)C(=O)CO)C4=NC=N3)C3=C4C(=CC5=C(OCO5)C4=C2CC=C1)C(=O)N3 Intermediate Fragment 
152 525.1517088121 COC1=C2C(=[NH+]C3=C4N=CN(CCC(O)C#CO)C4=NC=N3)C3=C4C(=CC5=C(OCO5)C4=C2CC=C1)C(=O)N3
153 507.1411441281 C#CC(O)=CCN1C=NC2=C([NH+]=C3C4=C5C(=CC6=C(OCO6)C5=C5CC=CC(OC)=C35)C(=O)N4)N=CN=C21
154 483.1411441281 COC1=C2C(=[NH+]C3=C4N=CN(CC=CO)C4=NC=N3)C3=C4C(=CC5=C(OCO5)C4=C2CC=C1)C(=O)N3
155 481.1254940641 COC1=C2C(=[NH+]C3=C4N=CN(CC#CO)C4=NC=N3)C3=C4C(=CC5=C(OCO5)C4=C2CC=C1)C(=O)N3
156 453.1305794441 C=CN1C=NC2=C([NH+]=C3C4=C5C(=CC6=C(OCO6)C5=C5CC=CC(OC)=C35)C(=O)N4)N=CN=C21
157 451.1149293801 C#CN1C=NC2=C([NH+]=C3C4=C5C(=CC6=C(OCO6)C5=C5CC=CC(OC)=C35)C(=O)N4)N=CN=C21
158 507.1411441281 COC1=C2C(=[NH+]C3=C4N=CN(CC=CC#CO)C4=NC=N3)C3=C4C(=CC5=C(OCO5)C4=C2CC=C1)C(=O)N3
159 487.1724442561 COC1=C2C(=[NH+]C3=C4NCN(CCCO)C4=NC=N3)C3=C4C(=CC5=C(OCO5)C4=C2CC=C1)C(=O)N3
160 485.1567941921 COC1=C2C(=[NH+]C3=C4N=CN(CCCO)C4=NC=N3)C3=C4C(=CC5=C(OCO5)C4=C2CC=C1)C(=O)N3
161 467.1462295081 C=CCN1C=NC2=C([NH+]=C3C4=C5C(=CC6=C(OCO6)C5=C5CC=CC(OC)=C35)C(=O)N4)N=CN=C21
162 439.1149293801 COC1=C2C(=CC=C1)C1=C3C(=CC4=C1OCO4)C(=O)N=C3C2=[NH+]C1=C2N=CN(C)C2=NC=N1
163 459.1775296361 CCN1CNC2=C([NH+]=C3C4=C5C(=CC6=C(OCO6)C5=C5CC=CC(OC)=C35)C(O)N4)N=CN=C21
164 457.1618795721 CCN1CNC2=C([NH+]=C3C4=C5C(=CC6=C(OCO6)C5=C5CC=CC(OC)=C35)C(=O)N4)N=CN=C21
165 455.1462295081 CCN1C=NC2=C([NH+]=C3C4=C5C(=CC6=C(OCO6)C5=C5CC=CC(OC)=C35)C(=O)N4)N=CN=C21
166 91.0389705041 OCC(=[OH+])CO
167 441.1305794441 COC1=C2C(=[NH+]C3=C4N=CN(C)C4=NC=N3)C3=NC(=O)C4=CC5=C(OCO5)C(=C43)C2CC=C1
168 543.1622734961 COC1=C2C(=[NH+]C3=C4N=CN(COC(=CO)C(C)O)C4=NC=N3)C3=C4C(=CC5=C(OCO5)C4=C2CC=C1)C(=O)N3 Intermediate Fragment 
169 543.1622734961 COC1=C2C(=[NH+]C3=C4N=CN(C(C)OC(=CO)CO)C4=NC=N3)C3=C4C(=CC5=C(OCO5)C4=C2CC=C1)C(=O)N3 Intermediate Fragment 
170 75.0440558841 OCC=C[OH2+]
171 467.1098440001 C=[O+]C1=C2C(=NC3=C4N=CN(C(C)=O)C4=NC=N3)C3=C4C(=CC5=C(OCO5)C4=C2CC=C1)C(=O)N3
172 469.1254940641 COC1=C2C(=[NH+]C3=C4N=CN(C(C)=O)C4=NC=N3)C3=C4C(=CC5=C(OCO5)C4=C2CC=C1)C(=O)N3
173 471.1411441281 COC1=C2C(=[NH+]C3=C4N=CN(C(C)O)C4=NC=N3)C3=C4C(=CC5=C(OCO5)C4=C2CC=C1)C(=O)N3
174 473.1567941921 COC1=C2C(=[NH+]C3=C4NCN(C(C)O)C4=NC=N3)C3=C4C(=CC5=C(OCO5)C4=C2CC=C1)C(=O)N3
175 475.1724442561 COC1=C2C(=[NH+]C3=C4NCN(C(C)O)C4=NC=N3)C3=C4C(=CC5=C(OCO5)C4=C2CC=C1)C(O)N3
176 513.1517088121 COC1=C2C(=[NH+]C3=C4N=CN(C(C)OC=CO)C4=NC=N3)C3=C4C(=CC5=C(OCO5)C4=C2CC=C1)C(=O)N3
177 543.1622734961 COC1=C2C(=[NH+]C3=C4N=CN(C(CCO)OC=CO)C4=NC=N3)C3=C4C(=CC5=C(OCO5)C4=C2CC=C1)C(=O)N3 Intermediate Fragment 
178 47.0491412641 CC[OH2+]
179 29.0385765801 C=[CH3+]
180 45.0334912001 C=C[OH2+]
181 497.1204086841 COC1=C2C(=[NH+]C3=C4N=CN(C(=O)C=CO)C4=NC=N3)C3=C4C(=CC5=C(OCO5)C4=C2CC=C1)C(=O)N3
182 499.1360587481 COC1=C2C(=[NH+]C3=C4N=CN(C(=O)CCO)C4=NC=N3)C3=C4C(=CC5=C(OCO5)C4=C2CC=C1)C(=O)N3
183 501.1517088121 COC1=C2C(=[NH+]C3=C4N=CN(C(O)CCO)C4=NC=N3)C3=C4C(=CC5=C(OCO5)C4=C2CC=C1)C(=O)N3
184 499.1360587481 COC1=C2C(=[NH+]C3=C4N=CN(COC=CO)C4=NC=N3)C3=C4C(=CC5=C(OCO5)C4=C2CC=C1)C(=O)N3
185 543.1622734961 COC1=C2C(=[NH+]C3=C4N=CN(C(=O)CC(O)CCO)C4=NC=N3)C3=C4C(=CC5=C(OCO5)C4=C2CC=C1)C(=O)N3 Intermediate Fragment 
186 68.9971056921 [O+]#CC#CO
187 71.0127557561 O=CC#C[OH2+]
188 73.0284058201 OCC#C[OH2+]
189 43.0178411361 C#C[OH2+]
190 55.0178411361 C#CC=[OH+]
191 77.0597059481 OCCC[OH2+]
192 59.0491412641 C=CC[OH2+]
193 459.1411441281 COC1=C2C(=[NH+]C3=C4NCN(CO)C4=NC=N3)C3=C4C(=CC5=C(OCO5)C4=C2CC=C1)C(=O)N3
194 457.1254940641 COC1=C2C(=[NH+]C3=C4N=CN(CO)C4=NC=N3)C3=C4C(=CC5=C(OCO5)C4=C2CC=C1)C(=O)N3
195 455.1098440001 COC1=C2C(=[NH+]C3=C4N=CN(C=O)C4=NC=N3)C3=C4C(=CC5=C(OCO5)C4=C2CC=C1)C(=O)N3
196 437.0992793161 C=[O+]C1=C2C(=CC=C1)C1=C3C(=CC4=C1OCO4)C(=O)N=C3C2=NC1=C2N=CN(C)C2=NC=N1
197 453.0941939361 C=[O+]C1=C2C(=NC3=C4N=CN(C=O)C4=NC=N3)C3=C4C(=CC5=C(OCO5)C4=C2CC=C1)C(=O)N3
198 87.0440558841 CC(O)C#C[OH2+]
199 69.0334912001 C#CC(=C)[OH2+]
200 69.0334912001 C=CC#C[OH2+]
201 89.0597059481 CC(O)C=C[OH2+]
202 71.0491412641 C#CC(C)[OH2+]
203 71.0491412641 CCC#C[OH2+]
204 91.0753560121 CC(O)CC[OH2+]
205 73.0647913281 C=CC(C)[OH2+]
206 73.0647913281 CCC=C[OH2+]
207 543.1622734961 COC1=CC=CC(C2=C3OCOC3=CC3=C2C(=C=[NH+]C2=C4N=CN(C5CC(O)C(CO)O5)C4=NC=N2)NC3=O)=C1 Intermediate Fragment 
208 543.1622734961 COC1=C(C=[NH+]C2=C3N=CN(C4CC(O)C(=CO)O4)C3=NC=N2)C(=C2C3=CNC(=O)C3=CC3=C2OCO3)CC=C1 Intermediate Fragment 
