#In-silico ESI-MS/MS [M+H]+ Spectra
#PREDICTED BY CFM-ID 4.0.8
#SMILES=n1c(nc2c(c1OCC(=O)O)ncn2[C@@H]1O[C@H](CO)[C@@H](C1)O)N
#InChiKey=LQMSDHNRPMNYLK-FSDSQADBSA-N
energy0
192.05160 8.43 77 (6.1016)
210.06217 100.00 75 89 82 79 99 98 93 100 105 103 (71.168 0.78373 0.20189 0.075827 0.05904 0.041668 0.029239 0.025851 0.022525 0.0054093)
326.10951 9.70 0 204 196 170 118 121 154 157 187 169 168 161 160 (6.8668 0.10273 0.028761 0.018193 0.0054052 0.0018159 0.0012197 0.00055724 0.00033665 0.00025872 0.00023527 0.00021841 0.00010265)
energy1
150.04104 100.00 41 (59.061)
193.03562 5.32 78 80 92 (2.4706 0.4124 0.26016)
210.06217 31.77 75 89 79 82 98 93 99 103 105 100 (17.724 0.43237 0.1389 0.1377 0.10919 0.10304 0.042761 0.038546 0.027162 0.0080538)
energy2
45.03349 11.59 38 (1.5118)
55.01784 9.72 208 (1.2678)
57.03349 37.94 67 (4.9478)
59.04914 8.91 66 (1.1622)
109.05087 17.02 84 (2.22)
134.04612 26.77 2 (3.491)
136.06177 86.66 3 (11.303)
138.07742 11.99 4 (1.564)
140.09307 7.46 6 (0.97275)
150.04104 100.00 41 (13.043)
152.05669 42.98 42 (5.6056)
164.05669 10.48 54 217 (1.0318 0.33538)
166.07234 7.64 52 (0.99635)
178.07234 12.48 184 24 (0.83802 0.78998)
192.05160 15.96 77 (2.0817)
194.06725 27.72 192 58 (1.9858 1.6294)
198.09855 7.09 111 (0.92487)
208.04652 9.50 74 88 107 (1.0752 0.11081 0.052619)
208.08290 12.06 180 28 (1.3768 0.19598)
210.06217 77.25 75 103 82 93 98 105 79 89 100 99 (4.2062 2.2711 1.4973 0.75774 0.39547 0.29408 0.2877 0.16411 0.11935 0.082326)
234.09855 27.08 14 27 13 (2.0588 0.75853 0.71507)
250.09347 11.94 34 21 181 5 8 (1.031 0.40055 0.11817 0.0053396 0.0024331)
256.10403 15.42 193 (2.0116)
258.11968 15.42 194 (2.0116)
324.09386 7.70 153 222 (0.9964 0.0082534)

0 326.1095096521 [NH3+]c1nc(OCC(=O)O)c2ncn(C3CC(O)C(CO)O3)c2n1
1 248.0778156001 [NH3+]C1=NC=C2N=CN(C3CC(O)C(=C=O)O3)C2=N1
2 134.0461215481 [NH2+]=C1N=CC2=NC=NC2=N1
3 136.0617716121 [NH2+]=C1N=C2N=CN=C2CN1
4 138.0774216761 [NH3+]C1N=C2N=CN=C2CN1
5 250.0934656641 [NH3+]C1=NC=C2N=CN(C3CC(O)C(=CO)O3)C2=N1
6 140.0930717401 [NH3+]C1N=C2NCN=C2CN1
7 232.0829009801 C=C1OC(N2C=NC3=CN=C([NH3+])N=C32)C=C1O
8 250.0934656641 [NH3+]C1=NC=C2N=CN(CCC(O)C(=O)C=O)C2=N1 Intermediate Fragment 
9 252.1091157281 [NH3+]C1=NC=C2N=CN(C3CC(O)C(CO)O3)C2=N1
10 117.0546205681 OC1CCOC1=C[OH2+]
11 142.1087218041 [NH3+]C1N=C2NCNC2CN1
12 222.0985510441 [NH3+]C1=NC=C2N=CN(C3CC(O)CO3)C2=N1
13 234.0985510441 C=C1OC(N2C=NC3=CN=C([NH3+])N=C32)CC1O
14 234.0985510441 [NH3+]C1=NC=C2N=CN(C3CCC(=CO)O3)C2=N1
15 252.1091157281 C=C1N=CN(C2CC(O)C(=CO)O2)C1=NC(=N)[NH3+] Intermediate Fragment 
16 235.0825666321 CC1=C([NH+]=CN)N(C2C=C(O)C(=C=O)O2)C=N1
17 193.0607685681 CC1=CN(C2C=C(O)C(=C=[OH+])O2)C=N1
18 252.1091157281 NC([NH3+])=NCC1=CN(C2CC(O)C(=C=O)O2)C=N1 Intermediate Fragment 
19 252.1091157281 N=CN(C1=NC([NH3+])=NC=C1)C1CC(O)C(=CO)O1 Intermediate Fragment 
20 235.0825666321 C[NH+](C1=NC(N)=NC=C1)C1C=C(O)C(=C=O)O1
21 250.0934656641 [NH+]#CN(C1=NC(N)=NC=C1)C1CC(O)C(=CO)O1
22 252.1091157281 [NH3+]C1=NC=C2N=CN(CCC(O)C(=O)CO)C2=N1 Intermediate Fragment 
23 252.1091157281 CC(OC(=CO)CO)N1C=NC2=CN=C([NH3+])N=C21 Intermediate Fragment 
24 178.0723362961 CC(=O)N1C=NC2=CN=C([NH3+])N=C21
25 252.1091157281 [NH3+]C1=NC=C2N=CN(C(CCO)OC=CO)C2=N1 Intermediate Fragment 
26 252.1091157281 [NH3+]C1=NC=C2N=CN(C(=O)CC(O)CCO)C2=N1 Intermediate Fragment 
27 234.0985510441 [NH3+]C1=NC=C2N=CN(CCC(O)C#CO)C2=N1
28 208.0829009801 [NH3+]C1=NC=C2N=CN(C(=O)CCO)C2=N1
29 206.0672509161 [NH3+]C1=NC=C2N=CN(C(=O)C=CO)C2=N1
30 184.1192864881 CC(O)N1CNC2CN=C([NH3+])N=C21
31 182.1036364241 CC(O)N1CNC2=CN=C([NH3+])N=C21
32 73.0284058201 OCC#C[OH2+]
33 75.0440558841 OCC=C[OH2+]
34 250.0934656641 [NH3+]C1=NC=C2N=CN(C(=O)CC(O)C=CO)C2=N1
35 254.1247657921 [NH3+]C1=NC=C2NCN(C3CC(O)C(CO)O3)C2=N1
36 236.1142011081 CC1OC(N2C=NC3=CN=C([NH3+])N=C32)CC1O
37 63.0440558841 CC(O)[OH2+]
38 45.0334912001 C=C[OH2+]
39 61.0284058201 C=C(O)[OH2+]
40 264.0727302201 [NH3+]C1=NC(O)=C2N=CN(C3CC(O)C(=C=O)O3)C2=N1
41 150.0410361681 [NH3+]C1=NC(=O)C2=NC=NC2=N1
42 152.0566862321 [NH3+]C1=NC(=O)C2=NCNC2=N1
43 246.0621655361 [CH+]=C1OC(N2C=NC3=C(O)N=C(N)N=C32)C=C1O
44 266.0883802841 [NH3+]C1=NC(O)=C2N=CN(C3CC(O)C(=CO)O3)C2=N1
45 248.0778156001 C=C1OC(N2C=NC3=C(O)N=C([NH3+])N=C32)C=C1O
46 248.0778156001 [NH3+]C1=NC(O)=C2N=CN(C3CCC(=C=O)O3)C2=N1
47 266.0883802841 N=C([NH3+])N=C1C(=C=O)N=CN1C1CC(O)C(=CO)O1 Intermediate Fragment 
48 266.0883802841 [NH3+]C1=NC(O)=C2N=CN(CCC(O)C(=O)C=O)C2=N1 Intermediate Fragment 
49 266.0883802841 [NH3+]C1=NC(O)=C2N=CN(C(CCO)OC#CO)C2=N1 Intermediate Fragment 
50 266.0883802841 [NH3+]C1=NC(O)=C2N=CN(C(=O)CC(O)C=CO)C2=N1 Intermediate Fragment 
51 278.0883802841 COC1=C2N=CN(C3CC(O)C(=C=O)O3)C2=NC([NH3+])=N1
52 166.0723362961 COC1NC(=[NH2+])N=C2N=CN=C21
53 280.1040303481 COC1=C2N=CN(C3CC(O)C(=CO)O3)C2=NC([NH3+])=N1
54 164.0566862321 COC1=NC(=[NH2+])N=C2N=CN=C21
55 282.1196804121 COC1=C2N=CN(C3CC(O)C(CO)O3)C2=NC([NH3+])=N1
56 282.1196804121 COC1=C2N=CN(C(=O)CC(O)CCO)C2=NC([NH3+])=N1 Intermediate Fragment 
57 308.0989449681 [NH3+]C1=NC(OC#CO)=C2N=CN(C3CC(O)C(CO)O3)C2=N1
58 194.0672509161 [NH3+]C1=NC(OC=C=O)=C2NCNC2=N1
59 119.0702706321 OC1CCOC1C[OH2+]
60 119.0702706321 O=CCC(O)CC[OH2+] Intermediate Fragment 
61 89.0597059481 [OH2+]C1CCOC1
62 99.0440558841 C=C1OCC=C1[OH2+]
63 99.0440558841 [OH+]=C=C1CCCO1
64 117.0546205681 CCC(O)C(=O)C=[OH+] Intermediate Fragment 
65 99.0440558841 CC=C(O)C#C[OH2+]
66 59.0491412641 CC=C[OH2+]
67 57.0334912001 CC#C[OH2+]
68 61.0284058201 OCC=[OH+]
69 117.0546205681 O=CCC(O)C=C[OH2+] Intermediate Fragment 
70 89.0597059481 CC(O)C=C[OH2+]
71 117.0546205681 OCCCOC#C[OH2+] Intermediate Fragment 
72 117.0546205681 CCOC(=C=[OH+])CO Intermediate Fragment 
73 115.0389705041 OC1CCOC1=C=[OH+]
74 208.0465154721 NC1=NC([O+]=C=C(O)O)=C2N=CNC2=N1
75 210.0621655361 [NH3+]C1=NC(OC=C(O)O)=C2N=CNC2=N1
76 162.0410361681 C=[O+]C1=NC(=N)N=C2N=CN=C21
77 192.0516008521 [NH3+]C1=NC(OC#CO)=C2N=CNC2=N1
78 193.0356164401 OC(O)=C=[O+]C1=C2N=CNC2=NC=N1
79 210.0621655361 N=C(N)N=C1NC=NC1=C[O+]=C=C(O)O Intermediate Fragment 
80 193.0356164401 N=C=NC1=NC=NC1=C[O+]=C=C(O)O
81 168.0403674721 N=C1NC=NC1=C[O+]=C=C(O)O
82 210.0621655361 NC(=NC[O+]=C=C(O)O)N=C1C=NC=N1 Intermediate Fragment 
83 111.0665226441 NC=[NH+]C1C=NC=N1
84 109.0508725801 N=C=[NH+]C1C=NC=N1
85 107.0352225161 N=C=[N+]=C1C=NC=N1
86 82.0399735481 [NH2+]=C1C=NC=N1
87 129.0294684401 N#C[NH+]=COC=C(O)O
88 208.0465154721 N=C(N=C[O+]=C=C(O)O)N=C1C=NC=N1
89 210.0621655361 N=C(N)N=C([O+]=C=C(O)O)C1=CNC=N1 Intermediate Fragment 
90 43.0290745161 [NH+]#CN
91 168.0403674721 N=C([O+]=C=C(O)O)C1=CNC=N1
92 193.0356164401 N=C=NC([O+]=C=C(O)O)=C1C=NC=N1
93 210.0621655361 N=C1NC=NC1=C(N=C=[NH2+])OC=C(O)O Intermediate Fragment 
94 181.0356164401 N=C1N=CN=C1C(=N)[O+]=C=C(O)O
95 183.0512665041 N=C1N=CN=C1C(=[NH2+])OC=C(O)O
96 127.0138183761 N#CN=C[O+]=C=C(O)O
97 84.0556236121 [NH2+]=C1C=NCN1
98 210.0621655361 N=C(OC=C(O)O)C1=C(N=C=[NH2+])NC=N1 Intermediate Fragment 
99 210.0621655361 N=C=NC1=NC([NH3+])=NC(OC=C(O)O)=C1 Intermediate Fragment 
100 210.0621655361 N=C=NC1=C(OC=C(O)O)N=C([NH3+])N=C1 Intermediate Fragment 
101 168.0403674721 NC1=NC([O+]=C=C(O)O)=CC=N1
102 183.0512665041 N=C1N=CC(=[NH2+])C(OC=C(O)O)=N1
103 210.0621655361 C=NC1=C([O+]=C=C(O)O)N=C(N)N=C1N Intermediate Fragment 
104 183.0512665041 NC1=NC(N)=NC([O+]=C=C(O)O)=C1
105 210.0621655361 C=NC1=NC(N)=NC([O+]=C=C(O)O)=C1N Intermediate Fragment 
106 181.0356164401 N=C1N=CC(=N)C([O+]=C=C(O)O)=N1
107 208.0465154721 C=NC1=NC(=N)N=C([O+]=C=C(O)O)C1=N
108 212.0778156001 [NH3+]C1=NC(OC=C(O)O)=C2NCNC2=N1
109 214.0934656641 [NH3+]C1=NC(OCC(O)O)=C2NCNC2=N1
110 216.1091157281 [NH3+]C1=NC(OCC(O)O)C2NCNC2=N1
111 198.0985510441 [NH3+]C1=NC(OCCO)=C2NCNC2=N1
112 294.0832949041 [NH3+]C1=NC(OC=C(O)O)=C2N=CN(C3CC(O)=CO3)C2=N1
113 296.0989449681 [NH3+]C1=NC(OC=C(O)O)=C2N=CN(C3CC(O)CO3)C2=N1
114 298.1145950321 [NH3+]C1=NC(OC=C(O)O)=C2NCN(C3CC(O)CO3)C2=N1
115 308.0989449681 C=C1OC(N2C=NC3=C(OC=C(O)O)N=C([NH3+])N=C32)CC1O
116 308.0989449681 [NH3+]C1=NC(OC=C(O)O)=C2N=CN(C3CCC(=CO)O3)C2=N1
117 309.0829605561 OC=C1OC(N2C=NC3=C([OH+]C=C(O)O)N=CN=C32)CC1O
118 326.1095096521 N=C([NH3+])N=C1C(=COC=C(O)O)N=CN1C1CC(O)C(=CO)O1 Intermediate Fragment 
119 284.0877115881 [NH2+]=C1C(=COC=C(O)O)N=CN1C1CC(O)C(=CO)O1
120 238.0934656641 NC(=[NH2+])N=C1C=NCN1C1CC(O)C(=C=O)O1
121 326.1095096521 [NH3+]C(=NCOC=C(O)O)N=C1C=NCN1C1CC(O)C(=C=O)O1 Intermediate Fragment 
122 227.1138667601 NC=[NH+]C1=CN=CN1C1CC(O)C(CO)O1
123 227.1138667601 NC=[NH+]C1=CN=CN1C(=O)CC(O)CCO Intermediate Fragment 
124 225.0982166961 NC=[NH+]C1=CN=CN1C1CC(O)C(=CO)O1
125 198.0873176641 [NH2+]=C1C=NCN1C1CC(O)C(=CO)O1
126 183.0764186321 OC1CC(N2C=CN=C2)OC1=C[OH2+]
127 181.0607685681 OC1CC(N2C=CN=C2)OC1=C=[OH+]
128 207.0876520121 C=C1OC(N2C=NC=C2[NH+]=CN)C=C1O
129 225.0982166961 NC=[NH+]C1=CN=CN1CCC(O)C(=O)C=O Intermediate Fragment 
130 165.0770873281 NC=[NH+]C1=CN=CN1CC#CO
131 225.0982166961 CC(OC(=C=O)CO)N1C=NC=C1[NH+]=CN Intermediate Fragment 
132 225.0982166961 NC=[NH+]C1=CN=CN1C(CCO)OC#CO Intermediate Fragment 
133 225.0982166961 NC=[NH+]C1=CN=CN1C(=O)CC(O)C=CO Intermediate Fragment 
134 207.0876520121 NC=[NH+]C1=CN=CN1CC=C(O)C#CO
135 181.0720019481 NC=[NH+]C1=CN=CN1C(=O)C=CO
136 153.0770873281 CC(=O)N1C=NC=C1[NH+]=CN
137 151.0614372641 CC(=O)N1C=NC=C1[NH+]=C=N
138 91.0753560121 CC(O)CC[OH2+]
139 223.0825666321 NC=[NH+]C1=CN=CN1C1CC(O)C(=C=O)O1
140 205.0720019481 C=C1OC(N2C=NC=C2[NH+]=C=N)C=C1O
141 223.0825666321 NC=[NH+]C1=CN=CN1CC=C(O)C(=O)C=O Intermediate Fragment 
142 223.0825666321 NC=[NH+]C1=CN=CN1C(=O)CC(O)C#CO Intermediate Fragment 
143 221.0669165681 NC=[NH+]C1=CN=CN1C1C=C(O)C(=C=O)O1
144 219.0512665041 N=C=[NH+]C1=CN=CN1C1C=C(O)C(=C=O)O1
145 198.0873176641 [NH2+]=C1C=NCN1C(=O)CC(O)C=CO Intermediate Fragment 
146 165.0658539481 C=C1OC(N2C=CN=C2)C=C1[OH2+]
147 183.0764186321 O=C(C=[OH+])C(O)CCN1C=CN=C1 Intermediate Fragment 
148 183.0764186321 O=C(CC(O)C=C[OH2+])N1C=CN=C1 Intermediate Fragment 
149 163.0502038841 [CH+]=C1OC(N2C=CN=C2)C=C1O
150 181.0607685681 O=C(C=[OH+])C(O)=CCN1C=CN=C1 Intermediate Fragment 
151 179.0451185041 O=C1CC(N2C=CN=C2)OC1=C=[OH+]
152 146.0560175361 N=C(N)[NH+]=COC=C(O)O
153 324.0938595881 NC(N=C1C=NCN1C1C=C(O)C(=C=O)O1)=[NH+]COC=C(O)O
154 326.1095096521 NC([NH3+])=NC(OC=C(O)O)C1=CN(C2CC(O)C(=C=O)O2)C=N1 Intermediate Fragment 
155 284.0877115881 [NH3+]C(OC=C(O)O)C1=CN(C2CC(O)C(=C=O)O2)C=N1
156 210.0873176641 [NH3+]CC1=CN(C2CC(O)C(=C=O)O2)C=N1
157 326.1095096521 N=C1C(=C(N=C[NH3+])OC=C(O)O)N=CN1C1CC(O)C(=CO)O1 Intermediate Fragment 
158 299.0986106201 N=C1C(=C([NH3+])OC=C(O)O)N=CN1C1CC(O)C(=CO)O1
159 282.0720615241 [NH2+]=C1C(=COC=C(O)O)N=CN1C1CC(O)C(=C=O)O1
160 326.1095096521 NC(OC=C(O)O)C1=C(N=C[NH3+])N(C2CC(O)C(=C=O)O2)C=N1 Intermediate Fragment 
161 326.1095096521 N=CN(C1=NC([NH3+])=NC(OC=C(O)O)=C1)C1CC(O)C(=CO)O1 Intermediate Fragment 
162 309.0829605561 C[NH+](C1=NC(N)=NC(OC=C(O)O)=C1)C1C=C(O)C(=C=O)O1
163 170.0560175361 [NH3+]C1=NC(OC=C(O)O)=CC=N1
164 159.0764186321 [NH+]#CNC1CC(O)C(CO)O1
165 142.0498695361 C=[NH+]C1CC(O)C(=C=O)O1
166 159.0764186321 [NH+]#CN=C(O)CC(O)CCO Intermediate Fragment 
167 159.0764186321 CC(O)C(CO)OC=NC#[NH+] Intermediate Fragment 
168 326.1095096521 [NH3+]C1=NC(OC=C(O)O)=C(N=C=NC2CC(O)C(CO)O2)C=N1 Intermediate Fragment 
169 326.1095096521 C=NC1=C(OC=C(O)O)N=C([NH3+])N=C1N=C1CC(O)C(CO)O1 Intermediate Fragment 
170 326.1095096521 [NH3+]C1=NC(OC=C(O)O)=C2N=CN(CCC(O)C(=O)CO)C2=N1 Intermediate Fragment 
171 308.0989449681 [NH3+]C1=NC(OC=C(O)O)=C2N=CN(CCC(O)C#CO)C2=N1
172 236.1142011081 [NH3+]C1=NC=C2N=CN(CCC(O)C=CO)C2=N1
173 290.0883802841 C#CC(O)=CCN1C=NC2=C(OC=C(O)O)N=C([NH3+])N=C21
174 266.0883802841 [NH3+]C1=NC(OC=C(O)O)=C2N=CN(CC=CO)C2=N1
175 264.0727302201 [NH3+]C1=NC(OC=C(O)O)=C2N=CN(CC#CO)C2=N1
176 236.0778156001 C=CN1C=NC2=C(OC=C(O)O)N=C([NH3+])N=C21
177 290.0883802841 [NH3+]C1=NC(OC=C(O)O)=C2N=CN(CC=CC#CO)C2=N1
178 270.1196804121 [NH3+]C1=NC(OC=C(O)O)=C2NCN(CCCO)C2=N1
179 268.1040303481 [NH3+]C1=NC(OC=C(O)O)=C2N=CN(CCCO)C2=N1
180 208.0829009801 [NH3+]C1=NC(O)=C2N=CN(CC=CO)C2=N1
181 250.0934656641 C=CCN1C=NC2=C(OC=C(O)O)N=C([NH3+])N=C21
182 192.0879863601 [NH3+]C1=NC=C2N=CN(CC=CO)C2=N1
183 238.0934656641 CCN1C=NC2=C(OC=C(O)O)N=C([NH3+])N=C21
184 178.0723362961 C=CN1C=NC2=C(O)N=C([NH3+])N=C21
185 234.0621655361 C#CN1C=NC2=C(OC=C(O)O)N=C([NH3+])N=C21
186 162.0774216761 C=CN1C=NC2=CN=C([NH3+])N=C21
187 326.1095096521 CC(OC(=CO)CO)N1C=NC2=C(OC=C(O)O)N=C([NH3+])N=C21 Intermediate Fragment 
188 250.0570801561 CC(=O)N1C=NC2=C([O+]=C=C(O)O)N=C(N)N=C21
189 252.0727302201 CC(=O)N1C=NC2=C(OC=C(O)O)N=C([NH3+])N=C21
190 252.0727302201 CC(=O)N1CN=CC1=NC(=N)N=C[O+]=C=C(O)O Intermediate Fragment 
191 254.0883802841 CC(O)N1C=NC2=C(OC=C(O)O)N=C([NH3+])N=C21
192 194.0672509161 CC(=O)N1C=NC2=C(O)N=C([NH3+])N=C21
193 256.1040303481 CC(O)N1CNC2=C(OC=C(O)O)N=C([NH3+])N=C21
194 258.1196804121 CC(O)N1CNC2=C(OCC(O)O)N=C([NH3+])N=C21
195 296.0989449681 CC(OC=CO)N1C=NC2=C(OC=C(O)O)N=C([NH3+])N=C21
196 326.1095096521 [NH3+]C1=NC(OC=C(O)O)=C2N=CN(C(CCO)OC=CO)C2=N1 Intermediate Fragment 
197 47.0491412641 CC[OH2+]
198 29.0385765801 C=[CH3+]
199 280.0676448401 [NH3+]C1=NC(OC=C(O)O)=C2N=CN(C(=O)C=CO)C2=N1
200 282.0832949041 [NH3+]C1=NC(OC=C(O)O)=C2N=CN(C(=O)CCO)C2=N1
201 284.0989449681 [NH3+]C1=NC(OC=C(O)O)=C2N=CN(C(O)CCO)C2=N1
202 224.0778156001 [NH3+]C1=NC(O)=C2N=CN(C(=O)CCO)C2=N1
203 282.0832949041 [NH3+]C1=NC(OC=C(O)O)=C2N=CN(COC=CO)C2=N1
204 326.1095096521 [NH3+]C1=NC(OC=C(O)O)=C2N=CN(C(=O)CC(O)CCO)C2=N1 Intermediate Fragment 
205 68.9971056921 [O+]#CC#CO
206 71.0127557561 O=CC#C[OH2+]
207 43.0178411361 C#C[OH2+]
208 55.0178411361 C#CC=[OH+]
209 77.0597059481 OCCC[OH2+]
210 242.0883802841 [NH3+]C1=NC(OC=C(O)O)=C2NCN(CO)C2=N1
211 180.0516008521 [NH3+]C1=NC(O)=C2N=CN(C=O)C2=N1
212 240.0727302201 [NH3+]C1=NC(OC=C(O)O)=C2N=CN(CO)C2=N1
213 222.0621655361 CN1C=NC2=C([O+]=C=C(O)O)N=C(N)N=C21
214 238.0570801561 [NH3+]C1=NC(OC=C(O)O)=C2N=CN(C=O)C2=N1
215 238.0570801561 N=C(N=C[O+]=C=C(O)O)N=C1C=NCN1C=O Intermediate Fragment 
216 236.0414300921 NC1=NC([O+]=C=C(O)O)=C2N=CN(C=O)C2=N1
217 164.0566862321 [NH3+]C1=NC=C2N=CN(C=O)C2=N1
218 87.0440558841 CC(O)C#C[OH2+]
219 71.0491412641 C#CC(C)[OH2+]
220 71.0491412641 CCC#C[OH2+]
221 73.0647913281 C=CC(C)[OH2+]
222 324.0938595881 [NH3+]C1=NC(OC=C(O)O)=C2N=CN(C(=O)CC(O)C=CO)C2=N1
