#In-silico ESI-MS/MS [M+H]+ Spectra
#PREDICTED BY CFM-ID 4.0.8
#SMILES=[nH]1c(nc2c(c1=O)nc(n2[C@@H]1O[C@H](CO)[C@@H](C1)O)Nc1nc2c(n1C)c(cc1c2cccn1)C)N
#InChiKey=XBDWJVFPPWWXOR-MGPQQGTHSA-N
energy0
362.14723 32.46 10 26 36 54 41 60 69 20 59 65 38 73 70 63 66 46 43 68 51 48 53 62 (22.364 0.039207 0.030132 0.019331 0.016432 0.012523 0.01234 0.0096061 0.0086568 0.0069936 0.0069911 0.0062682 0.0054824 0.0038891 0.0022274 0.0019423 0.00077873 0.00047978 0.00038612 0.00034435 0.00026765 0.00010056)
478.19458 100.00 0 185 151 182 227 119 237 222 124 142 143 210 174 252 255 172 226 235 208 238 148 249 246 150 229 145 (67.968 0.98105 0.20989 0.092944 0.063215 0.028859 0.016985 0.01535 0.010048 0.009147 0.0085978 0.0076973 0.007355 0.0069297 0.0064134 0.0056327 0.0050286 0.0042738 0.0023964 0.0023437 0.0012473 0.0010986 0.00073091 0.0004159 0.00035312 4.9018e-05)
energy1
165.05194 3.77 16 (2.2524)
345.12068 6.14 19 21 37 72 61 49 44 (2.6468 0.50089 0.23677 0.18676 0.076701 0.013694 0.0055362)
346.11593 11.42 18 17 (4.7832 2.0349)
362.14723 100.00 10 26 20 70 36 59 60 38 54 69 41 63 73 65 48 43 53 68 66 62 46 51 (56.618 0.80495 0.47606 0.37879 0.35327 0.33098 0.11383 0.10514 0.094143 0.086447 0.06478 0.049921 0.049289 0.037501 0.031929 0.029426 0.017237 0.012576 0.010801 0.0066245 0.0035602 0.0032251)
460.18401 5.74 80 152 92 89 1 83 86 93 84 97 96 95 (2.5343 0.55772 0.084045 0.081491 0.067034 0.02821 0.022727 0.02002 0.016123 0.0078977 0.0024229 0.0022524)
478.19458 7.97 0 185 151 124 222 174 142 172 143 182 119 235 227 252 210 255 237 226 249 208 148 229 238 246 145 150 (3.2069 1.1809 0.16419 0.041004 0.039032 0.034758 0.023863 0.01324 0.012737 0.010634 0.0067139 0.005882 0.0043123 0.004085 0.0025135 0.001708 0.0016154 0.00078285 0.00063942 0.0006292 0.00052415 0.00038065 0.00037647 0.00019455 5.6972e-05 2.4328e-05)
energy2
45.03349 9.04 163 (1.7622)
55.01784 4.45 195 (0.86858)
75.04406 28.94 137 (5.6423)
89.05971 9.30 173 (1.8137)
165.05194 4.98 16 (0.97083)
197.08217 6.85 101 102 (0.81994 0.51573)
211.09782 4.53 13 (0.88271)
213.11347 5.86 12 105 104 106 103 (0.91819 0.061341 0.059454 0.052195 0.050789)
323.13633 7.88 244 (1.5362)
345.12068 6.38 19 44 72 49 21 37 61 (1.1227 0.040629 0.035677 0.015687 0.014629 0.0076153 0.0068128)
346.11593 13.02 18 17 (1.4794 1.0589)
360.13158 9.98 9 64 52 35 58 50 (1.8135 0.031804 0.030741 0.028434 0.022335 0.01867)
362.14723 100.00 10 26 38 20 54 43 63 48 70 51 59 46 36 66 41 60 53 62 65 68 73 69 (10.599 2.8659 1.0014 0.84361 0.69613 0.52193 0.3796 0.343 0.30376 0.26857 0.21844 0.2139 0.18336 0.18332 0.18263 0.15614 0.13152 0.11762 0.094889 0.068638 0.065279 0.060627)
368.19418 7.50 76 (1.4618)
385.13673 4.90 228 (0.95526)
386.14723 16.26 166 (3.1701)
388.16288 45.96 90 (8.9615)
390.14215 5.94 198 199 (0.71146 0.4467)
391.15131 4.54 123 (0.88511)
400.16288 5.19 156 (1.0116)
404.15780 7.63 175 176 (0.90906 0.57802)
408.18910 4.32 178 (0.84332)
410.20475 4.32 179 (0.84332)
418.17345 27.30 88 158 184 160 159 (1.7912 1.3175 0.77087 0.76368 0.67946)
425.16803 6.84 254 (1.333)
437.16803 4.23 243 (0.82474)
449.16803 3.88 220 (0.75672)
458.16836 4.46 207 (0.8702)
462.16328 5.61 113 239 234 116 117 114 (0.49823 0.29634 0.20368 0.041527 0.028532 0.02622)
476.17893 9.88 141 147 171 206 (1.3818 0.31341 0.15541 0.075649)

0 478.1945766681 Cc1cc2ncccc2c2nc([NH2+]c3nc4c(=O)[nH]c(N)nc4n3C3CC(O)C(CO)O3)n(C)c12
1 460.1840119841 CC1=C2C(=NC(=[NH+]C3=NC4=CN=C(N)N=C4N3C3C=C(O)C(=C=O)O3)N2C)C2CCCNC2=C1
2 346.1523179321 CC1=C2C(=NC(=[NH+]C3=NC4=NC(=N)NCC4=N3)N2C)C2=CC=CNC2=C1
3 117.0546205681 OC1CCOC1=C[OH2+]
4 99.0440558841 C=C1OCC=C1[OH2+]
5 117.0546205681 CCC(O)C(=O)C=[OH+] Intermediate Fragment 
6 99.0440558841 CC=C(O)C#C[OH2+]
7 117.0546205681 O=CCC(O)C=C[OH2+] Intermediate Fragment 
8 115.0389705041 OC1CCOC1=C=[OH+]
9 360.1315824881 [CH2+]N1C(=NC2=NC3=C(O)N=C(N)N=C3N2)N=C2C3=CC=CNC3=CC(C)=C21
10 362.1472325521 CC1=C2C(=NC(=[NH+]C3=NC4=C(O)N=C(N)N=C4N3)N2C)C2=CC=CNC2=C1
11 344.1366678681 [CH2+]N1C(=NC2=NC3=CN=C(N)N=C3N2)N=C2C3=CC=CNC3=CC(C)=C21
12 213.1134728361 CC1=C2C(=NC(=[NH2+])N2C)C2=CC=CNC2=C1
13 211.0978227721 [CH2+]N1C(=N)N=C2C3=CC=CNC3=CC(C)=C21
14 198.1025738041 CC1=CC2=C(C=CC=N2)C2=C1N([CH4+])C=N2
15 196.0869237401 [CH2+]N1C=NC2=C1C(C)=CC1=C2C=CC=N1
16 165.0519352001 NC1=NC(=O)C2=NC([NH3+])=NC2=N1
17 346.1159324241 CC1=CC2=C(C=CC=N2)C2=NC(=[NH+]C3=NC4=C(O)N=C(N)N=C4N3)N=C12
18 346.1159324241 [CH2+]N1C2=CC=C3NC=CC=C3C2=NC1=NC1=NC2=C(O)N=C(N)N=C2N1
19 345.1206834561 [CH2+]N1C(=NC2=NC3=C(O)N=CN=C3N2)N=C2C3=CC=CNC3=CC(C)=C21
20 362.1472325521 CC1=C2C(=NC(=[NH+]C3=NC(=C=O)C(=NC(=N)N)N3)N2C)C2=CC=CNC2=C1 Intermediate Fragment 
21 345.1206834561 CC1=C2C(=NC(=NC3=NC(C#[O+])=C(N=C=N)N3)N2C)C2=CC=CNC2=C1
22 320.1254344881 CC1=C2C(=NC(=NC3=NC(=C=O)C(=[NH2+])N3)N2C)C2=CC=CNC2=C1
23 318.1097844241 [CH2+]N1C(=NC2=NC(=C=O)C(=N)N2)N=C2C3=CC=CNC3=CC(C)=C21
24 303.0988853921 [CH2+]N1C(=NC2=NC(=C=O)C=N2)N=C2C3=CC=CNC3=CC(C)=C21
25 334.1523179321 CC1=C2C(=NC(=NC3=NC(=NC(N)=[NH2+])C=N3)N2C)C2=CC=CNC2=C1
26 362.1472325521 CC1=C2C(=NC(=[NH+]C3=NC(=NC(N)=NC=O)C=N3)N2C)C2=CC=CNC2=C1 Intermediate Fragment 
27 319.1414189001 CC1=C2C(=NC(=NC3=NC(=[NH+]C=N)C=N3)N2C)C2=CC=CNC2=C1
28 317.1257688361 CC1=C2C(=NC(=NC3=NC(=[NH+]C#N)C=N3)N2C)C2=CC=CNC2=C1
29 315.1101187721 [CH2+]N1C(=NC2=NC(=NC#N)C=N2)N=C2C3=CC=CNC3=CC(C)=C21
30 292.1305198681 CC1=C2C(=NC(=NC3=NC(=[NH2+])C=N3)N2C)C2=CC=CNC2=C1
31 290.1148698041 [CH2+]N1C(=NC2=NC(=N)C=N2)N=C2C3=CC=CNC3=CC(C)=C21
32 277.1196208361 C=C1C=C2NC=CC=C2C2=C1N(C)C([NH+]=C1N=CC=N1)=N2
33 275.1039707721 C=C1C=C2NC=CC=C2C2=C1N([CH2+])C(N=C1N=CC=N1)=N2
34 332.1366678681 [CH2+]N1C(=NC2=NC(=NC(=N)N)C=N2)N=C2C3=CC=CNC3=CC(C)=C21
35 360.1315824881 CC1=C2C(=NC(=NC3=NC(=NC(N)=NC#[O+])C=N3)N2C)C2=CC=CNC2=C1
36 362.1472325521 [CH2+]N1C(=NC2=NC(C(=O)N=C(N)N)=CN2)N=C2C3=CC=CNC3=CC(C)=C21 Intermediate Fragment 
37 345.1206834561 [CH2+]N1C(=NC2=NC(C(=O)N=C=N)=CN2)N=C2C3=CC=CNC3=CC(C)=C21
38 362.1472325521 CC1=C2C(=NC(=[NH+]C3=NC(=C(O)N=C=N)C(=N)N3)N2C)C2=CC=CNC2=C1 Intermediate Fragment 
39 333.1206834561 [CH2+]N1C(=NC2=NC(=N)C(C(N)=O)=N2)N=C2C3=CC=CNC3=CC(C)=C21
40 335.1363335201 CC1=C2C(=NC(=NC3=NC(=N)C(C([NH3+])=O)=N3)N2C)C2=CC=CNC2=C1
41 362.1472325521 CC1=C2C(=NC(=[NH+]C3=NC(C(N)=O)=C(N=C=N)N3)N2C)C2=CC=CNC2=C1 Intermediate Fragment 
42 320.1254344881 C=C1C=C2NC=CC=C2C2=C1N(C)C(N=C1N=CC(C([NH3+])=O)=N1)=N2
43 362.1472325521 [CH2+]N1C(=NC(=N)NC2=NC(N)=NC(O)=C2)N=C2C3=CC=CNC3=CC(C)=C21 Intermediate Fragment 
44 345.1206834561 [CH2+]N1C(N=C=NC2=NC(N)=NC(O)=C2)=NC2=C1C(C)=CC1=C2C=CC=N1
45 236.0930717401 [CH2+]N1C(=NC#N)N=C2C3=CC=CNC3=CC(C)=C21
46 362.1472325521 [CH2+]N1C(=NC(N)=NC2=C(O)N=C(N)N=C2)N=C2C3=CC=CNC3=CC(C)=C21 Intermediate Fragment 
47 238.1087218041 CC1=C2C(=NC(=NC#[NH+])N2C)C2=CC=CNC2=C1
48 362.1472325521 CC1=CC2=C(C=CC=N2)C2=C1N(C)C([NH+]=C=NC1=C(O)N=C(N)N=C1N)=N2 Intermediate Fragment 
49 345.1206834561 [CH2+]N1C(N=C=NC2=C(O)N=C(N)N=C2)=NC2=C1C(C)=CC1=C2C=CC=N1
50 360.1315824881 [CH2+]N1C(N=C=NC2=C(O)N=C(N)N=C2N)=NC2=C1C(C)=CC1=C2C=CC=N1
51 362.1472325521 CC1=CC2=C(C=CC=N2)C2=C1N(C)C([NH+]=C=NC1=NC(N)=NC(O)=C1N)=N2 Intermediate Fragment 
52 360.1315824881 [CH2+]N1C(N=C=NC2=NC(N)=NC(O)=C2N)=NC2=C1C(C)=CC1=C2C=CC=N1
53 362.1472325521 CC1=C(N(C)C#[N+]C2=NC3=C(O)N=C(N)N=C3N2)C(=N)C2=CC=CNC2=C1 Intermediate Fragment 
54 362.1472325521 C=NC1=C(N=C=[NH+]C2=NC3=C(O)N=C(N)N=C3N2)C2=C(C=C1C)NCC=C2 Intermediate Fragment 
55 192.0628342321 NC=[NH+]C1=NC2=NC(N)=NC(=O)C2=N1
56 331.1050333921 [CH2+]C1=CC2=C(C=CC=N2)C(N=C=NC2=NC3=C(O)N=C(N)N=C3N2)=C1
57 335.1363335201 CC1=CC2=C(C=CCN2)C(N=C=[NH+]C2=NC3=C(O)N=C(N)N=C3N2)=C1
58 360.1315824881 C=NC1=C(N=C=[NH+]C2=NC3=C(O)N=C(N)N=C3N2)C2=C(C=C1C)N=CC=C2
59 362.1472325521 C=NC(N=C1C=C(C)C=C2NC=CC=C21)=[NH+]C1=NC2=C(O)N=C(N)N=C2N1 Intermediate Fragment 
60 362.1472325521 [CH2+]N(C1=CC2=C(C=C1C)N=CC=C2)C(N)=NC1=NC2=C(O)N=C(N)N=C2N1 Intermediate Fragment 
61 345.1206834561 CC1=CC2=C(C=CC=N2)C=C1N(C)C#[N+]C1=NC2=NC(N)=NC(=O)C2=N1
62 362.1472325521 [CH2+]N1C(=NC2=NC3=C(O)N=C(N)N=C3N2)N=C(C2=CN=CC=C2)C1=C(C)C Intermediate Fragment 
63 362.1472325521 [CH2+]N1C(=NC2=NC3=C(O)N=C(N)N=C3N2)N=CC1=C(C)C=C1C=CC=CN1 Intermediate Fragment 
64 360.1315824881 [CH2+]N1C(=NC2=NC3=NC(N)=NC(=O)C3=N2)N=CC1=C(C)C=C1C=CC=CN1
65 362.1472325521 C=C=C=C1NC=CC=C1C1=NC(=[NH+]C2=NC3=C(O)N=C(N)N=C3N2)N(C)C1 Intermediate Fragment 
66 362.1472325521 C=C=NC1=CC(C)=C2C(=NC(=[NH+]C3=NC4=C(O)N=C(N)N=C4N3)N2C)C1=C Intermediate Fragment 
67 321.1206834561 C=C1C=CC(C)=C2C1=NC(=[NH+]C1=NC3=NC(N)=NC(=O)C3=N1)N2C
68 362.1472325521 C=C=C1C(N=C)=CC(C)=C2C1=NC(=[NH+]C1=NC3=C(O)N=C(N)N=C3N1)N2C Intermediate Fragment 
69 362.1472325521 C=C=C=C1C(N)=CC(C)=C2C1=NC(=[NH+]C1=NC3=C(O)N=C(N)N=C3N1)N2C Intermediate Fragment 
70 362.1472325521 CC1=C2C(=NC(=[NH+]C3=NC4=C(O)N=C(N)N=C4N3)N2C)C(=C=C=CN)C=C1 Intermediate Fragment 
71 335.1363335201 CC=C1C=CC(C)=C2C1=NC(=[NH+]C1=NC3=NC(N)=NC(=O)C3=N1)N2C
72 345.1206834561 C=C=C=C1C=CC(C)=C2C1=NC(=NC1=NC3=C(O)N=C(N)N=C3N1)N2[CH2+]
73 362.1472325521 C=C=C=NC1=CC(C)=C2C(=NC(=[NH+]C3=NC4=C(O)N=C(N)N=C4N3)N2C)C1 Intermediate Fragment 
74 364.1628826161 CC1=C2C(=NC(=[NH+]C3=NC4=C(O)N=C(N)N=C4N3)N2C)C2=CCCNC2=C1
75 366.1785326801 CC1=C2C(=NC(=[NH+]C3=NC4=C(O)N=C(N)N=C4N3)N2C)C2CCCNC2=C1
76 368.1941827441 CC1=C2C(=NC(=[NH+]C3=NC4=C(O)N=C(N)N=C4N3)N2C)C2CCCNC2C1
77 446.1683619201 CC1=C2C(=NC(=[NH+]C3=NC4=C(O)N=C(N)N=C4N3C3CC(O)=CO3)N2C)C2=CC=CNC2=C1
78 448.1840119841 CC1=C2C(=NC(=[NH+]C3=NC4=C(O)N=C(N)N=C4N3C3CC(O)=CO3)N2C)C2=CCCNC2=C1
79 450.1996620481 CC1=C2C(=NC(=[NH+]C3=NC4=C(O)N=C(N)N=C4N3C3CC(O)=CO3)N2C)C2CCCNC2=C1
80 460.1840119841 C=C1OC(N2C([NH+]=C3N=C4C5=CCCNC5=CC(C)=C4N3C)=NC3=C(O)N=C(N)N=C32)C=C1O
81 442.1734473001 C=C1C=CC(N2C([NH+]=C3N=C4C5=CC=CNC5=CC(C)=C4N3C)=NC3=C(O)N=C(N)N=C32)O1
82 444.1527118561 C=C1OC(N2C([NH+]=C3N=C4C5=CC=CNC5=CC=C4N3C)=NC3=C(O)N=C(N)N=C32)C=C1O
83 460.1840119841 C=C1OC(N2C([NH+]=C3N=C4C5=CCCNC5=CC(C)=C4N3C)=NC(=C=O)C2=NC(=N)N)C=C1O Intermediate Fragment 
84 460.1840119841 C=C1OC(N2C(=NC(N)=NC=O)C=NC2=[NH+]C2=NC3=C(C(C)=CC4=C3C=CCN4)N2C)C=C1O Intermediate Fragment 
85 390.1672993001 C=C1OC(N2C(=[NH2+])C=NC2=NC2=NC3=C(C(C)=CC4=C3C=CCN4)N2C)C=C1O
86 460.1840119841 CC(=O)C(O)=CCN1C([NH+]=C2N=C3C4=CC=CNC4=CC(C)=C3N2C)=NC2=C(O)N=C(N)N=C21 Intermediate Fragment 
87 442.1734473001 C#CC(O)=CCN1C([NH+]=C2N=C3C4=CC=CNC4=CC(C)=C3N2C)=NC2=C(O)N=C(N)N=C21
88 418.1734473001 CC1=C2C(=NC(=[NH+]C3=NC4=C(O)N=C(N)N=C4N3CC#CO)N2C)C2=CCCNC2=C1
89 460.1840119841 C=C(C=O)OC(C)N1C([NH+]=C2N=C3C4=CC=CNC4=CC(C)=C3N2C)=NC2=C(O)N=C(N)N=C21 Intermediate Fragment 
90 388.1628826161 C=CN1C([NH+]=C2N=C3C4=CC=CNC4=CC(C)=C3N2C)=NC2=C(O)N=C(N)N=C21
91 390.1785326801 CCN1C([NH+]=C2N=C3C4=CC=CNC4=CC(C)=C3N2C)=NC2=C(O)N=C(N)N=C21
92 460.1840119841 C#COC(C=C=O)N1C([NH+]=C2N=C3C(=C(C)C=C4NCCCC43)N2C)=NC2=C(O)N=C(N)N=C21 Intermediate Fragment 
93 460.1840119841 C#CC(O)=CC(=O)N1C([NH+]=C2N=C3C(=C(C)C=C4NCCCC43)N2C)=NC2=C(O)N=C(N)N=C21 Intermediate Fragment 
94 434.1683619201 CC1=C2C(=NC(=[NH+]C3=NC4=C(O)N=C(N)N=C4N3C(=O)C#CO)N2C)C2CCCNC2=C1
95 460.1840119841 C=NC1=C(N=C=[NH+]C2=NC3=C(O)N=C(N)N=C3N2C2C=C(O)C(=C)O2)C2=C(C=C1C)NCCC2 Intermediate Fragment 
96 460.1840119841 C=C1OC(N2C([NH+]=C3N=CC(=C(C)C=C4C=CC=CN4)N3C)=NC3=C(O)N=C(N)N=C32)C=C1O Intermediate Fragment 
97 460.1840119841 C=C1OC(N2C([NH+]=C3N=C4C(=C=CCN)C=CC(C)=C4N3C)=NC3=C(O)N=C(N)N=C32)C=C1O Intermediate Fragment 
98 219.1604230281 CC1=C2C(=NC(=[NH2+])N2C)C2CCCNC2C1
99 217.1447729641 CC1=C2C(=NC(=[NH2+])N2C)C2CCCNC2=C1
100 215.1291229001 CC1=C2C(=NC(=[NH2+])N2C)C2=CCCNC2=C1
101 197.0821727081 CC1=CC2=C(C=CC=N2)C2=NC(=[NH2+])N=C12
102 197.0821727081 [CH2+]N1C(=N)N=C2C3=CC=CNC3=CC=C21
103 213.1134728361 CC1=C(N(C)C#[NH+])C(=N)C2=CC=CNC2=C1 Intermediate Fragment 
104 213.1134728361 [CH2+]N(C(=N)N)C1=CC2=C(C=C1C)N=CC=C2 Intermediate Fragment 
105 213.1134728361 CN=C1C(C)=CC2=C(C=CCN2)C1=NC#[NH+] Intermediate Fragment 
106 213.1134728361 [CH2+]N1C(=N)N=CC1=C(C)C=C1C=CC=CN1 Intermediate Fragment 
107 264.0727302201 [NH3+]C1=NC(O)=C2N=CN(C3CC(O)C(=C=O)O3)C2=N1
108 266.0883802841 [NH3+]C1=NC(O)=C2N=CN(C3CC(O)C(=CO)O3)C2=N1
109 204.1495239961 CC1=CC2NCCCC2C2=C1N([CH4+])C=N2
110 275.0523291241 NC1=NC(O)=C2N=C([NH3+])N(C3=CC(=O)C(=C=O)O3)C2=N1
111 279.0836292521 NC1=NC(O)=C2N=C([NH3+])N(C3CC(O)C(=C=O)O3)C2=N1
112 281.0992793161 NC1=NC(O)=C2N=C([NH3+])N(C3CC(O)C(=CO)O3)C2=N1
113 462.1632765401 CC1=CC2NCCCC2C2=NC(=[NH+]C3=NC4=C(O)N=C(N)N=C4N3C3C=C(O)C(=C=O)O3)N=C12
114 462.1632765401 CN1C2=CC=C3NCCCC3C2=NC1=[NH+]C1=NC2=C(O)N=C(N)N=C2N1C1C=C(O)C(=C=O)O1
115 348.1315824881 CN1C2=CC=C3NCCC=C3C2=NC1=[NH+]C1=NC2=NC(N)=NC(=O)C2=N1
116 462.1632765401 CN1C2=CC=C3NCCC=C3C2=NC1=[NH+]C1=NC2=C(O)N=C(N)N=C2N1CC=C(O)C(=O)C=O Intermediate Fragment 
117 462.1632765401 CN1C2=CC=C3NCCCC3C2=NC1=[NH+]C1=NC2=C(O)N=C(N)N=C2N1C(=O)C=C(O)C#CO Intermediate Fragment 
118 461.1680275721 CC1=C2C(=NC(=[NH+]C3=NC4=C(O)N=CN=C4N3C3C=C(O)C(=C=O)O3)N2C)C2CCCNC2=C1
119 478.1945766681 CC1=C2C(=NC(=[NH+]C3=NC(=C=O)C(=NC(=N)N)N3C3C=C(O)C(=C=O)O3)N2C)C2CCCNC2C1 Intermediate Fragment 
120 461.1680275721 CC1=C2C(=NC(=NC3=NC(C=O)=C([NH+]=CN)N3C3C=C(O)C(=C=O)O3)N2C)C2=CCCNC2=C1
121 436.1727786041 CC1=C2C(=NC(=NC3=NC(=C=O)C(=[NH2+])N3C3C=C(O)C(=C=O)O3)N2C)C2CCCNC2C1
122 419.1462295081 CC1=C2C(=NC(=[NH+]C3=NC(C=O)=CN3C3C=C(O)C(=C=O)O3)N2C)C2=CCCNC2=C1
123 391.1513148881 CC1=C2C(=NC(=[NH+]C3=NC=CN3C3C=C(O)C(=C=O)O3)N2C)C2=CCCNC2=C1
124 478.1945766681 CC1=CC2NCCCC2C2=C1N(C)C([NH+]=C1N=CC(=NC(N)=NC=O)N1C1C=C(O)C(=C=O)O1)=N2 Intermediate Fragment 
125 435.1887630161 CC1=C2C(=NC(=NC3=NC=C([NH+]=CN)N3C3C=C(O)C(=C=O)O3)N2C)C2CCCNC2=C1
126 408.1778639841 CC1=CC2NCCCC2C2=C1N(C)C(N=C1N=CC(=[NH2+])N1C1C=C(O)C(=C=O)O1)=N2
127 435.1887630161 CC1=C2C(=NC(=NC3=NC=C([NH+]=CN)N3CC=C(O)C(=O)C=O)N2C)C2=CCCNC2=C1 Intermediate Fragment 
128 435.1887630161 CC1=C2C(=NC(=NC3=NC=C([NH+]=CN)N3C(=O)C=C(O)C#CO)N2C)C2CCCNC2=C1 Intermediate Fragment 
129 433.1731129521 CC1=C2C(=NC(=NC3=NC=C([NH+]=CN)N3C3C=C(O)C(=C=O)O3)N2C)C2=CCCNC2=C1
130 433.1731129521 CC1=C2C(=NC(=NC3=NC=C([NH+]=CN)N3CC=C(O)C(=O)C=O)N2C)C2=CC=CNC2=C1 Intermediate Fragment 
131 431.1574628881 CC1=C2C(=NC(=NC3=NC=C([NH+]=CN)N3C3C=C(O)C(=C=O)O3)N2C)C2=CC=CNC2=C1
132 410.1935140481 CC1CC2NCCCC2C2=C1N(C)C(N=C1N=CC(=[NH2+])N1C1C=C(O)C(=C=O)O1)=N2
133 390.1672993001 CC1=CC2=C(CCCN2)C2=C1N(C)C(N=C1N=CC(=[NH2+])N1C1C=CC(=C=O)O1)=N2
134 408.1778639841 CC1=CC2=C(CCCN2)C2=C1N(C)C(N=C1N=CC(=[NH2+])N1CC=C(O)C(=O)C=O)=N2 Intermediate Fragment 
135 408.1778639841 CC1=CC2NCCCC2C2=C1N(C)C(N=C1N=CC(=[NH2+])N1C(=O)C=C(O)C#CO)=N2 Intermediate Fragment 
136 364.1516492361 CC1=CC2=C(CCCN2)C2=C1N(C)C(N=C1N=CC(=[NH2+])N1C(=O)C#CO)=N2
137 75.0440558841 OCC=C[OH2+]
138 393.1669649521 CC1=C2C(=NC(=[NH+]C3=NC=CN3C3C=C(O)C(=C=O)O3)N2C)C2CCCNC2=C1
139 450.1996620481 CC1=CC2NCCCC2C2=C1N(C)C(N=C1N=CC(=NC(N)=[NH2+])N1C1C=C(O)C(=C=O)O1)=N2
140 450.1996620481 CC1=CC2NCCCC2C2=C1N(C)C(N=C1N=CC(=NC(N)=[NH2+])N1C(=O)C=C(O)C#CO)=N2 Intermediate Fragment 
141 476.1789266041 CC1=CC2=C(CCCN2)C2=C1N(C)C(N=C1N=CC(=NC(N)=[NH+]C=O)N1C1C=C(O)C(=C=O)O1)=N2
142 478.1945766681 CC1=C2C(=NC(=[NH+]C3=NC(C(=O)N=C(N)N)=CN3C3C=C(O)C(=C=O)O3)N2C)C2CCCNC2=C1 Intermediate Fragment 
143 478.1945766681 CC1=C2C(=NC(=[NH+]C3=NC(=C(O)N=CN)C(=N)N3C3C=C(O)C(=C=O)O3)N2C)C2CCCNC2=C1 Intermediate Fragment 
144 434.1571285401 CC1=C2C(=NC(=NC3=NC(=C=O)C(=[NH2+])N3C3C=C(O)C(=C=O)O3)N2C)C2CCCNC2=C1
145 478.1945766681 CC1=C2C(=NC(=[NH+]C(=N)N(C3=NC(N)=NC(O)=C3)C3C=C(O)C(=C=O)O3)N2C)C2CCCNC2=C1 Intermediate Fragment 
146 367.1513148881 CC1=C2C(=NC(=NC(=[NH2+])N=C3C=C(O)C(=C=O)O3)N2C)C2CCCNC2=C1
147 476.1789266041 CC1=C2C(=NC(=NC(=[NH2+])N(C3=NC(N)=NC(O)=C3)C3C=C(O)C(=C=O)O3)N2C)C2=CCCNC2=C1
148 478.1945766681 CC1=C2C(=NC(=[NH+]C(=NC3=C(O)N=C(N)N=C3)N=C3C=C(O)C(=C=O)O3)N2C)C2CCCNC2C1 Intermediate Fragment 
149 125.0457872001 NC1=NC(=O)C(=[NH2+])C=N1
150 478.1945766681 CC1=CC2=C(CCCN2)C2=C1N(C)C([NH+]=CN(C1=NC(N)=NC(O)=C1N)C1C=C(O)C(=C=O)O1)=N2 Intermediate Fragment 
151 478.1945766681 CC1=C2C(=NC(=[NH+]C3=NC4=C(O)N=C(N)N=C4N3CC=C(O)C(=O)C=O)N2C)C2CCCNC2=C1 Intermediate Fragment 
152 460.1840119841 CC1=C2C(=NC(=[NH+]C3=NC4=C(O)N=C(N)N=C4N3CC=C(O)C#CO)N2C)C2=CCCNC2=C1
153 422.2047474281 CC1=C2C(=NC(=[NH+]C3=NC4=C(O)N=C(N)N=C4N3CC#CO)N2C)C2CCCNC2C1
154 420.1890973641 CC1=C2C(=NC(=[NH+]C3=NC4=C(O)N=C(N)N=C4N3CC#CO)N2C)C2CCCNC2=C1
155 402.1785326801 C#CCN1C([NH+]=C2N=C3C4=CCCNC4=CC(C)=C3N2C)=NC2=C(O)N=C(N)N=C21
156 400.1628826161 C#CCN1C([NH+]=C2N=C3C4=CC=CNC4=CC(C)=C3N2C)=NC2=C(O)N=C(N)N=C21
157 374.1472325521 C=C1C=C2NC=CC=C2C2=C1N(C)C([NH+]=C1N=C3C(=O)N=C(N)N=C3N1C)=N2
158 418.1734473001 CC1=CC2=C(C=CCN2)C2=C1N(C)C([NH+]=C1N=CC(=NC(N)=NC=O)N1CC#CO)=N2 Intermediate Fragment 
159 418.1734473001 CC1=C2C(=NC(=[NH+]C(N=CC#CO)=NC3=C(O)N=C(N)N=C3)N2C)C2=CCCNC2=C1 Intermediate Fragment 
160 418.1734473001 CC1=CC2=C(C=CC=N2)C2=C1N(C)C([NH+]=CN(CC#CO)C1=NC(N)=NC(O)=C1N)=N2 Intermediate Fragment 
161 416.1577972361 CC1=C2C(=NC(=[NH+]C3=NC4=C(O)N=C(N)N=C4N3CC#CO)N2C)C2=CC=CNC2=C1
162 63.0440558841 OCC[OH2+]
163 45.0334912001 C=C[OH2+]
164 394.2098328081 CCN1C([NH+]=C2N=C3C(=C(C)C=C4NCCCC43)N2C)=NC2=C(O)N=C(N)N=C21
165 392.1941827441 CCN1C([NH+]=C2N=C3C4=CCCNC4=CC(C)=C3N2C)=NC2=C(O)N=C(N)N=C21
166 386.1472325521 C#CN1C([NH+]=C2N=C3C4=CC=CNC4=CC(C)=C3N2C)=NC2=C(O)N=C(N)N=C21
167 91.0389705041 OCC(=[OH+])CO
168 73.0284058201 OCC#C[OH2+]
169 93.0546205681 OCC([OH2+])CO
170 372.1315824881 C=C1C=C2NC=CC=C2C2=C1N(C)C(N=C1N=C3C(=O)N=C(N)N=C3N1[CH2+])=N2
171 476.1789266041 CC1=C2C(=NC(=[NH+]C3=NC4=C(O)N=C(N)N=C4N3CC=C(O)C(=O)C=O)N2C)C2=CCCNC2=C1
172 478.1945766681 C=C(O)C(=C=O)OCN1C([NH+]=C2N=C3C(=C(C)C=C4NCCCC43)N2C)=NC2=C(O)N=C(N)N=C21 Intermediate Fragment 
173 89.0597059481 CC(O)C=C[OH2+]
174 478.1945766681 CC1=C2C(=NC(=[NH+]C3=NC4=C(O)N=C(N)N=C4N3C(C)OC(=C=O)C=O)N2C)C2CCCNC2=C1 Intermediate Fragment 
175 404.1577972361 CC(=O)N1C([NH+]=C2N=C3C4=CC=CNC4=CC(C)=C3N2C)=NC2=C(O)N=C(N)N=C21
176 404.1577972361 CC(=O)N1C(=NC(N)=NC=O)C=NC1=[NH+]C1=NC2=C(C(C)=CC3=C2C=CC=N3)N1C Intermediate Fragment 
177 406.1734473001 CC(=O)N1C([NH+]=C2N=C3C4=CCCNC4=CC(C)=C3N2C)=NC2=C(O)N=C(N)N=C21
178 408.1890973641 CC(=O)N1C([NH+]=C2N=C3C(=C(C)C=C4NCCCC43)N2C)=NC2=C(O)N=C(N)N=C21
179 410.2047474281 CC(=O)N1C([NH+]=C2N=C3C(=C(C)CC4NCCCC34)N2C)=NC2=C(O)N=C(N)N=C21
180 448.1840119841 CC1=C2C(=NC(=[NH+]C3=NC4=C(O)N=C(N)N=C4N3C(C)OC#CO)N2C)C2=CCCNC2=C1
181 450.1996620481 CC1=C2C(=NC(=[NH+]C3=NC4=C(O)N=C(N)N=C4N3C(C)OC#CO)N2C)C2CCCNC2=C1
182 478.1945766681 CC1=C2C(=NC(=[NH+]C3=NC4=C(O)N=C(N)N=C4N3C(C=C=O)OC#CO)N2C)C2CCCNC2C1 Intermediate Fragment 
183 436.1840119841 CC1=C2C(=NC(=[NH+]C3=NC4=C(O)N=C(N)N=C4N3C(=O)C#CO)N2C)C2CCCNC2C1
184 418.1734473001 C#CC(=O)N1C([NH+]=C2N=C3C(=C(C)C=C4NCCCC43)N2C)=NC2=C(O)N=C(N)N=C21
185 478.1945766681 CC1=C2C(=NC(=[NH+]C3=NC4=C(O)N=C(N)N=C4N3C(=O)C=C(O)C#CO)N2C)C2CCCNC2C1 Intermediate Fragment 
186 432.1527118561 CC1=C2C(=NC(=[NH+]C3=NC4=C(O)N=C(N)N=C4N3C(=O)C#CO)N2C)C2=CCCNC2=C1
187 414.1421471721 CC1=C2C(=NC(=NC3=NC4=C(O)N=C(N)N=C4N3[CH+]C#CO)N2C)C2=CC=CNC2=C1
188 47.0491412641 CC[OH2+]
189 29.0385765801 C=[CH3+]
190 402.1421471721 [CH2+]C(=O)N1C(N=C2N=C3C4=CC=CNC4=CC(C)=C3N2C)=NC2=C(O)N=C(N)N=C21
191 68.9971056921 [O+]#CC#CO
192 41.0021910721 [C+]#CO
193 71.0127557561 O=CC#C[OH2+]
194 43.0178411361 C#C[OH2+]
195 55.0178411361 C#CC=[OH+]
196 394.1734473001 CC1=C2C(=NC(=[NH+]C3=NC4=C(O)N=C(N)N=C4N3C=O)N2C)C2CCCNC2=C1
197 392.1577972361 CC1=C2C(=NC(=[NH+]C3=NC4=C(O)N=C(N)N=C4N3C=O)N2C)C2=CCCNC2=C1
198 390.1421471721 CC1=C2C(=NC(=[NH+]C3=NC4=C(O)N=C(N)N=C4N3C=O)N2C)C2=CC=CNC2=C1
199 390.1421471721 CC1=CC2=C(C=CC=N2)C2=C1N(C)C([NH+]=C1N=CC(=NC(N)=NC=O)N1C=O)=N2 Intermediate Fragment 
200 388.1264971081 CC1=C2C(=NC(=NC3=NC4=C(O)N=C(N)N=C4N3C#[O+])N2C)C2=CC=CNC2=C1
201 87.0440558841 CC(O)C#C[OH2+]
202 69.0334912001 C=CC#C[OH2+]
203 91.0753560121 CC(O)CC[OH2+]
204 73.0647913281 C=CC(C)[OH2+]
205 73.0647913281 CCC=C[OH2+]
206 476.1789266041 CC1=C2C(=NC(=[NH+]C3=NC4=C(O)N=C(N)N=C4N3C(=O)C=C(O)C#CO)N2C)C2CCCNC2=C1
207 458.1683619201 CC1=C2C(=NC(=[NH+]C3=NC4=C(O)N=C(N)N=C4N3CC=C(O)C#CO)N2C)C2=CC=CNC2=C1
208 478.1945766681 CC1=C(N(C)C=[NH+]C2=NC3=C(O)N=C(N)N=C3N2C2C=C(O)C(=C=O)O2)C(=N)C2CCCNC2=C1 Intermediate Fragment 
209 186.1025738041 CN=C1C(=[NH2+])C2=C(C=C1C)N=CC=C2
210 478.1945766681 C=NC1=C(N=C=[NH+]C2=NC3=C(O)N=C(N)N=C3N2C2C=C(O)C(=C=O)O2)C2CCCNC2CC1C Intermediate Fragment 
211 171.0916747721 C=[NH+]C1=CC2=C(C=C1C)N=CC=C2
212 169.0760247081 C#[N+]C1=CC2=C(C=C1C)N=CC=C2
213 308.1101783481 NC[NH2+]C1=NC2=C(O)N=C(N)N=C2N1C1CC(O)C(=C=O)O1
214 291.0836292521 C[NH2+]C1=NC2=C(O)N=C(N)N=C2N1C1C=C(O)C(=C=O)O1
215 308.1101783481 NC[NH2+]C1=NC2=C(O)N=C(N)N=C2N1C(=O)CC(O)C#CO Intermediate Fragment 
216 310.1258284121 NC[NH2+]C1=NC2=C(O)N=C(N)N=C2N1C1CC(O)C(=CO)O1
217 447.1523775081 CC1=CC2=C(CCCN2)C(N=C=[NH+]C2=NC3=C(O)N=C(N)N=C3N2C2C=C(O)C(=C=O)O2)=C1
218 333.1206834561 CC1=CC2=C(C=CCN2)C(N=C=[NH+]C2=NC3=NC(N)=NC(=O)C3=N2)=C1
219 447.1523775081 CC1=CC2=C(C=CCN2)C(N=C=[NH+]C2=NC3=C(O)N=C(N)N=C3N2CC=C(O)C(=O)C=O)=C1 Intermediate Fragment 
220 449.1680275721 CC1=CC2NCCCC2C(N=C=[NH+]C2=NC3=C(O)N=C(N)N=C3N2C2C=C(O)C(=C=O)O2)=C1
221 451.1836776361 CC1C=C(N=C=[NH+]C2=NC3=C(O)N=C(N)N=C3N2C2C=C(O)C(=C=O)O2)C2CCCNC2C1
222 478.1945766681 C=NC(N=C1C=C(C)CC2NCCCC12)=[NH+]C1=NC2=C(O)N=C(N)N=C2N1C1C=C(O)C(=C=O)O1 Intermediate Fragment 
223 320.1101783481 CNC[NH2+]C1=NC2=C(O)N=C(N)N=C2N1C1C=C(O)C(=C=O)O1
224 144.0807757401 [CH4+]C1=CC2=C(C=CC=N2)C=C1
225 142.0651256761 [CH2+]C1=CC2=C(C=CC=N2)C=C1
226 478.1945766681 CC1=CC2=C(C=C1N(C)C(N)=[NH+]C1=NC3=C(O)N=C(N)N=C3N1C1C=C(O)C(=C=O)O1)CCCN2 Intermediate Fragment 
227 478.1945766681 C=C1NCCCC1C1=NC(=[NH+]C2=NC3=C(O)N=C(N)N=C3N2C2C=C(O)C(=C=O)O2)N(C)C1=CC Intermediate Fragment 
228 385.1367274441 CCC1C=NC(=[NH+]C2=NC3=C(O)N=C(N)N=C3N2C2C=C(O)C(=C=O)O2)N1C
229 478.1945766681 CC(C)=C1C(C2=CNCCC2)=NC(=[NH+]C2=NC3=C(O)N=C(N)N=C3N2C2C=C(O)C(=C=O)O2)N1C Intermediate Fragment 
230 434.1319764121 CN1CC(C2=CN=CC=C2)=NC1=[NH+]C1=NC2=C(O)N=C(N)N=C2N1C1C=C(O)C(=C=O)O1
231 438.1632765401 CN1CC(C2=CNCCC2)=NC1=[NH+]C1=NC2=C(O)N=C(N)N=C2N1C1C=C(O)C(=C=O)O1
232 322.1159324241 CN1CC(C2=CN=CC=C2)=NC1=[NH+]C1=NC2=NC(N)=NC(=O)C2=N1
233 438.1632765401 CN1CC(C2=CNCCC2)=NC1=[NH+]C1=NC2=C(O)N=C(N)N=C2N1C(=O)C=C(O)C#CO Intermediate Fragment 
234 462.1632765401 CC=C1C(C2=CNCC=C2)=NC(=[NH+]C2=NC3=C(O)N=C(N)N=C3N2C2C=C(O)C(=C=O)O2)N1C
235 478.1945766681 CC(C=C1CCCCN1)=C1C=NC(=[NH+]C2=NC3=C(O)N=C(N)N=C3N2C2C=C(O)C(=C=O)O2)N1C Intermediate Fragment 
236 399.1523775081 CC(C)C1C=NC(=[NH+]C2=NC3=C(O)N=C(N)N=C3N2C2C=C(O)C(=C=O)O2)N1C
237 478.1945766681 CC=C=C1NCCCC1C1=NC(=[NH+]C2=NC3=C(O)N=C(N)N=C3N2C2C=C(O)C(=C=O)O2)N(C)C1 Intermediate Fragment 
238 478.1945766681 CCNC1=CC(C)=C2C(=NC(=[NH+]C3=NC4=C(O)N=C(N)N=C4N3C3C=C(O)C(=C=O)O3)N2C)C1C Intermediate Fragment 
239 462.1632765401 C=C1C(NC)=CC(C)=C2C1=NC(=[NH+]C1=NC3=C(O)N=C(N)N=C3N1C1C=C(O)C(=C=O)O1)N2C
240 452.1789266041 CC1=C2C(=NC(=[NH+]C3=NC4=C(O)N=C(N)N=C4N3C3C=C(O)C(=C=O)O3)N2C)C(C)C(N)C1
241 435.1523775081 CC1=C2C(=NC(=[NH+]C3=NC4=C(O)N=C(N)N=C4N3C3C=C(O)C(=C=O)O3)N2C)C(C)C=C1
242 452.1789266041 CC1=C2C(=NC(=[NH+]C3=NC4=C(O)N=C(N)N=C4N3C(=O)C=C(O)C#CO)N2C)C(C)C(N)C1 Intermediate Fragment 
243 437.1680275721 CC1=C2C(=NC(=[NH+]C3=NC4=C(O)N=C(N)N=C4N3C3C=C(O)C(=C=O)O3)N2C)C(C)CC1
244 323.1363335201 CC1=C2C(=NC(=[NH+]C3=NC4=NC(N)=NC(=O)C4=N3)N2C)C(C)C=C1
245 433.1367274441 C=C1C=CC(C)=C2C1=NC(=[NH+]C1=NC3=C(O)N=C(N)N=C3N1C1C=C(O)C(=C=O)O1)N2C
246 478.1945766681 CCC1C(NC)=CC(C)=C2C1=NC(=[NH+]C1=NC3=C(O)N=C(N)N=C3N1C1C=C(O)C(=C=O)O1)N2C Intermediate Fragment 
247 451.1836776361 CCC1CCC(C)=C2C1=NC(=[NH+]C1=NC3=C(O)N=C(N)N=C3N1C1C=C(O)C(=C=O)O1)N2C
248 447.1523775081 CC=C1C=CC(C)=C2C1=NC(=[NH+]C1=NC3=C(O)N=C(N)N=C3N1C1C=C(O)C(=C=O)O1)N2C
249 478.1945766681 CCCC1C(N)=CC(C)=C2C1=NC(=[NH+]C1=NC3=C(O)N=C(N)N=C3N1C1C=C(O)C(=C=O)O1)N2C Intermediate Fragment 
250 461.1680275721 CCC=C1C=CC(C)=C2C1=NC(=[NH+]C1=NC3=C(O)N=C(N)N=C3N1C1C=C(O)C(=C=O)O1)N2C
251 349.1519835841 CCC=C1C=CC(C)=C2C1=NC(=[NH+]C1=NC3=NC(N)=NC(=O)C3=N1)N2C
252 478.1945766681 CC1=C2C(=NC(=[NH+]C3=NC4=C(O)N=C(N)N=C4N3C3C=C(O)C(=C=O)O3)N2C)C(CCCN)C=C1 Intermediate Fragment 
253 423.1523775081 CC1=C2C(=NC(=[NH+]C3=NC4=C(O)N=C(N)N=C4N3C3C=C(O)C(=C=O)O3)N2C)CCC1
254 425.1680275721 CC1CCCC2=NC(=[NH+]C3=NC4=C(O)N=C(N)N=C4N3C3C=C(O)C(=C=O)O3)N(C)C21
255 478.1945766681 CCCNC1=CC(C)=C2C(=NC(=[NH+]C3=NC4=C(O)N=C(N)N=C4N3C3C=C(O)C(=C=O)O3)N2C)C1 Intermediate Fragment 
256 452.1789266041 CNC1CC2=NC(=[NH+]C3=NC4=C(O)N=C(N)N=C4N3C3C=C(O)C(=C=O)O3)N(C)C2=C(C)C1
257 448.1476264761 C=NC1=CC(C)=C2C(=NC(=[NH+]C3=NC4=C(O)N=C(N)N=C4N3C3C=C(O)C(=C=O)O3)N2C)C1
258 427.1836776361 CC1CCCC2NC(=[NH+]C3=NC4=C(O)N=C(N)N=C4N3C3C=C(O)C(=C=O)O3)N(C)C12
