#In-silico ESI-MS/MS [M+H]+ Spectra
#PREDICTED BY CFM-ID 4.0.8
#SMILES=n1cnc2c(c1N)NC(N2[C@H]1C[C@H]([C@H](O1)CO)O)O
#InChiKey=KCVIPLXIGFQBCZ-JTEMNFJHSA-N
energy0
154.07234 46.10 33 62 51 35 46 57 48 60 54 41 (25.441 0.74774 0.20294 0.080595 0.033788 0.019697 0.012945 0.0038065 0.0035451 0.002727)
270.11968 100.00 0 120 119 110 230 228 95 205 137 98 81 93 104 88 (55.894 0.97569 0.26025 0.16637 0.087543 0.061134 0.055382 0.047405 0.032378 0.0071565 0.0043527 0.0015952 0.00085224 0.00054683)
energy1
124.06177 19.41 31 (8.1071)
136.06177 81.53 34 132 (34.033 0.0098211)
154.07234 100.00 33 62 60 54 48 46 35 51 41 57 (34.942 3.3389 2.0176 0.51641 0.24294 0.23894 0.18002 0.13735 0.11266 0.030025)
energy2
45.03349 11.41 16 (2.1618)
57.03349 18.26 22 (3.4581)
59.04914 31.99 213 (6.059)
61.02841 11.02 141 (2.0874)
71.04914 6.77 125 (1.2825)
73.02841 6.96 143 18 (1.2223 0.09615)
75.04406 5.63 140 19 (0.9902 0.076906)
109.05087 9.40 58 (1.7803)
111.06652 6.68 63 56 (0.99148 0.27431)
124.06177 20.55 31 (3.893)
134.04612 4.65 29 (0.88098)
136.06177 100.00 34 132 (16.846 2.0959)
137.04579 5.29 55 36 2 59 49 (0.34466 0.3362 0.28666 0.029062 0.0061895)
138.07742 26.63 65 134 (4.9627 0.082169)
140.09307 16.08 70 (3.0451)
142.10872 9.02 73 (1.7088)
154.07234 24.00 33 60 62 35 51 54 41 48 57 46 (1.7568 1.1796 0.74831 0.23693 0.16626 0.15195 0.14495 0.07254 0.050047 0.039429)
164.05669 8.44 136 135 (1.0138 0.58446)
164.09307 6.32 161 (1.198)
165.07709 4.06 175 (0.76935)
166.07234 7.22 130 129 133 (0.82999 0.28707 0.2506)
168.08799 17.71 128 (3.3556)
170.10364 4.69 127 (0.88899)
178.07234 4.31 148 151 150 153 155 (0.24313 0.20912 0.13788 0.11372 0.11252)
180.08799 15.80 157 167 156 159 158 (0.81972 0.81819 0.46506 0.45682 0.43373)
182.06725 13.98 122 (2.6473)
184.08290 17.21 121 (3.2599)
194.10364 6.41 180 181 (0.70816 0.50638)
228.09788 5.00 86 89 (0.68447 0.26295)

0 270.1196804121 [NH3+]c1ncnc2c1NC(O)N2C1CC(O)C(CO)O1
1 253.0931313161 OC1=NC2=CN=CN=C2N1C1CC(O)C(C[OH2+])O1
2 137.0457872001 [OH+]=C1N=C2C=NC=NC2N1
3 139.0614372641 [OH+]=C1N=C2CNC=NC2N1
4 119.0702706321 OC1CCOC1C[OH2+]
5 101.0597059481 CC1OC=CC1[OH2+]
6 119.0702706321 OC=CC(O)CC[OH2+] Intermediate Fragment 
7 119.0702706321 C=CC(O)C(O)C[OH2+] Intermediate Fragment 
8 101.0597059481 C#CC(O)CC[OH2+]
9 117.0546205681 OC1C=COC1C[OH2+]
10 85.0284058201 [OH2+]C1=COC=C1
11 87.0440558841 [OH2+]C1C=COC1
12 89.0597059481 [OH2+]C1CCOC1
13 99.0440558841 CC1=C([OH2+])C=CO1
14 99.0440558841 [OH2+]CC1=CC=CO1
15 117.0546205681 C=C(O)C(=C[OH2+])OC Intermediate Fragment 
16 45.0334912001 C=C[OH2+]
17 117.0546205681 C=COC(=CO)C[OH2+] Intermediate Fragment 
18 73.0284058201 OC#CC[OH2+]
19 75.0440558841 OC=CC[OH2+]
20 91.0389705041 OC=C([OH2+])CO
21 117.0546205681 OC=C=COCC[OH2+] Intermediate Fragment 
22 57.0334912001 C#CC[OH2+]
23 117.0546205681 OC=C=C(O)CC[OH2+] Intermediate Fragment 
24 99.0440558841 C#CC(O)=CC[OH2+]
25 117.0546205681 C=C=C(O)C(O)C[OH2+] Intermediate Fragment 
26 115.0389705041 OC1=C(C[OH2+])OC=C1
27 111.0076703761 [O+]#CC1=C(O)C=CO1
28 152.0566862321 [NH3+]C1=C2N=C(O)NC2=NC=N1
29 134.0461215481 [NH2+]=C1N=CN=C2N=CN=C12
30 152.0566862321 NC1=NC=NC([NH3+])=C1N=C=O Intermediate Fragment 
31 124.0617716121 N=C1C(=[NH2+])N=CN=C1N
32 152.0566862321 NC1=C([NH3+])N=CN=C1N=C=O Intermediate Fragment 
33 154.0723362961 [NH3+]C1=C2NC(O)NC2=NC=N1
34 136.0617716121 [NH3+]C1=C2N=CNC2=NC=N1
35 154.0723362961 N=C=NC1=C(C=[NH2+])NC(O)N1 Intermediate Fragment 
36 137.0457872001 C=[NH+]C1=C(C#N)N=C(O)N1
37 127.0614372641 N#CC1NC(O)NC1=[NH2+]
38 112.0505382321 [NH+]#CC1=NC(O)NC1
39 110.0348881681 [NH+]#CC1=NC(=O)NC1
40 125.0457872001 [NH+]#CN=C1C=NC(O)N1
41 154.0723362961 [NH2+]=CN=C=NC1=CNC(O)N1 Intermediate Fragment 
42 112.0505382321 C=[NH+]C1C=NC(=O)N1
43 110.0348881681 C=[NH+]C1=NC(=O)N=C1
44 72.0556236121 N=C=[NH+]CN
45 127.0614372641 [NH+]#CN=C1CNC(O)N1
46 154.0723362961 N=C=NC(=[NH2+])C1=CNC(O)N1 Intermediate Fragment 
47 127.0614372641 N=C([NH3+])C1=NC(=O)NC1
48 154.0723362961 C=NC([NH3+])=C1N=C(O)NC1=N Intermediate Fragment 
49 137.0457872001 C#[N+]C(=N)C1=CNC(O)=N1
50 125.0457872001 N#CC1=NC(O)NC1=[NH2+]
51 154.0723362961 C=NC1=C(C(N)=[NH2+])N=C(O)N1 Intermediate Fragment 
52 125.0457872001 N=C([NH3+])C1=NC(=O)N=C1
53 152.0566862321 C#[N+]C1=C(C(=N)N)N=C(O)N1
54 154.0723362961 N=C(O)NC1=NC=NC([NH3+])=C1 Intermediate Fragment 
55 137.0457872001 [NH3+]C1=CC(N=C=O)=NC=N1
56 111.0665226441 NC1=NC=NC([NH3+])=C1
57 154.0723362961 NC(O)=NC1=C([NH3+])N=CN=C1 Intermediate Fragment 
58 109.0508725801 N=C1C=NC=NC1=[NH2+]
59 137.0457872001 [NH3+]C1=C(N=C=O)C=NC=N1
60 154.0723362961 NC1=NC=NC([NH3+])=C1N=CO Intermediate Fragment 
61 126.0774216761 NC1=NC=NC(=[NH2+])C1N
62 154.0723362961 NC1=C([NH3+])N=CN=C1N=CO Intermediate Fragment 
63 111.0665226441 NC1C=NC=NC1=[NH2+]
64 156.0879863601 [NH3+]C1N=CN=C2NC(O)NC21
65 138.0774216761 [NH3+]C1=C2NCNC2=NC=N1
66 156.0879863601 NC(O)NC1=NC=NC([NH3+])=C1 Intermediate Fragment 
67 156.0879863601 NC1=NC=NC([NH3+])=C1NCO Intermediate Fragment 
68 156.0879863601 NC1=C([NH3+])N=CN=C1NCO Intermediate Fragment 
69 158.1036364241 [NH3+]C1N=CNC2NC(O)NC12
70 140.0930717401 [NH3+]C1N=CN=C2NCNC21
71 158.1036364241 NC1C(NCO)=NC=NC1[NH3+] Intermediate Fragment 
72 160.1192864881 [NH3+]C1NCNC2NC(O)NC12
73 142.1087218041 [NH3+]C1N=CNC2NCNC12
74 238.0934656641 [NH3+]C1=C2N=C(O)N(C3CC(O)CO3)C2=NC=N1
75 240.1091157281 [NH3+]C1=C2NC(O)N(C3CC(O)CO3)C2=NC=N1
76 242.1247657921 [NH3+]C1N=CN=C2C1NC(O)N2C1CC(O)CO1
77 252.1091157281 CC1OC(N2C(O)=NC3=C([NH3+])N=CN=C32)CC1O
78 252.1091157281 [NH3+]C1=C2N=C(O)N(C3CCC(CO)O3)C2=NC=N1
79 252.1091157281 [NH3+]C1=C2N=C(O)N(C(O)=CCCCO)C2=NC=N1 Intermediate Fragment 
80 252.1091157281 [NH3+]C1=C2N=CN(C3CC(O)C(CO)O3)C2=NC=N1
81 270.1196804121 N=C=NC1=C(C=[NH2+])NC(O)N1C1CC(O)C(CO)O1 Intermediate Fragment 
82 253.0931313161 C=[NH+]C1=C(C#N)N=C(O)N1C1CC(O)C(CO)O1
83 139.0614372641 C=[NH+]C1=C(C#N)NC(O)N1
84 141.0770873281 C=[NH+]C1=C(C=N)NC(O)N1
85 243.1087813801 N=C=C1NC(O)N(C2CC(O)C(CO)O2)C1=[NH2+]
86 228.0978823481 [NH+]#CC1=CN(C2CC(O)C(CO)O2)C(O)N1
87 226.0822322841 [NH+]#CC1=CN(C2CC(O)C(CO)O2)C(O)=N1
88 270.1196804121 [NH2+]=CN=C=NC1=CNC(O)N1C1CC(O)C(CO)O1 Intermediate Fragment 
89 228.0978823481 C=[NH+]C1=CN=C(O)N1C1CC(O)C(CO)O1
90 226.0822322841 C=[NH+]C1=CN=C(O)N1C1=CC(O)C(CO)O1
91 216.0978823481 [NH2+]=C1C=NC(O)N1C1CC(O)C(CO)O1
92 243.1087813801 [NH+]#CN=C1CNC(O)N1C1CC(O)C(CO)O1
93 270.1196804121 N=C=NC(=[NH2+])C1=CN(C2CC(O)C(CO)O2)C(O)N1 Intermediate Fragment 
94 243.1087813801 N=C([NH3+])C1=CN(C2CC(O)C(CO)O2)C(O)=N1
95 270.1196804121 C=NC([NH3+])=C1N=C(O)N(C2CC(O)C(CO)O2)C1=N Intermediate Fragment 
96 239.0774812521 N=C=C1N=C(O)N(C2=CC(O)C(CO)O2)C1=[NH2+]
97 241.0931313161 N=C=C1N=C(O)N(C2CC(O)C(CO)O2)C1=[NH2+]
98 270.1196804121 N=C(O)N(C1=NC=NC([NH3+])=C1)C1CC(O)C(CO)O1 Intermediate Fragment 
99 253.0931313161 [NH3+]C1=CC(N(CO)C2=CC(O)=C(CO)O2)=NC=N1
100 227.1138667601 [NH3+]C1=CC(NC2CC(O)C(CO)O2)=NC=N1
101 225.0982166961 [NH3+]C1=CC(N=C2CC(O)C(CO)O2)=NC=N1
102 225.0982166961 [NH3+]C1=CC(N=C=CC(O)C(O)CO)=NC=N1 Intermediate Fragment 
103 225.0982166961 [NH3+]C1=CC(N=C(O)C=C(O)CCO)=NC=N1 Intermediate Fragment 
104 270.1196804121 [NH3+]C1=C(N=C(O)NC2CC(O)C(CO)O2)C=NC=N1 Intermediate Fragment 
105 162.0760842841 OC=[NH+]C1CC(O)C(CO)O1
106 132.0655196001 [NH2+]=C1CC(O)C(CO)O1
107 139.0614372641 [NH3+]C1=C(N=CO)C=NC=N1
108 139.0614372641 N=C=NC=C(C#[NH+])NCO Intermediate Fragment 
109 141.0770873281 [NH3+]C1=C(NCO)C=NC=N1
110 270.1196804121 [NH3+]C1=C(N=CO)C(NC2CC(O)C(CO)O2)=NC=N1 Intermediate Fragment 
111 223.0825666321 [NH3+]C1=CC(N=C2C=C(O)C(CO)O2)=NC=N1
112 238.0934656641 NC1=C([NH3+])N=CN=C1N=C1C=C(O)C(CO)O1
113 240.1091157281 NC1=C([NH3+])N=CN=C1N=C1CC(O)C(CO)O1
114 222.0985510441 CC1OC(=NC2=NC=NC([NH3+])=C2N)C=C1O
115 240.1091157281 NC1=C([NH3+])N=CN=C1N=C=CC(O)C(O)CO Intermediate Fragment 
116 240.1091157281 NC1=C([NH3+])N=CN=C1N=C(O)C=C(O)CCO Intermediate Fragment 
117 240.1091157281 NC1=C([NH3+])N=CN=C1N=C(C=CO)OCCO Intermediate Fragment 
118 242.1247657921 NC1=C([NH3+])N=CN=C1NC1CC(O)C(CO)O1
119 270.1196804121 NC1=C([NH3+])N=CN=C1N(CO)C1=CC(O)C(CO)O1 Intermediate Fragment 
120 270.1196804121 CC(O)C(CO)OCN1C(O)=NC2=C([NH3+])N=CN=C21 Intermediate Fragment 
121 184.0829009801 [NH3+]C1=C2NC(O)N(CO)C2=NC=N1
122 182.0672509161 [NH3+]C1=C2N=C(O)N(CO)C2=NC=N1
123 87.0440558841 C=C(O)C=C[OH2+]
124 89.0597059481 C=C(O)CC[OH2+]
125 71.0491412641 C=CC(=C)[OH2+]
126 172.1192864881 CN1C(O)NC2C([NH3+])N=CNC21
127 170.1036364241 CN1C2=NC=NC([NH3+])C2NC1O
128 168.0879863601 CN1C2=NC=NC([NH3+])=C2NC1O
129 166.0723362961 CN1C(O)=NC2=C([NH3+])N=CN=C21
130 166.0723362961 C=NC1=NC=NC([NH3+])=C1N=CO Intermediate Fragment 
131 123.0665226441 C=NC1=NC=NC([NH3+])=C1
132 136.0617716121 C=NC1=NC=NC(=[NH2+])C1=N
133 166.0723362961 CN(C#[O+])C1=NC=NC(N)=C1N Intermediate Fragment 
134 138.0774216761 CNC1=NC=NC(=[NH2+])C1=N
135 164.0566862321 [CH2+]N1C(O)=NC2=C(N)N=CN=C21
136 164.0566862321 C=NC1=NC=NC([NH3+])=C1N=C=O Intermediate Fragment 
137 270.1196804121 [NH3+]C1=C2N=C(O)N(CCC(O)C(O)CO)C2=NC=N1 Intermediate Fragment 
138 105.0546205681 C=C(O)C([OH2+])CO
139 93.0546205681 OCC([OH2+])CO
140 75.0440558841 CC([OH2+])=CO
141 61.0284058201 OCC=[OH+]
142 59.0127557561 OC#C[OH2+]
143 73.0284058201 CC([OH2+])=C=O
144 89.0233204401 O=CC([OH2+])=CO
145 71.0127557561 OC#CC=[OH+]
146 71.0127557561 [CH2+]C(O)=C=O
147 87.0076703761 O=C=C([OH2+])C=O
148 178.0723362961 C=CN1C(O)=NC2=C([NH3+])N=CN=C21
149 160.0617716121 C#CN1C=NC2=C([NH3+])N=CN=C21
150 178.0723362961 CCN1C(O)=NC(C#[NH+])=C1N=C=N Intermediate Fragment 
151 178.0723362961 C#CN(C(=N)O)C1=NC=NC([NH3+])=C1 Intermediate Fragment 
152 135.0665226441 C=C=NC1=NC=NC([NH3+])=C1
153 178.0723362961 C=C=NC1=NC=NC([NH3+])=C1N=CO Intermediate Fragment 
154 150.0774216761 CC=NC1=NC=NC(=[NH2+])C1=N
155 178.0723362961 C#CN(C=O)C1=NC=NC([NH3+])=C1N Intermediate Fragment 
156 180.0879863601 CCN1C(O)=NC2=C([NH3+])N=CN=C21
157 180.0879863601 CC=NC(O)=NC1=C([NH3+])N=CN=C1 Intermediate Fragment 
158 180.0879863601 CC=NC1=NC=NC([NH3+])=C1N=CO Intermediate Fragment 
159 180.0879863601 C#CN(CO)C1=NC=NC([NH3+])=C1N Intermediate Fragment 
160 182.1036364241 CCN1C2=NC=NC([NH3+])=C2NC1O
161 164.0930717401 CCN1C=NC2=C([NH3+])N=CN=C21
162 184.1192864881 CCN1C2=NC=NC([NH3+])C2NC1O
163 186.1349365521 CCN1C(O)NC2C([NH3+])N=CNC21
164 63.0440558841 OCC[OH2+]
165 208.0829009801 [NH3+]C1=C2N=C(O)N(C=CCO)C2=NC=N1
166 208.0829009801 [NH3+]C1=C(N=CO)C(N=C=CCO)=NC=N1 Intermediate Fragment 
167 180.0879863601 NC1=C([NH3+])N=CN=C1N=C=CCO
168 210.0985510441 [NH3+]C1=C2N=C(O)N(CCCO)C2=NC=N1
169 192.0879863601 CC=CN1C(O)=NC2=C([NH3+])N=CN=C21
170 192.0879863601 [NH3+]C1=C2N=CN(C=CCO)C2=NC=N1
171 210.0985510441 N=C=NC1=C(C#[NH+])NC(O)N1CCCO Intermediate Fragment 
172 210.0985510441 N=C(O)N(C=CCO)C1=NC=NC([NH3+])=C1 Intermediate Fragment 
173 210.0985510441 [NH3+]C1=C(N=C(O)N=CCCO)C=NC=N1 Intermediate Fragment 
174 210.0985510441 [NH3+]C1=C(N=CO)C(N=CCCO)=NC=N1 Intermediate Fragment 
175 165.0770873281 [NH3+]C1=CC(N=C=CCO)=NC=N1
176 182.1036364241 NC1=C([NH3+])N=CN=C1N=CCCO
177 72.0443902321 [NH+]#CCCO
178 210.0985510441 NC1=C([NH3+])N=CN=C1N(C#CCO)CO Intermediate Fragment 
179 212.1142011081 [NH3+]C1=C2NC(O)N(CCCO)C2=NC=N1
180 194.1036364241 CCCN1C(O)=NC2=C([NH3+])N=CN=C21
181 194.1036364241 [NH3+]C1=C2N=CN(CCCO)C2=NC=N1
182 212.1142011081 [NH3+]C1=C(N=CO)C(NCCCO)=NC=N1 Intermediate Fragment 
183 212.1142011081 NC1=C([NH3+])N=CN=C1N(C=CCO)CO Intermediate Fragment 
184 214.1298511721 [NH3+]C1N=CN=C2C1NC(O)N2CCCO
185 252.1091157281 [NH3+]C1=C2N=C(O)N(C=CC(O)CCO)C2=NC=N1
186 103.0753560121 C=CC(O)CC[OH2+]
187 162.0410361681 [CH2+]N1C(=O)N=C2C(=N)N=CN=C21
188 77.0597059481 OCCC[OH2+]
189 176.0566862321 C#CN1C(O)=NC2=C([NH3+])N=CN=C21
190 206.0672509161 [NH3+]C1=C2N=C(O)N(C#CCO)C2=NC=N1
191 222.0985510441 CC(O)C=CN1C(O)=NC2=C([NH3+])N=CN=C21
192 224.1142011081 CC(O)CCN1C(O)=NC2=C([NH3+])N=CN=C21
193 234.0985510441 CCC(O)C#CN1C(O)=NC2=C([NH3+])N=CN=C21
194 234.0985510441 [NH3+]C1=C2N=C(O)N(C#CCCCO)C2=NC=N1
195 252.1091157281 N=C=NC1=C(C#[NH+])N=C(O)N1CCC(O)CCO Intermediate Fragment 
196 252.1091157281 C=NC([NH3+])=C1N=C(O)N(C#CC(O)CCO)C1=N Intermediate Fragment 
197 252.1091157281 N=C(O)N(C#CC(O)CCO)C1=NC=NC([NH3+])=C1 Intermediate Fragment 
198 209.1033020761 [NH3+]C1=CC(N=C=CC(O)CCO)=NC=N1
199 252.1091157281 [NH3+]C1=C(N=CO)C(N=C=CC(O)CCO)=NC=N1 Intermediate Fragment 
200 207.0876520121 [NH3+]C1=CC(N=C=C=C(O)CCO)=NC=N1
201 224.1142011081 NC1=C([NH3+])N=CN=C1N=C=CC(O)CCO
202 116.0706049801 [NH+]#CCC(O)CCO
203 252.1091157281 NC1=C([NH3+])N=CN=C1N(C#CC(O)=CCO)CO Intermediate Fragment 
204 268.1040303481 [NH3+]C1=C2N=C(O)N(C=CC(O)C(O)CO)C2=NC=N1
205 270.1196804121 [NH3+]C1=C2N=C(O)N(C(O)CC(O)CCO)C2=NC=N1 Intermediate Fragment 
206 91.0753560121 CC(O)CC[OH2+]
207 73.0647913281 C=C([OH2+])CC
208 180.0516008521 [NH3+]C1=C2N=C(O)N(C=O)C2=NC=N1
209 180.0516008521 N=C(O)N(C#[O+])C1=NC=NC(N)=C1 Intermediate Fragment 
210 180.0516008521 [NH3+]C1=C(N=C=O)C(N=CO)=NC=N1 Intermediate Fragment 
211 180.0516008521 NC1=C(N)C(N(C#[O+])C=O)=NC=N1 Intermediate Fragment 
212 186.0985510441 [NH3+]C1N=CN=C2C1NC(O)N2CO
213 59.0491412641 CC=C[OH2+]
214 43.0178411361 C#C[OH2+]
215 55.0178411361 [CH2+]C#CO
216 194.0672509161 C=C(O)N1C(O)=NC2=C([NH3+])N=CN=C21
217 196.0829009801 CC(O)N1C(O)=NC2=C([NH3+])N=CN=C21
218 196.0829009801 C=C(O)N(C(=N)O)C1=NC=NC([NH3+])=C1 Intermediate Fragment 
219 196.0829009801 CC(O)=NC1=NC=NC([NH3+])=C1N=CO Intermediate Fragment 
220 198.0985510441 CC(O)N1C2=NC=NC([NH3+])=C2NC1O
221 200.1142011081 CC(O)N1C2=NC=NC([NH3+])C2NC1O
222 202.1298511721 CC(O)N1C(O)NC2C([NH3+])N=CNC21
223 47.0491412641 CC[OH2+]
224 224.0778156001 [NH3+]C1=C2N=C(O)N(C(O)=CCO)C2=NC=N1
225 226.0934656641 [NH3+]C1=C2N=C(O)N(C(O)CCO)C2=NC=N1
226 228.1091157281 [NH3+]C1=C2NC(O)N(C(O)CCO)C2=NC=N1
227 268.1040303481 [NH3+]C1=C2N=C(O)N(C(O)=CC(O)CCO)C2=NC=N1
228 270.1196804121 [NH3+]C1=C2N=C(O)N(C(CCO)OCCO)C2=NC=N1 Intermediate Fragment 
229 224.0778156001 [NH3+]C1=C2N=C(O)N(COC=CO)C2=NC=N1
230 270.1196804121 CC(OC(CO)CO)N1C(O)=NC2=C([NH3+])N=CN=C21 Intermediate Fragment 
