#In-silico ESI-MS/MS [M+H]+ Spectra
#PREDICTED BY CFM-ID 4.0.8
#SMILES=[C@H]1(C[C@@H](O[C@@H]1CO)n1cc(c(nc1=O)OCc1ccccc1)C)O
#InChiKey=VMZXEPLVHBSZHE-RBSFLKMASA-N
energy0
91.05423 66.93 10 123 122 121 (20.355 3.3057 2.6198 0.25935)
93.06988 6.45 9 (2.5571)
125.03455 7.73 17 (3.0638)
189.10224 9.78 42 (3.8798)
217.09715 100.00 4 33 44 66 57 54 64 67 (34.408 2.6403 1.163 0.78107 0.42342 0.18814 0.029971 0.020558)
333.14450 14.70 0 182 149 201 214 212 147 218 137 207 220 222 204 219 202 (5.652 0.058382 0.04103 0.040661 0.0078381 0.0065028 0.0051836 0.00351 0.003133 0.0028506 0.002505 0.0015293 0.001377 0.0010346 0.00074737)
energy1
45.03349 2.67 82 (1.3873)
91.05423 100.00 10 123 122 121 (45.169 3.724 2.0556 0.91474)
93.06988 3.69 9 (1.9123)
99.04406 6.59 6 87 77 (1.433 1.3047 0.67999)
125.03455 4.99 17 (2.5891)
139.05020 4.72 19 (2.4488)
174.09134 3.88 45 39 (1.4158 0.59561)
189.10224 11.50 42 (5.9627)
217.09715 16.64 4 44 33 66 64 57 54 67 (6.6237 1.3662 0.39477 0.088409 0.065462 0.037577 0.032836 0.018915)
energy2
43.01784 2.93 94 (0.91579)
45.03349 5.05 82 (1.5758)
65.03858 16.86 124 (5.2639)
67.05423 4.31 115 (1.3444)
71.04914 4.47 191 192 (0.89263 0.50249)
75.04406 5.83 80 156 (1.6322 0.18943)
81.06988 10.24 117 113 (2.6603 0.53576)
91.05423 100.00 10 123 121 122 (18.615 7.0279 3.0415 2.5351)
93.06988 18.86 9 (5.8886)
97.10118 3.34 114 15 118 119 (0.3313 0.32594 0.25278 0.13294)
109.03964 5.03 13 (1.5704)
111.05529 5.20 14 (1.6249)
125.03455 12.14 17 (3.7895)
127.05020 6.69 18 (2.09)
139.05020 5.76 19 (1.7972)
153.06585 19.54 142 (6.1017)
174.09134 2.96 45 39 (0.6735 0.251)
189.10224 4.95 42 (1.5438)
217.09715 16.72 4 33 57 66 64 44 54 67 (2.0948 1.2264 0.73159 0.43967 0.278 0.27675 0.13316 0.039728)
243.11280 3.17 140 139 (0.66056 0.32996)
249.15975 3.96 144 (1.236)

0 333.1444981921 Cc1cn(C2CC(O)C(C[OH2+])O2)c(=O)nc1OCc1ccccc1
1 301.1182834441 CC1=CN(C2C=C(O)CO2)C(=[OH+])N=C1OC=C1C=CC=CC1
2 315.1339335081 C=C1OC(N2C=C(C)C(OC=C3C=CCCC3)=NC2=[OH+])C=C1O
3 219.1128041401 CC1C=NC(=[OH+])N=C1OC=C1C=CCCC1
4 217.0971540761 CC1C=NC(=[OH+])N=C1OC=C1C=CC=CC1
5 215.0815040121 C=C1C=NC(=[OH+])N=C1OC=C1C=CC=CC1
6 99.0440558841 C=C1OC=CC1[OH2+]
7 209.0920686961 C=C1OC(N2C=C(C)C=NC2[OH2+])=CC1O
8 211.1077187601 C=C1OC(N2C=C(C)CNC2[OH2+])=CC1O
9 93.0698767081 [CH3+]=C1C=CC=CC1
10 91.0542266441 [CH+]=C1C=CC=CC1
11 297.1233688241 C=C1C=CC(N2C=C(C)C(OC=C3C=CC=CC3)=NC2=[OH+])O1
12 223.1441042681 CC1=C(OCC2CCCCC2)N=C([OH2+])N=C1
13 109.0396392001 [CH2+]C1=CN=C(O)N=C1
14 111.0552892641 CC1=CN=C([OH2+])N=C1
15 97.1011768361 [CH3+]=C1CCCCC1
16 95.0855267721 [CH3+]=C1C=CCCC1
17 125.0345538201 [CH2+]C1=C(O)N=C(O)N=C1
18 127.0502038841 CC1=C(O)N=C([OH2+])N=C1
19 139.0502038841 C=[O+]C1=C(C)C=NC(O)=N1
20 141.0658539481 COC1=C(C)C=NC([OH2+])=N1
21 223.1441042681 CC(=C=N)C(=NC=[OH+])OCC1CCCCC1 Intermediate Fragment 
22 196.1332052361 CC=C([NH+]=C=O)OCC1CCCCC1
23 221.1284542041 CC1=C(OC=C2CCCCC2)N=C([OH2+])N=C1
24 219.1128041401 CC(=C=N)C(=NC=[OH+])OC=C1C=CCCC1 Intermediate Fragment 
25 202.0862550441 C=C(C)C(=[N+]=C=O)OC=C1C=CC=CC1
26 199.0865893921 CC1=C([O+]=C=C2C=CC=CC2)N=CN=C1
27 109.0647913281 [OH+]=CC1C=CC=CC1
28 107.0239891361 [CH+]=C1C=NC(=O)N=C1
29 113.0709393281 CC1C=NC([OH2+])N=C1
30 123.0189037561 [CH+]=C1C=NC(=O)N=C1O
31 137.0345538201 C=[O+]C1=NC(=O)N=CC1=C
32 201.0658539481 OC1=NC([O+]=C=C2C=CC=CC2)=CC=N1
33 217.0971540761 CC(=C=N)C(=NC=[OH+])OC=C1C=CC=CC1 Intermediate Fragment 
34 190.0862550441 CC=C([NH+]=C=O)OC=C1C=CC=CC1
35 188.0706049801 C=C=C([NH+]=C=O)OC=C1C=CC=CC1
36 164.0706049801 O=C[NH+]=COC=C1C=CC=CC1
37 56.0494756121 CCC#[NH+]
38 172.0756903601 CC(C#N)=C[O+]=C=C1C=CC=CC1
39 174.0913404241 CC(C#[NH+])=COC=C1C=CC=CC1
40 185.0709393281 C=C(C#N)C(=N)[O+]=C=C1C=CC=CC1
41 187.0865893921 C=C(C#[NH+])C(=N)OC=C1C=CC=CC1
42 189.1022394561 CC(C#[NH+])C(=N)OC=C1C=CC=CC1
43 215.0815040121 CC(C#[NH+])=C(N=C=O)OC=C1C=CC=CC1
44 217.0971540761 CC(=C=NC=[OH+])C(=N)OC=C1C=CC=CC1 Intermediate Fragment 
45 174.0913404241 C=C(C)C(=N)[O+]=C=C1C=CC=CC1
46 162.0913404241 C=CC(=[NH2+])OC=C1C=CC=CC1
47 160.0756903601 C#CC(=[NH2+])OC=C1C=CC=CC1
48 158.0600402961 C#CC(=N)[O+]=C=C1C=CC=CC1
49 136.0756903601 [NH+]#COC=C1C=CCCC1
50 134.0600402961 [NH+]#COC=C1C=CC=CC1
51 132.0443902321 N#C[O+]=C=C1C=CC=CC1
52 84.0443902321 CC=C=[NH+]C=O
53 215.0815040121 CC(=C=NC=O)C(=N)[O+]=C=C1C=CC=CC1
54 217.0971540761 CC(=C=NC(=N)O)C[O+]=C=C1C=CC=CC1 Intermediate Fragment 
55 147.0804413921 CC#C[OH+]C=C1C=CC=CC1
56 145.0647913281 CC#C[O+]=C=C1C=CC=CC1
57 217.0971540761 CC=C=NC(=[OH+])N=COC=C1C=CC=CC1 Intermediate Fragment 
58 177.0658539481 NC(=O)N=C[O+]=C=C1C=CC=CC1
59 97.0396392001 C=C=C=[NH+]C(=N)O
60 121.0647913281 C[O+]=C=C1C=CC=CC1
61 138.0913404241 [NH+]#COC=C1CCCCC1
62 162.0549549161 O=C=[N+]=COC=C1C=CC=CC1
63 166.0862550441 O=C[NH+]=COC=C1C=CCCC1
64 217.0971540761 C=C=C(N=C([OH2+])N=C)OC=C1C=CC=CC1 Intermediate Fragment 
65 191.0815040121 C=[NH+]C(=O)N=COC=C1C=CC=CC1
66 217.0971540761 C=C(C)C(=NC(N)=O)[O+]=C=C1C=CC=CC1 Intermediate Fragment 
67 217.0971540761 C=C=CCCC#COC1=C(C)C=NC([OH2+])=N1 Intermediate Fragment 
68 111.0076703761 O=C1C=COC1=C=[OH+]
69 113.0233204401 OC1C=COC1=C=[OH+]
70 115.0389705041 OC1C=COC1=C[OH2+]
71 87.0440558841 [OH2+]C1C=COC1
72 115.0389705041 C=C=C(O)C(=O)C[OH2+] Intermediate Fragment 
73 115.0389705041 O=C=C=C(O)CC[OH2+] Intermediate Fragment 
74 117.0546205681 OC1C=COC1C[OH2+]
75 85.0284058201 [OH+]=C1C=COC1
76 89.0597059481 [OH2+]C1CCOC1
77 99.0440558841 [OH2+]C=C1C=CCO1
78 117.0546205681 C=COC(=C[OH2+])CO Intermediate Fragment 
79 91.0389705041 OCC(=[OH+])CO
80 75.0440558841 OCC=C[OH2+]
81 73.0284058201 OCC#C[OH2+]
82 45.0334912001 C=C[OH2+]
83 89.0597059481 C=C[OH+]CCO
84 117.0546205681 C=C(O)C(=C[OH2+])OC Intermediate Fragment 
85 117.0546205681 C=C=C(O)C(O)C[OH2+] Intermediate Fragment 
86 29.0385765801 C=[CH3+]
87 99.0440558841 C=C=C(O)C=C[OH2+]
88 59.0491412641 CC=C[OH2+]
89 57.0334912001 CC#C[OH2+]
90 59.0127557561 OC=C=[OH+]
91 61.0284058201 OCC=[OH+]
92 117.0546205681 OC=C=C(O)CC[OH2+] Intermediate Fragment 
93 47.0491412641 CC[OH2+]
94 43.0178411361 C#C[OH2+]
95 87.0440558841 C=C(O)C=C[OH2+]
96 89.0597059481 C=C(O)CC[OH2+]
97 71.0127557561 OC#CC=[OH+]
98 117.0546205681 OC=C=COCC[OH2+] Intermediate Fragment 
99 119.0702706321 OC1CCOC1C[OH2+]
100 101.0597059481 CC1OCC=C1[OH2+]
101 101.0597059481 [OH2+]CC1C=CCO1
102 119.0702706321 OCC=C(O)CC[OH2+] Intermediate Fragment 
103 101.0597059481 C=C=C(O)CC[OH2+]
104 111.0804413921 [OH+]=CC1C=CCCC1
105 219.0400331241 [CH2+]C1=CN(C2C=C(O)C(=C=O)O2)C(=O)N=C1
106 221.0556831881 CC1=CN(C2C=C(O)C(=C=[OH+])O2)C(=O)N=C1
107 223.0713332521 CC1=CN(C2C=C(O)C(=C=[OH+])O2)C(O)N=C1
108 225.0869833161 CC1=CN(C2C=C(O)C(=C=[OH+])O2)C(O)NC1
109 225.0869833161 CC1=CN(C=C=C(O)C(=O)C=[OH+])C(O)NC1 Intermediate Fragment 
110 227.1026333801 CC1CNC(O)N(C2C=C(O)C(=C=[OH+])O2)C1
111 227.1026333801 CC1CNC(O)N(C(O)=C=C(O)C#C[OH2+])C1 Intermediate Fragment 
112 229.1182834441 CC1CNC(O)N(C2C=C(O)C(=C[OH2+])O2)C1
113 81.0698767081 C1=CCC[CH2+]=C1
114 97.1011768361 [CH2+]#CCCCCC Intermediate Fragment 
115 67.0542266441 [CH2+]#CC=CC
116 55.0542266441 [CH2+]#CCC
117 81.0698767081 [CH2+]#CC=CCC
118 97.1011768361 CCC=CC(C)=[CH3+] Intermediate Fragment 
119 97.1011768361 CC=CC(=[CH3+])CC Intermediate Fragment 
120 95.0855267721 C=C=CCC(C)=[CH3+] Intermediate Fragment 
121 91.0542266441 [CH+]=C(C=C)C=C=C Intermediate Fragment 
122 91.0542266441 [CH+]=C(C)C=C=C=C Intermediate Fragment 
123 91.0542266441 C=C=C=CCC#[CH2+] Intermediate Fragment 
124 65.0385765801 C#CCC#[CH2+]
125 235.0349477441 [CH2+]C1=CN(C2C=C(O)C(=C=O)O2)C(=O)N=C1O
126 237.0505978081 CC1=CN(C2C=C(O)C(=C=[OH+])O2)C(=O)N=C1O
127 239.0662478721 CC1=CN(C2C=C(O)C(=C=[OH+])O2)C(O)N=C1O
128 211.0713332521 CC1=CN(C2=CC(O)CO2)C(=[OH+])N=C1O
129 241.0818979361 CC1=CN(C2C=C(O)C(=C=[OH+])O2)C(O)NC1O
130 241.0818979361 CC1=CN(C=C=C(O)C(=O)C=[OH+])C(O)NC1O Intermediate Fragment 
131 79.0542266441 C1=CC=[CH2+]C=C1
132 249.0505978081 C=[O+]C1=NC(=O)N(C2C=C(O)C(=C=O)O2)C=C1C
133 251.0662478721 COC1=NC(=O)N(C2C=C(O)C(=C=[OH+])O2)C=C1C
134 253.0818979361 COC1=NC(O)N(C2C=C(O)C(=C=[OH+])O2)C=C1C
135 255.0975480001 COC1NC(O)N(C2C=C(O)C(=C=[OH+])O2)C=C1C
136 315.1339335081 CC1=CN(C2C=CC(=C=[OH+])O2)C(=O)N=C1OC=C1CCCCC1
137 333.1444981921 C=C(OC(=C=[OH+])CO)N1C=C(C)C(OC=C2CCCCC2)=NC1=O Intermediate Fragment 
138 241.0971540761 C#CN1C=C(C)C(OC=C2C=CC=CC2)=NC1=[OH+]
139 243.1128041401 C#CN1C=C(C)C(OC=C2C=CCCC2)=NC1=[OH+]
140 243.1128041401 C#CN(C=CC)C(=[OH+])N=COC=C1C=CC=CC1 Intermediate Fragment 
141 245.1284542041 C#CN1C=C(C)C(OC=C2CCCCC2)=NC1=[OH+]
142 153.0658539481 C#CN1C=C(C)C(O)=NC1[OH2+]
143 247.1441042681 C#CN1C=C(C)C(OCC2CCCCC2)=NC1=[OH+]
144 249.1597543321 C#CN1C=C(C)C(OCC2CCCCC2)=NC1[OH2+]
145 259.1077187601 C=C([OH2+])N1C=C(C)C(OC=C2C=CC=CC2)=NC1=O
146 261.1233688241 C=C([OH2+])N1C=C(C)C(OC=C2C=CCCC2)=NC1=O
147 333.1444981921 C=C(O)C(=C=[OH+])OCN1C=C(C)C(OC=C2CCCCC2)=NC1=O Intermediate Fragment 
148 247.1077187601 CC1=CN(C=[OH+])C(=O)N=C1OC=C1C=CCCC1
149 333.1444981921 CC1=CN(C=C=C(O)C(=O)C=[OH+])C(=O)N=C1OCC1CCCCC1 Intermediate Fragment 
150 87.0076703761 O=CC(=[OH+])C=O
151 68.9971056921 [O+]#CC#CO
152 89.0233204401 O=CC(=[OH+])CO
153 71.0127557561 CC(=O)C#[O+]
154 73.0284058201 CC(=[OH+])C=O
155 93.0546205681 OCC([OH2+])CO
156 75.0440558841 CC(=[OH+])CO
157 235.1441042681 CC1=CN(C)C(=[OH+])N=C1OC=C1CCCCC1
158 233.1284542041 CC1=CN(C)C(=[OH+])N=C1OC=C1C=CCCC1
159 231.1128041401 CC1=CN(C)C(=[OH+])N=C1OC=C1C=CC=CC1
160 229.0971540761 CC1=CN(C)C(=O)N=C1[O+]=C=C1C=CC=CC1
161 229.0971540761 C=NC=C(C)C(=NC=O)[O+]=C=C1C=CC=CC1 Intermediate Fragment 
162 229.0971540761 C=C=CN(C)C(=O)N=C[O+]=C=C1C=CC=CC1 Intermediate Fragment 
163 229.0971540761 C=NC(=O)N=C([O+]=C=C1C=CC=CC1)C(=C)C Intermediate Fragment 
164 105.0546205681 C=C(O)C([OH2+])CO
165 315.1339335081 CC1=CN(C=C=C(O)C#C[OH2+])C(=O)N=C1OC=C1CCCCC1
166 77.0597059481 OCCC[OH2+]
167 297.1233688241 C#CC(O)=C=CN1C=C(C)C(OC=C2C=CCCC2)=NC1=[OH+]
168 297.1233688241 CC1=CN(CC#CC#C[OH2+])C(=O)N=C1OC=C1C=CCCC1
169 273.1233688241 CC1=CN(CC#CO)C(=[OH+])N=C1OC=C1C=CCCC1
170 271.1077187601 CC1=CN(CC#CO)C(=[OH+])N=C1OC=C1C=CC=CC1
171 269.0920686961 CC1=CN(CC#CO)C(=O)N=C1[O+]=C=C1C=CC=CC1
172 277.1546689521 CC1=CN(CC#CO)C(=[OH+])N=C1OCC1CCCCC1
173 275.1390188881 CC1=CN(CC#CO)C(=[OH+])N=C1OC=C1CCCCC1
174 183.0764186321 CC1=CN(C=C=CO)C([OH2+])N=C1O
175 257.1284542041 C#CCN1C=C(C)C(OC=C2C=CCCC2)=NC1=[OH+]
176 167.0815040121 CC1=CN(C=C=CO)C([OH2+])N=C1
177 255.1128041401 C#CCN1C=C(C)C(OC=C2C=CC=CC2)=NC1=[OH+]
178 273.1233688241 CC(=CN=CC#CO)C(=NC=[OH+])OC=C1C=CCCC1 Intermediate Fragment 
179 273.1233688241 CC=CN(CC#CO)C(=[OH+])N=COC=C1C=CC=CC1 Intermediate Fragment 
180 41.0021910721 [CH+]=C=O
181 63.0440558841 OCC[OH2+]
182 333.1444981921 CC1=CN(C(O)=C=C(O)C#C[OH2+])C(=O)N=C1OCC1CCCCC1 Intermediate Fragment 
183 265.1546689521 C=C([OH2+])N1C=C(C)C(OCC2CCCCC2)=NC1=O
184 263.1390188881 C=C([OH2+])N1C=C(C)C(OC=C2CCCCC2)=NC1=O
185 257.0920686961 C=C(O)N1C=C(C)C([O+]=C=C2C=CC=CC2)=NC1=O
186 249.1233688241 CC1=CN(C=[OH+])C(=O)N=C1OC=C1CCCCC1
187 245.0920686961 CC1=CN(C=[OH+])C(=O)N=C1OC=C1C=CC=CC1
188 245.0920686961 C=C=CN(C=[OH+])C(=O)N=COC=C1C=CC=CC1 Intermediate Fragment 
189 243.0764186321 CC1=CN(C=O)C(=O)N=C1[O+]=C=C1C=CC=CC1
190 85.0284058201 C=C(O)C#C[OH2+]
191 71.0491412641 C=CC(=C)[OH2+]
192 71.0491412641 C#CCC[OH2+]
193 91.0753560121 CC(O)CC[OH2+]
194 73.0647913281 C=C([OH2+])CC
195 291.1339335081 CC1=CN(C(=[OH+])C#CO)C(=O)N=C1OCC1CCCCC1
196 273.1233688241 C#CC(=[OH+])N1C=C(C)C(OC=C2CCCCC2)=NC1=O
197 289.1182834441 CC1=CN(C(=[OH+])C#CO)C(=O)N=C1OC=C1CCCCC1
198 271.1077187601 C#CC(=[OH+])N1C=C(C)C(OC=C2C=CCCC2)=NC1=O
199 289.1182834441 CC(=C=NC(=[OH+])C#CO)C(=NC=O)OC=C1CCCCC1 Intermediate Fragment 
200 287.1026333801 CC1=CN(C(=[OH+])C#CO)C(=O)N=C1OC=C1C=CCCC1
201 333.1444981921 CC1=CN(C(=C=CO)OC#C[OH2+])C(=O)N=C1OCC1CCCCC1 Intermediate Fragment 
202 333.1444981921 CC=C(N=C(O)N(C)C1C=C(O)C(=C=[OH+])O1)OC=C1C=CCCC1 Intermediate Fragment 
203 146.0811696641 C[NH2+]C1C=C(O)C(CO)O1
204 333.1444981921 CC=CN(C(=O)N=COC=C1CCCCC1)C1C=C(O)C(=C=[OH+])O1 Intermediate Fragment 
205 198.0760842841 CC=C[NH+](CO)C1C=C(O)C(=C=O)O1
206 172.0968197281 CCC[NH2+]C1C=C(O)C(=CO)O1
207 333.1444981921 CC(=CN(C(=N)O)C1C=C(O)C(=C=[OH+])O1)COC=C1C=CCCC1 Intermediate Fragment 
208 161.0960914561 C=C(C)C[O+]=C=C1C=CC=CC1
209 213.0869833161 CC=C[NH+](C(N)O)C1C=C(O)C(=C=O)O1
210 290.1386845401 CC(=C[NH+]=C1C=C(O)C(=C=O)O1)COC=C1CCCCC1
211 288.1230344761 CC(=C[NH+]=C1C=C(O)C(=C=O)O1)COC=C1C=CCCC1
212 333.1444981921 CC(=CN(C=O)C1C=C(O)C(=C=[OH+])O1)C(=N)OC=C1CCCCC1 Intermediate Fragment 
213 305.1495835721 CC(=C[NH+]=C1C=C(O)C(=C=O)O1)C(=N)OCC1CCCCC1
214 333.1444981921 CC(=CN=C1C=C(O)C(=C=[OH+])O1)C(=NC=O)OCC1CCCCC1 Intermediate Fragment 
215 208.1332052361 C=C(C)C(=[NH+]C=O)OC=C1CCCCC1
216 206.1175551721 C=C(C)C(=[NH+]C=O)OC=C1C=CCCC1
217 204.1019051081 C=C(C)C(=[NH+]C=O)OC=C1C=CC=CC1
218 333.1444981921 C=C(C)C(=NC(=O)N=C1C=C(O)C(=C=[OH+])O1)OCC1CCCCC1 Intermediate Fragment 
219 333.1444981921 CCCCC(C)=COC1=NC(=O)N(C2C=C(O)C(=C=[OH+])O2)C=C1C Intermediate Fragment 
220 333.1444981921 CCCC(=COC1=NC(=O)N(C2C=C(O)C(=C=[OH+])O2)C=C1C)CC Intermediate Fragment 
221 289.0818979361 CCC#COC1=NC(=O)N(C2C=C(O)C(=C=[OH+])O2)C=C1C
222 333.1444981921 CCCCCC=COC1=NC(=O)N(C2C=C(O)C(=C=[OH+])O2)C=C1C Intermediate Fragment 
223 331.1288481281 CC1=CN(C2C=C(O)C(=C=[OH+])O2)C(=O)N=C1OC=C1CCCCC1
