#In-silico ESI-MS/MS [M+H]+ Spectra
#PREDICTED BY CFM-ID 4.0.8
#SMILES=n1cnc2c(c1NCc1ccn3c1C(CC3)O)ncn2[C@@H]1O[C@H](CO)[C@@H](C1)O
#InChiKey=AWRRPDWUDSEMPF-DGKWRVCWSA-N
energy0
253.11962 84.29 78 (25.65)
271.13019 100.00 92 122 108 116 113 118 131 115 97 138 132 126 103 106 96 111 133 (28.827 0.79351 0.24201 0.22695 0.1077 0.033917 0.033254 0.027968 0.026373 0.024355 0.019668 0.017315 0.0173 0.012288 0.0092113 0.0074256 0.0023607)
369.16696 26.11 76 146 82 145 185 187 (5.5446 1.7989 0.30146 0.25637 0.040964 0.0024092)
387.17753 72.37 0 197 176 184 164 173 162 195 177 152 163 183 150 155 147 153 181 182 151 191 (20.654 0.71854 0.23126 0.12107 0.11353 0.076632 0.038821 0.022718 0.012916 0.007258 0.0053213 0.0048816 0.0048755 0.0024833 0.0022714 0.0017247 0.00074332 0.0005992 0.00050412 0.00034634)
energy1
118.06513 12.26 46 (5.8858)
136.07569 17.89 12 39 44 35 41 25 15 28 (4.0178 1.9832 1.1272 0.66756 0.34208 0.3389 0.11467 0.00080845)
150.07742 4.43 69 (2.1253)
241.11962 4.35 128 (2.091)
253.11962 100.00 78 (48.019)
271.13019 21.35 92 126 122 113 106 132 116 108 97 133 115 131 138 111 103 118 96 (7.7293 1.255 0.58041 0.15584 0.090626 0.083198 0.072291 0.054578 0.053245 0.033521 0.029111 0.025921 0.021827 0.021327 0.017646 0.01407 0.012132)
357.16696 9.22 165 144 (4.2001 0.22737)
energy2
55.05423 13.42 20 (2.5959)
78.03383 13.31 38 (2.5735)
80.04948 21.89 34 (4.2339)
94.06513 4.74 33 (0.91771)
110.06004 12.12 43 18 (2.2716 0.073093)
118.06513 28.30 46 (5.4742)
120.08078 54.41 9 (10.523)
134.04612 6.02 53 (1.1644)
136.06177 36.79 54 (7.1152)
136.07569 100.00 39 25 12 44 15 35 41 28 (7.6557 4.3519 2.0573 1.7763 1.2612 0.91078 0.66659 0.66193)
138.09134 21.08 7 36 16 29 42 13 10 26 40 (2.819 0.46676 0.34903 0.1521 0.12478 0.068947 0.040166 0.036718 0.018849)
148.06177 10.44 71 (2.0188)
150.07742 14.60 69 (2.8237)
186.07742 6.25 114 (1.2086)
188.09307 8.02 112 (1.5503)
213.08832 18.44 117 (3.566)
234.09855 7.73 58 61 57 (0.68439 0.58 0.23152)
243.09889 9.98 120 (1.9305)
253.11962 18.39 78 (3.5567)
255.13527 5.48 79 (1.0593)
271.13019 5.96 92 118 97 133 113 116 126 108 106 111 103 138 96 115 131 132 122 (0.24304 0.19966 0.17194 0.11826 0.058852 0.05301 0.051497 0.051127 0.042936 0.038692 0.036281 0.020076 0.017115 0.016506 0.012574 0.011413 0.0093904)

0 387.1775296361 OCC1OC(n2cnc3c([NH2+]Cc4ccn5c4C(O)CC5)ncnc32)CC1O
1 153.1022394561 [NH+]#CC1CCN2CCC(O)C12
2 149.0709393281 [NH+]#CC1C=CN2C=CC(O)C12
3 235.0825666321 OC1CC(N2C=NC3=CN=CN=C32)OC1=C[OH2+]
4 237.0982166961 OC1CC(N2C=NC3=CN=CN=C32)OC1C[OH2+]
5 140.1069904881 C=C1CCN2CCC([OH2+])C12
6 122.0964258041 [CH3+]=C1C=CN2CCCC12
7 138.0913404241 C=C1C=CN2CCC([OH2+])C12
8 122.0600402961 [OH2+]C1=C2C=CCN2C=C1
9 120.0807757401 [CH3+]=C1C=CN2CCC=C12
10 138.0913404241 C#CC1C([OH2+])CCN1C=C Intermediate Fragment 
11 112.0756903601 C#CC1NCCC1[OH2+]
12 136.0756903601 C#CC1C([OH2+])CCN1C#C
13 138.0913404241 C=C(C)C1=C([OH2+])C=CN1C Intermediate Fragment 
14 98.0600402961 CN1C=CC([OH2+])=C1
15 136.0756903601 [CH+]=C(C)C1=C(O)C=CN1C
16 138.0913404241 C=CC(=C)C1=NCCC1[OH2+] Intermediate Fragment 
17 108.0443902321 C#CC1=NCC=C1[OH2+]
18 110.0600402961 C#CC1=NCCC1[OH2+]
19 122.0600402961 [CH+]=C(C)C1=NCC=C1O
20 55.0542266441 [CH2+]#CCC
21 53.0385765801 C=CC#[CH2+]
22 51.0229265161 C#CC#[CH2+]
23 84.0443902321 [OH2+]C1C=CN=C1
24 88.0756903601 [OH2+]C1CCNC1
25 136.0756903601 C#CC(=C)C1=NCCC1[OH2+]
26 138.0913404241 C#CC=CN1CCC([OH2+])C1 Intermediate Fragment 
27 96.0443902321 [CH2+]N1C=CC(O)=C1
28 136.0756903601 C#CC#CN1CCC([OH2+])C1
29 138.0913404241 C=C1C=CN(CC=C[OH2+])C1 Intermediate Fragment 
30 108.0807757401 C=CN1C=CC(=[CH3+])C1
31 106.0651256761 C#CN1C=CC(=[CH3+])C1
32 96.0807757401 CN1C=CC(=[CH3+])C1
33 94.0651256761 [CH+]=C1C=CN(C)C1
34 80.0494756121 [CH3+]=C1C=CN=C1
35 136.0756903601 C=C1C=CN(CC#C[OH2+])C1
36 138.0913404241 C=C1C=CN=C1C([OH2+])CC Intermediate Fragment 
37 59.0491412641 CC=C[OH2+]
38 78.0338255481 [CH+]=C1C=CN=C1
39 136.0756903601 C=C1C=CN=C1C([OH2+])=CC
40 138.0913404241 C=C1C=CN(C)C1=C(C)[OH2+] Intermediate Fragment 
41 136.0756903601 [CH+]=C1C=CN(C)C1=C(C)O
42 138.0913404241 C=C1C=CN(CC)C1=C[OH2+] Intermediate Fragment 
43 110.0600402961 C=C1C=CN=C1C[OH2+]
44 136.0756903601 C=CN1C=CC(=C)C1=C[OH2+]
45 120.0443902321 [OH+]=C1C=CN2C=CC=C12
46 118.0651256761 [CH3+]=C1C=CN2C=CC=C12
47 39.0229265161 [C+]#CC
48 57.0334912001 C=C=C[OH2+]
49 82.0651256761 [CH3+]=C1C=CNC1
50 108.0443902321 C=C1C=CN=C1C=[OH+]
51 134.0600402961 C=C1C=CN2C=CC([OH2+])=C12
52 248.0778156001 [NH3+]C1=C2N=CN(C3CC(O)C(=C=O)O3)C2=NC=N1
53 134.0461215481 [NH2+]=C1N=CN=C2N=CN=C12
54 136.0617716121 [NH2+]=C1N=CN=C2NCN=C12
55 250.0934656641 [NH3+]C1=C2N=CN(C3CC(O)C(=CO)O3)C2=NC=N1
56 252.1091157281 [NH3+]C1=C2N=CN(C3CC(O)C(CO)O3)C2=NC=N1
57 234.0985510441 C=C1OC(N2C=NC3=C([NH3+])N=CN=C32)CC1O
58 234.0985510441 [NH3+]C1=C2N=CN(C3CCC(=CO)O3)C2=NC=N1
59 252.1091157281 CC(OC(=CO)CO)N1C=NC2=C([NH3+])N=CN=C21 Intermediate Fragment 
60 252.1091157281 [NH3+]C1=C2N=CN(C(=O)CC(O)CCO)C2=NC=N1 Intermediate Fragment 
61 234.0985510441 [NH3+]C1=C2N=CN(CCC(O)C#CO)C2=NC=N1
62 75.0440558841 OCC=C[OH2+]
63 89.0597059481 CC(O)C=C[OH2+]
64 254.1247657921 [NH3+]C1=C2NCN(C3CC(O)C(CO)O3)C2=NC=N1
65 124.0756903601 [OH2+]C1C=CN2C=CCC12
66 106.0651256761 C1=C[NH+]2CC=CC2=C1
67 122.0600402961 [OH+]=C=C=CN1CC=CC1 Intermediate Fragment 
68 262.0934656641 C=[NH+]C1=C2N=CN(C3CC(O)C(=CO)O3)C2=NC=N1
69 150.0774216761 C[NH+]=C1N=CN=C2NCN=C21
70 264.1091157281 C=[NH+]C1=C2N=CN(C3CC(O)C(CO)O3)C2=NC=N1
71 148.0617716121 C=[NH+]C1=C2N=CNC2=NC=N1
72 266.1247657921 C=[NH+]C1=C2NCN(C3CC(O)C(CO)O3)C2=NC=N1
73 266.1247657921 C=[NH+]C1=C2N=CN(C(C)OC(CO)CO)C2=NC=N1 Intermediate Fragment 
74 266.1247657921 C=[NH+]C1=C2N=CN(C(O)CC(O)CCO)C2=NC=N1 Intermediate Fragment 
75 268.1404158561 C[NH2+]C1=C2NCN(C3CC(O)C(CO)O3)C2=NC=N1
76 369.1669649521 OCC1OC(N2CNC3=C([NH+]=C=C4C=CN5CCC=C45)N=CN=C32)CC1O
77 251.1039707721 C(=[NH+]C1=C2NCNC2=NC=N1)=C1C=CN2C=CC=C12
78 253.1196208361 C(=[NH+]C1=C2NCNC2=NC=N1)=C1C=CN2CCC=C12
79 255.1352709001 C(=[NH+]C1=C2NCNC2=NC=N1)=C1C=CN2CCCC12
80 259.1665710281 C1=NC([NH+]=CC2CCN3CCCC23)=C2NCNC2=N1
81 351.1564002681 OCC1CCC(N2CNC3=C([NH+]=C=C4C=CN5C=CC=C45)N=CN=C32)O1
82 369.1669649521 OCC(O)C(O)CCN1CNC2=C([NH+]=C=C3C=CN4C=CC=C34)N=CN=C21 Intermediate Fragment 
83 351.1564002681 OCCC(O)CCN1C=NC2=C([NH+]=C=C3C=CN4C=CC=C34)N=CN=C21
84 119.0702706321 OC1CCOC1C[OH2+]
85 119.0702706321 O=CCC(O)CC[OH2+] Intermediate Fragment 
86 117.0546205681 OC1CCOC1=C[OH2+]
87 99.0440558841 C=C1OCC=C1[OH2+]
88 117.0546205681 CCC(O)C(=O)C=[OH+] Intermediate Fragment 
89 99.0440558841 CC=C(O)C#C[OH2+]
90 117.0546205681 O=CCC(O)C=C[OH2+] Intermediate Fragment 
91 269.1145354561 OC1=C2C(=C=[NH+]C3=C4NCNC4=NC=N3)C=CN2CC1
92 271.1301855201 OC1CCN2C=CC(=C=[NH+]C3=C4NCNC4=NC=N3)C12
93 138.0774216761 [NH2+]=C1N=CN=C2NCNC12
94 146.0461215481 C=[N+]=C1N=CN=C2N=CN=C21
95 152.0930717401 C[NH+]=C1N=CN=C2NCNC21
96 271.1301855201 N=C=NC1=C(C=[NH+]C=C2C=CN3CCC(O)=C23)NCN1 Intermediate Fragment 
97 271.1301855201 OC1=C2C(=C[NH+]=CN=C=NC3=CNCN3)C=CN2CC1 Intermediate Fragment 
98 178.0974884241 [NH3+]C=NC=C1C=CN2CCC(O)=C12
99 188.0818383601 C=[NH+]C=NC=C1C=CN2C=CC(O)=C12
100 190.0974884241 C=[NH+]C=NC=C1C=CN2CCC(O)=C12
101 163.0865893921 C=[NH+]C=C1C=CN2CCC(O)=C12
102 165.1022394561 C=[NH+]C=C1C=CN2CCC(O)C12
103 271.1301855201 N=C=NC(=[NH+]C=C1C=CN2CCC(O)=C12)C1=CNCN1 Intermediate Fragment 
104 244.1192864881 [NH3+]C(=NC=C1C=CN2C=CC(O)=C12)C1=CNCN1
105 254.1036364241 C=[NH+]C(=NC=C1C=CN2C=CC(O)=C12)C1=CNC=N1
106 271.1301855201 C=NC([NH+]=C=C1C=CN2CCC(O)=C12)=C1NCNC1=N Intermediate Fragment 
107 186.0661882961 C#[N+]C=NC=C1C=CN2C=CC(O)=C12
108 271.1301855201 C=NC1=C(C(N)=[NH+]C=C2C=CN3C=CC(O)=C23)NCN1 Intermediate Fragment 
109 254.1036364241 C=[NH+]C1=C(C=NC=C2C=CN3C=CC(O)=C23)N=CN1
110 269.1145354561 C=NC1=C(C([NH3+])=NC=C2C=CN3C=CC(O)=C23)N=CN1
111 271.1301855201 OC1CCN(C=C=C=C=[NH+]C2=C3NCNC3=NC=N2)C1 Intermediate Fragment 
112 188.0930717401 CC=C=C=[NH+]C1=C2NCNC2=NC=N1
113 271.1301855201 C=CC(=C=[NH+]C1=C2NCNC2=NC=N1)C1=NCCC1O Intermediate Fragment 
114 186.0774216761 C=C=C=C=[NH+]C1=C2NCNC2=NC=N1
115 271.1301855201 CC(=C=[NH+]C1=C2NCNC2=NC=N1)C1=C(O)C=CN1C Intermediate Fragment 
116 271.1301855201 OC=CCN1C=CC(=C=[NH+]C2=C3NCNC3=NC=N2)C1 Intermediate Fragment 
117 213.0883207081 C(=[NH+]C1=C2NCNC2=NC=N1)=C1C=CN=C1
118 271.1301855201 CCC(O)C1=NC=CC1=C=[NH+]C1=C2NCNC2=NC=N1 Intermediate Fragment 
119 211.0726706441 C(=[NH+]C1=C2N=CNC2=NC=N1)=C1C=CN=C1
120 243.0988853921 OCC1=NC=CC1=C=[NH+]C1=C2NCNC2=NC=N1
121 245.1145354561 OCC1NC=CC1=C=[NH+]C1=C2NCNC2=NC=N1
122 271.1301855201 CC(O)=C1C(=C=[NH+]C2=C3NCNC3=NC=N2)C=CN1C Intermediate Fragment 
123 225.0883207081 [CH2+]N1C=CC(=C=NC2=C3N=CNC3=NC=N2)C1
124 227.1039707721 CN1C=CC(=C=[NH+]C2=C3N=CNC3=NC=N2)C1
125 255.0988853921 C=C(O)C1=NC=CC1=C=[NH+]C1=C2NCNC2=NC=N1
126 271.1301855201 CCN1C=CC(=C=[NH+]C2=C3NCNC3=NC=N2)C1=CO Intermediate Fragment 
127 239.1039707721 C#CN1C=CC(=C=[NH+]C2=C3NCNC3=NC=N2)C1
128 241.1196208361 C=CN1C=CC(=C=[NH+]C2=C3NCNC3=NC=N2)C1
129 255.0988853921 CN1C=CC(=C=[NH+]C2=C3NCNC3=NC=N2)C1=C=O
130 241.0832353281 O=CC1=NC=CC1=C=[NH+]C1=C2NCNC2=NC=N1
131 271.1301855201 NCNC1=NC=NC([NH+]=C=C2C=CN3CCC(O)=C23)=C1 Intermediate Fragment 
132 271.1301855201 NCNC1=C([NH+]=C=C2C=CN3CCC(O)=C23)N=CN=C1 Intermediate Fragment 
133 271.1301855201 CNC1=C([NH+]=C=C2C=CN3CCC(O)=C23)N=CN=C1N Intermediate Fragment 
134 240.0879863601 NC1=NC=NC([NH+]=C=C2C=CN3C=CC(O)=C23)=C1
135 242.1036364241 NC1=NC=NC([NH+]=C=C2C=CN3CCC(O)=C23)=C1
136 244.1192864881 NC1=NC=NC([NH+]=C=C2C=CN3CCC(O)C23)=C1
137 254.1036364241 CNC1=C([NH+]=C=C2C=CN3C=CC(O)=C23)N=CN=C1
138 271.1301855201 CNC1=NC=NC([NH+]=C=C2C=CN3CCC(O)=C23)=C1N Intermediate Fragment 
139 254.1036364241 CNC1=NC=NC([NH+]=C=C2C=CN3C=CC(O)=C23)=C1
140 273.1458355841 OC1CCN2CCC(=C=[NH+]C3=C4NCNC4=NC=N3)C12
141 275.1614856481 OC1CCN2CCC(C=[NH+]C3=C4NCNC4=NC=N3)C12
142 277.1771357121 OC1CCN2CCC(C[NH2+]C3=C4NCNC4=NC=N3)C12
143 355.1513148881 OC1=C2C(=C=[NH+]C3=C4NCN(C5CC(O)CO5)C4=NC=N3)C=CN2CC1
144 357.1669649521 OC1COC(N2CNC3=C([NH+]=C=C4C=CN5CCC(O)C45)N=CN=C32)C1
145 369.1669649521 CC1OC(N2CNC3=C([NH+]=C=C4C=CN5CCC(O)=C45)N=CN=C32)CC1O
146 369.1669649521 OCC1CCC(N2CNC3=C([NH+]=C=C4C=CN5CCC(O)=C45)N=CN=C32)O1
147 387.1775296361 N=C=NC1=C(C=[NH+]C=C2C=CN3CCC(O)=C23)NCN1C1CC(O)C(CO)O1 Intermediate Fragment 
148 370.1509805401 C=[NH+]C1=C(C=NC=C2C=CN3C=CC(O)=C23)N=CN1C1CC(O)C(CO)O1
149 360.1666306041 [NH2+]=C1C(=C=NC=C2C=CN3CCC(O)=C23)NCN1C1CC(O)C(CO)O1
150 387.1775296361 OCC1OC(N2CNC=C2N=C=NC=[NH+]C=C2C=CN3CCC(O)=C23)CC1O Intermediate Fragment 
151 387.1775296361 N=C=NC(=[NH+]C=C1C=CN2CCC(O)=C12)C1=CN(C2CC(O)C(CO)O2)CN1 Intermediate Fragment 
152 387.1775296361 C=NC1=C(C(N)=[NH+]C=C2C=CN3C=CC(O)=C23)NCN1C1CC(O)C(CO)O1 Intermediate Fragment 
153 387.1775296361 C=CN1CCC(O)=C1C=C=[NH+]C1=C2NCN(C3CC(O)C(CO)O3)C2=NC=N1 Intermediate Fragment 
154 361.1618795721 OCC1OC(N2CNC3=C([NH+]=C=CC4=NCCC4O)N=CN=C32)CC1O
155 387.1775296361 OCC1OC(N2CNC3=C([NH+]=C=C=C=CN4CCC(O)C4)N=CN=C32)CC1O Intermediate Fragment 
156 290.1247657921 C=C=C=[NH+]C1=C2NCN(C3CC(O)C(CO)O3)C2=NC=N1
157 174.0774216761 C=C=C=[NH+]C1=C2NCNC2=NC=N1
158 300.1091157281 C=C=C=C=[NH+]C1=C2N=CN(C3CC(O)C(CO)O3)C2=NC=N1
159 302.1247657921 C=C=C=C=[NH+]C1=C2NCN(C3CC(O)C(CO)O3)C2=NC=N1
160 304.1404158561 CC=C=C=[NH+]C1=C2NCN(C3CC(O)C(CO)O3)C2=NC=N1
161 306.1560659201 CCC=C=[NH+]C1=C2NCN(C3CC(O)C(CO)O3)C2=NC=N1
162 387.1775296361 C=CC(=C=[NH+]C1=C2NCN(C3CC(O)C(CO)O3)C2=NC=N1)C1=NCCC1O Intermediate Fragment 
163 387.1775296361 CC(=C=[NH+]C1=C2NCN(C3CC(O)C(CO)O3)C2=NC=N1)C1=C(O)C=CN1C Intermediate Fragment 
164 387.1775296361 OC=CCN1C=CC(=C=[NH+]C2=C3NCN(C4CC(O)C(CO)O4)C3=NC=N2)C1 Intermediate Fragment 
165 357.1669649521 C=CN1C=CC(=C=[NH+]C2=C3NCN(C4CC(O)C(CO)O4)C3=NC=N2)C1
166 345.1669649521 CN1C=CC(=C=[NH+]C2=C3NCN(C4CC(O)C(CO)O4)C3=NC=N2)C1
167 343.1513148881 CN1C=CC(=C=[NH+]C2=C3N=CN(C4CC(O)C(CO)O4)C3=NC=N2)C1
168 341.1356648241 CN1C=CC(=C=[NH+]C2=C3N=CN(C4CC(O)C(=CO)O4)C3=NC=N2)C1
169 333.1669649521 OCC1OC(N2CNC3=C([NH+]=C=C4CCNC4)N=CN=C32)CC1O
170 331.1513148881 OCC1OC(N2CNC3=C([NH+]=C=C4C=CNC4)N=CN=C32)CC1O
171 329.1356648241 OCC1OC(N2CNC3=C([NH+]=C=C4C=CN=C4)N=CN=C32)CC1O
172 327.1200147601 OCC1OC(N2C=NC3=C([NH+]=C=C4C=CN=C4)N=CN=C32)CC1O
173 387.1775296361 CCC(O)C1=NC=CC1=C=[NH+]C1=C2NCN(C3CC(O)C(CO)O3)C2=NC=N1 Intermediate Fragment 
174 359.1462295081 OCC1=NC=CC1=C=[NH+]C1=C2NCN(C3CC(O)C(CO)O3)C2=NC=N1
175 361.1618795721 OCC1NC=CC1=C=[NH+]C1=C2NCN(C3CC(O)C(CO)O3)C2=NC=N1
176 387.1775296361 CC(O)=C1C(=C=[NH+]C2=C3NCN(C4CC(O)C(CO)O4)C3=NC=N2)C=CN1C Intermediate Fragment 
177 387.1775296361 CCN1C=CC(=C=[NH+]C2=C3NCN(C4CC(O)C(CO)O4)C3=NC=N2)C1=CO Intermediate Fragment 
178 355.1513148881 C#CN1C=CC(=C=[NH+]C2=C3NCN(C4CC(O)C(CO)O4)C3=NC=N2)C1
179 359.1826150161 CCN1C=CC(=C=[NH+]C2=C3NCN(C4CC(O)C(CO)O4)C3=NC=N2)C1
180 357.1305794441 O=CC1=NC=CC1=C=[NH+]C1=C2NCN(C3CC(O)C(CO)O3)C2=NC=N1
181 387.1775296361 NCN(C1=NC=NC([NH+]=C=C2C=CN3CCC(O)=C23)=C1)C1CC(O)C(CO)O1 Intermediate Fragment 
182 387.1775296361 OCC1OC(NCNC2=C([NH+]=C=C3C=CN4CCC(O)=C34)N=CN=C2)CC1O Intermediate Fragment 
183 387.1775296361 CNC1=C([NH+]=C=C2C=CN3CCC(O)=C23)N=CN=C1NC1CC(O)C(CO)O1 Intermediate Fragment 
184 387.1775296361 OCC(O)C(O)CCN1CNC2=C([NH+]=C=C3C=CN4CCC(O)=C34)N=CN=C21 Intermediate Fragment 
185 369.1669649521 OCCC(O)CCN1CNC2=C([NH+]=C=C3C=CN4C=CC(O)=C34)N=CN=C21
186 351.1564002681 CCC(O)CCN1C=NC2=C([NH+]=C=C3C=CN4C=CC(O)=C34)N=CN=C21
187 369.1669649521 C=C=C(O)C1=NC=CC1=C=[NH+]C1=C2NCN(CCC(O)CCO)C2=NC=N1 Intermediate Fragment 
188 329.1720503321 OCCCN1CNC2=C([NH+]=C=C3C=CN4CCC(O)C34)N=CN=C21
189 327.1564002681 OCCCN1CNC2=C([NH+]=C=C3C=CN4CCC(O)=C34)N=CN=C21
190 325.1407502041 OCCCN1CNC2=C([NH+]=C=C3C=CN4C=CC(O)=C34)N=CN=C21
191 387.1775296361 CC(OC(CO)CO)N1CNC2=C([NH+]=C=C3C=CN4CCC(O)=C34)N=CN=C21 Intermediate Fragment 
192 297.1458355841 CCN1CNC2=C([NH+]=C=C3C=CN4CCC(O)=C34)N=CN=C21
193 313.1407502041 CC(O)N1CNC2=C([NH+]=C=C3C=CN4CCC(O)=C34)N=CN=C21
194 315.1564002681 CC(O)N1CNC2=C([NH+]=C=C3C=CN4CCC(O)C34)N=CN=C21
195 387.1775296361 OCCOC(CCO)N1CNC2=C([NH+]=C=C3C=CN4CCC(O)=C34)N=CN=C21 Intermediate Fragment 
196 345.1669649521 OCCC(O)N1CNC2=C([NH+]=C=C3C=CN4CCC(O)C34)N=CN=C21
197 387.1775296361 OCCC(O)CC(O)N1CNC2=C([NH+]=C=C3C=CN4CCC(O)=C34)N=CN=C21 Intermediate Fragment 
198 319.1877003961 CC(O)N1CNC2=C([NH+]=CC3CCN4CCC(O)C34)N=CN=C21
199 317.1720503321 CC(O)N1CNC2=C([NH+]=C=C3CCN4CCC(O)C34)N=CN=C21
200 297.1094500761 OCN1CNC2=C([NH+]=C=C3C=CN4C=CC(O)=C34)N=CN=C21
