#In-silico ESI-MS/MS [M+H]+ Spectra
#PREDICTED BY CFM-ID 4.0.8
#SMILES=n12c(nc3c(c1=O)ncn3[C@@H]1O[C@H](CO)[C@@H](C1)O)NC(CC2O)CCCCC
#InChiKey=POXSUNYCBJREHC-QNOVJUQQSA-N
energy0
278.16115 100.00 15 71 42 56 86 68 95 59 63 40 81 52 100 (77.086 6.3581 0.91644 0.063438 0.043887 0.026386 0.014634 0.01296 0.0086601 0.0071136 0.0062581 0.0034159 0.00010508)
energy1
234.09855 7.51 33 (3.8786)
260.15059 50.56 17 16 (25.8 0.32032)
278.16115 100.00 15 71 42 81 86 63 95 56 40 68 52 59 100 (48.17 1.3251 1.1673 0.24122 0.23904 0.11913 0.094111 0.092116 0.073377 0.064274 0.047329 0.019769 0.0066341)
energy2
45.03349 7.50 195 (1.6053)
55.01784 5.02 207 (1.0741)
57.03349 26.47 9 (5.6658)
57.06988 13.54 26 (2.8989)
59.04914 6.99 209 (1.4974)
81.06988 6.54 72 (1.3995)
83.08553 4.75 73 (1.0177)
85.10118 5.00 74 (1.0705)
99.11683 9.94 78 (2.1278)
150.04104 5.85 80 (1.2531)
206.06725 6.33 20 (1.3554)
208.08290 8.85 21 (1.8942)
210.09855 8.34 22 (1.7851)
234.13494 5.14 85 (1.1005)
238.15500 5.62 160 (1.2039)
260.15059 7.08 17 16 (1.4141 0.10157)
266.08838 5.36 224 (1.1481)
278.16115 100.00 15 63 86 81 71 42 95 68 59 52 40 100 56 (6.4744 5.016 3.0988 1.8305 1.4544 1.1165 0.76015 0.52813 0.32538 0.25043 0.23087 0.17533 0.14763)
280.17680 6.90 102 (1.4782)
296.09894 12.18 223 (2.6066)
302.16115 4.84 172 (1.0361)
304.17680 6.19 171 (1.3242)
306.11968 8.63 115 127 125 124 (0.6957 0.61036 0.40508 0.13704)
308.13533 9.12 116 109 (1.6885 0.26418)
310.15098 5.31 132 (1.1358)
324.20302 12.34 190 (2.641)
326.21867 7.18 202 (1.5371)
330.17720 5.47 134 (1.17)
338.21867 4.88 174 (1.0453)
366.21358 5.36 153 107 243 (0.88012 0.22838 0.039111)

0 394.2084954161 CCCCCC1CC(O)n2c(nc3c(ncn3C3CC(O)C(CO)O3)c2=[OH+])N1
1 376.1979307321 CCCCCC1CC(O)N2CC3=C(N=C2N1)N(C1CC(O)C(=C=[OH+])O1)C=N3
2 119.0702706321 OC1CCOC1C[OH2+]
3 119.0702706321 O=CCC(O)CC[OH2+] Intermediate Fragment 
4 117.0546205681 OC1CCOC1=C[OH2+]
5 99.0440558841 C=C1OCC=C1[OH2+]
6 99.0440558841 [OH+]=C=C1CCCO1
7 117.0546205681 CCC(O)C(=O)C=[OH+] Intermediate Fragment 
8 99.0440558841 CC=C(O)C#C[OH2+]
9 57.0334912001 CC#C[OH2+]
10 117.0546205681 O=CCC(O)C=C[OH2+] Intermediate Fragment 
11 117.0546205681 OCCCOC#C[OH2+] Intermediate Fragment 
12 117.0546205681 CCOC(=C=[OH+])CO Intermediate Fragment 
13 115.0389705041 OC1CCOC1=C=[OH+]
14 276.1455012361 CCCCCC1=NC2=NC3=C(N=CN3)C(=[OH+])N2C(O)C1
15 278.1611513001 CCCCCC1CC(O)N2C(=[OH+])C3=C(N=C2N1)NC=N3
16 260.1505866161 CCCCCC1=NC2=NC3=C(CN2C([OH2+])=C1)N=CN3
17 260.1505866161 CCCCCC1=NC2=NC3=C(N=CN3)C(=[OH+])N2CC1
18 73.1011768361 CCCC[CH4+]
19 71.0855267721 CCCC=[CH3+]
20 206.0672509161 OC1CC=NC2=NC3=C(N=CN3)C(=[OH+])N21
21 208.0829009801 OC1CCNC2=NC3=C(N=CN3)C(=[OH+])N21
22 210.0985510441 OC1CCNC2=NC3=C(NCN3)C(=[OH+])N21
23 212.1142011081 OC1CCNC2=NC3=C(NCN3)C([OH2+])N21
24 214.1298511721 OC1CCNC2=NC3NCNC3C([OH2+])N21
25 59.0855267721 CCC[CH4+]
26 57.0698767081 CCC=[CH3+]
27 220.0829009801 CC1=NC2=NC3=C(N=CN3)C(=[OH+])N2C(O)C1
28 222.0985510441 CC1CC(O)N2C(=[OH+])C3=C(N=C2N1)NC=N3
29 224.1142011081 CC1CC(O)N2C(=[OH+])C3=C(N=C2N1)NCN3
30 226.1298511721 CC1CC(O)N2C(=NC3=C(NCN3)C2[OH2+])N1
31 228.1455012361 CC1CC(O)N2C(=NC3NCNC3C2[OH2+])N1
32 45.0698767081 CC[CH4+]
33 234.0985510441 CCC1=NC2=NC3=C(N=CN3)C(=[OH+])N2C(O)C1
34 236.1142011081 CCC1CC(O)N2C(=[OH+])C3=C(N=C2N1)NC=N3
35 238.1298511721 CCC1CC(O)N2C(=[OH+])C3=C(N=C2N1)NCN3
36 248.1142011081 CCCC1=NC2=NC3=C(N=CN3)C(=[OH+])N2C(O)C1
37 250.1298511721 CCCC1CC(O)N2C(=[OH+])C3=C(N=C2N1)NC=N3
38 252.1455012361 CCCC1CC(O)N2C(=[OH+])C3=C(N=C2N1)NCN3
39 262.1298511721 CCCCC1=NC2=NC3=C(N=CN3)C(=[OH+])N2C(O)C1
40 278.1611513001 CCCCCC1=NC(=NC2=CN=CN2)N(C=[OH+])C(O)C1 Intermediate Fragment 
41 250.1662366801 CCCCCC1CC(O)N=C([NH+]=C2C=NC=N2)N1
42 278.1611513001 CCCCCC1CC(O)N=C(N=C2NC=NC2=C=[OH+])N1 Intermediate Fragment 
43 114.0661882961 [NH2+]=C1NCNC1C=O
44 169.1335395841 CCCCCC1=NC=NC([OH2+])C1
45 171.1491896481 CCCCCC1CC([OH2+])N=CN1
46 101.0709393281 [OH2+]CC1=CNCN1
47 178.0974884241 CCCC#CC1=NC([NH3+])=NC(O)=C1
48 180.1131384881 CCCC=CC1=NC([NH3+])=NC(O)=C1
49 182.1287885521 CCCCCC1=NC([NH3+])=NC(O)=C1
50 184.1444386161 CCCCCC1=NC([NH3+])=NC(O)C1
51 248.1505866161 CCCCCC1=NC([NH+]=C2C=NC=N2)=NC(O)C1
52 278.1611513001 CCCCCC1=CC(O)N(C([OH2+])=C2N=CNC2=N)C=N1 Intermediate Fragment 
53 261.1346022041 CCCCCC1=CC(=O)N(C(=[OH+])C2=CNC=N2)C=N1
54 197.1284542041 CCCCCC1=CC(O)N(C=[OH+])C=N1
55 108.0192381041 N=C1N=CN=C1C#[O+]
56 278.1611513001 CCCCCC1CC(O)N2C(=[OH+])C=C(N=C=N)N=C2N1 Intermediate Fragment 
57 261.1346022041 C=[NH+]C1=CC(=O)N2C(O)=CC(CCCCC)=NC2=N1
58 236.1393532361 CCCCCC1=NC2=NC=CC(=[OH+])N2C(O)C1
59 278.1611513001 CCCCCC1CC(O)N2C(=[OH+])C(N=C=N)=CN=C2N1 Intermediate Fragment 
60 234.1237031721 CCCCCC1=NC2=NC=CC(=[OH+])N2C(O)=C1
61 251.1502522681 CCCCCC1=NC2=NC=C([NH3+])C(=O)N2C(O)C1
62 261.1346022041 C=[NH+]C1=CN=C2N=C(CCCCC)C=C(O)N2C1=O
63 278.1611513001 C=NC1=C(N)N=C2N=C(CCCCC)CC(O)N2C1=[OH+] Intermediate Fragment 
64 247.1189521401 CCCC=CC1=NC2=NC([NH3+])=CC(=O)N2C(O)=C1
65 249.1346022041 CCCCCC1=NC2=NC([NH3+])=CC(=O)N2C(O)=C1
66 251.1502522681 CCCCCC1=NC2=NC([NH3+])=CC(=O)N2C(O)C1
67 276.1455012361 C=[NH+]C1=C(N)N=C2N=C(CCCCC)C=C(O)N2C1=O
68 278.1611513001 C=NC1=C(N)C(=[OH+])N2C(=N1)N=C(CCCCC)CC2O Intermediate Fragment 
69 249.1346022041 CCCCCC1=NC2=NC=C([NH3+])C(=O)N2C(O)=C1
70 247.1189521401 CCCC=CC1=NC2=NC=C([NH3+])C(=O)N2C(O)=C1
71 278.1611513001 CCCCCC=CC(O)N1C(=[OH+])C2=C(N=C1N)NC=N2 Intermediate Fragment 
72 81.0698767081 [CH2+]#CC=CCC
73 83.0855267721 [CH2+]#CCCCC
74 85.1011768361 CCCCC=[CH3+]
75 180.0516008521 [NH3+]C1=NC2=C(N=CN2)C(=O)N1C=O
76 95.0855267721 C#[CH+]C=CCCC
77 97.1011768361 C#[CH+]CCCCC
78 99.1168269001 C=[CH2+]CCCCC
79 101.1324769641 CCCCC[CH3+]C
80 150.0410361681 [NH3+]C1=NC(=O)C2=NC=NC2=N1
81 278.1611513001 CCCCCC=NC1=NC2=C(N=CN2)C(=[OH+])N1C(C)O Intermediate Fragment 
82 100.1120758681 CCCCCC=[NH2+]
83 194.0672509161 C=C(O)N1C(=O)C2=C(N=C1[NH3+])NC=N2
84 236.1505866161 CCCCCC[NH2+]C1=NC(O)=C2N=CNC2=N1
85 234.1349365521 CCCCCC=[NH+]C1=NC(O)=C2N=CNC2=N1
86 278.1611513001 CCCCCC(C)=NC1=NC2=C(N=CN2)C(=[OH+])N1CO Intermediate Fragment 
87 116.1433759961 CCCCCC(C)[NH3+]
88 114.1277259321 CCCCCC(C)=[NH2+]
89 108.0807757401 CC=CC#CC(C)=[NH2+]
90 178.0359507881 NC1=NC2=C(N=CN2)C(=O)N1C#[O+]
91 182.0672509161 [NH3+]C1=NC2=C(N=CN2)C(=O)N1CO
92 184.0829009801 [NH3+]C1=NC2=C(NCN2)C(=O)N1CO
93 262.1298511721 CCCCCC=[NH+]C1=NC2=C(N=CN2)C(=O)N1C=O
94 248.1505866161 CCCCCC(C)=[NH+]C1=NC(O)=C2N=CNC2=N1
95 278.1611513001 CCCCCC(CCO)=NC1=NC([OH2+])=C2N=CNC2=N1 Intermediate Fragment 
96 144.1382906161 CCCCCC(=[NH2+])CCO
97 127.1117415201 CCCCCC#CC[OH2+]
98 232.1192864881 CCCCC=C=[NH+]C1=NC(O)=C2N=CNC2=N1
99 246.1349365521 CCCC=CC(C)=[NH+]C1=NC(O)=C2N=CNC2=N1
100 278.1611513001 CCCCCC(=N)CC(O)N1C=NC2=C(N=CN2)C1=[OH+] Intermediate Fragment 
101 135.0301371361 [OH+]=C1N=CN=C2N=CN=C12
102 280.1768013641 CCCCCC1CC(O)N2C(=[OH+])C3=C(N=C2N1)NCN3
103 282.1924514281 CCCCCC1CC(O)N2C(=NC3=C(NCN3)C2[OH2+])N1
104 284.2081014921 CCCCCC1CC(O)N2C(=NC3NCNC3C2[OH2+])N1
105 362.1822806681 CCCCCC1CC(O)N2C(=[OH+])C3=C(N=C2N1)N(C1CC(O)=CO1)C=N3
106 364.1979307321 CCCCCC1CC(O)N2C(=[OH+])C3=C(N=C2N1)N(C1CC(O)CO1)C=N3
107 366.2135807961 CCCCCC1CC(O)N2C(=[OH+])C3=C(N=C2N1)N(C1CC(O)CO1)CN3
108 376.1979307321 C=C1OC(N2C=NC3=C2N=C2NC(CCCCC)CC(O)N2C3=[OH+])CC1O
109 308.1353304761 CC1OC(N2C=NC3=C2N=C2NCCC(O)N2C3=[OH+])CC1O
110 376.1979307321 CCCCCC1CC(O)N2C(=[OH+])C3=C(N=C2N1)N(CC=C(O)C(C)=O)C=N3 Intermediate Fragment 
111 376.1979307321 C=C(C=O)OC(C)N1C=NC2=C1N=C1NC(CCCCC)CC(O)N1C2=[OH+] Intermediate Fragment 
112 376.1979307321 CCCCCC1CCN2C(=[OH+])C3=C(N=C2N1)N(C1CC(O)C(=CO)O1)C=N3
113 262.1662366801 CCCCCC1CCN2C(=[OH+])C3=C(N=C2N1)NC=N3
114 358.1873660481 C=C1OC(N2C=NC3=C2N=C2NC(CCCCC)CCN2C3=[OH+])C=C1O
115 306.1196804121 OC=C1OC(N2C=NC3=C2N=C2NCCCN2C3=[OH+])CC1O
116 308.1353304761 OCC1OC(N2C=NC3=C2N=C2NCCCN2C3=[OH+])CC1O
117 322.1145950321 OC=C1OC(N2C=NC3=C2N=C2NCCC(O)N2C3=[OH+])CC1O
118 304.1040303481 C=C1OC(N2C=NC3=C2N=C2NCCC(O)N2C3=[OH+])C=C1O
119 304.1040303481 O=C=C1OC(N2C=NC3=C2N=C2NCCCN2C3=[OH+])CC1O
120 322.1145950321 O=CC(=O)C(O)CCN1C=NC2=C1N=C1NCCC(O)N1C2=[OH+] Intermediate Fragment 
121 322.1145950321 O=C(CC(O)C=CO)N1C=NC2=C1N=C1NCCC(O)N1C2=[OH+] Intermediate Fragment 
122 322.1145950321 CCC(O)N1C(=[OH+])C2=C(N=C1N)N(C1CC(O)C(=C=O)O1)C=N2 Intermediate Fragment 
123 324.1302450961 OCC1OC(N2C=NC3=C2N=C2NCCC(O)N2C3=[OH+])CC1O
124 306.1196804121 C=C1OC(N2C=NC3=C2N=C2NCCC(O)N2C3=[OH+])CC1O
125 306.1196804121 OC=C1CCC(N2C=NC3=C2N=C2NCCC(O)N2C3=[OH+])O1
126 324.1302450961 O=C(CC(O)CCO)N1C=NC2=C1N=C1NCCC(O)N1C2=[OH+] Intermediate Fragment 
127 306.1196804121 OC#CC(O)CCN1C=NC2=C1N=C1NCCC(O)N1C2=[OH+]
128 324.1302450961 CCC(O)N1C(=[OH+])C2=C(N=C1N)N(C1CC(O)C(=CO)O1)C=N2 Intermediate Fragment 
129 268.1040303481 [NH3+]C1=NC(O)=C2N=CN(C3CC(O)C(CO)O3)C2=N1
130 326.1458951601 OCC1OC(N2CNC3=C2N=C2NCCC(O)N2C3=[OH+])CC1O
131 328.1615452241 OCC1OC(N2CNC3=C2N=C2NCCC(O)N2C3[OH2+])CC1O
132 310.1509805401 OCC1OC(N2CNC3=C2N=C2NCCCN2C3=[OH+])CC1O
133 328.1615452241 CCC(O)N1C(=[OH+])C2=C(N=C1N)N(C1CC(O)C(CO)O1)CN2 Intermediate Fragment 
134 330.1771952881 OCC1OC(N2CNC3C2N=C2NCCC(O)N2C3[OH2+])CC1O
135 336.1302450961 CC1CC(O)N2C(=[OH+])C3=C(N=C2N1)N(C1CC(O)C(=CO)O1)C=N3
136 338.1458951601 CC1CC(O)N2C(=[OH+])C3=C(N=C2N1)N(C1CC(O)C(CO)O1)C=N3
137 320.1353304761 CC1CC(O)N2C(=[OH+])C3=C(N=C2N1)N(C1CCC(=CO)O1)C=N3
138 338.1458951601 CC1CC(O)N2C(=[OH+])C3=C(N=C2N1)N(C(=O)CC(O)CCO)C=N3 Intermediate Fragment 
139 340.1615452241 CC1CC(O)N2C(=[OH+])C3=C(N=C2N1)N(C1CC(O)C(CO)O1)CN3
140 342.1771952881 CC1CC(O)N2C(=NC3=C(NCN3C3CC(O)C(CO)O3)C2[OH2+])N1
141 344.1928453521 CC1CC(O)N2C(=NC3C(NCN3C3CC(O)C(CO)O3)C2[OH2+])N1
142 43.0542266441 CC=[CH3+]
143 350.1458951601 CCC1CC(O)N2C(=[OH+])C3=C(N=C2N1)N(C1CC(O)C(=CO)O1)C=N3
144 352.1615452241 CCC1CC(O)N2C(=[OH+])C3=C(N=C2N1)N(C1CC(O)C(CO)O1)C=N3
145 354.1771952881 CCC1CC(O)N2C(=[OH+])C3=C(N=C2N1)N(C1CC(O)C(CO)O1)CN3
146 364.1615452241 CCCC1CC(O)N2C(=[OH+])C3=C(N=C2N1)N(C1CC(O)C(=CO)O1)C=N3
147 366.1771952881 CCCC1CC(O)N2C(=[OH+])C3=C(N=C2N1)N(C1CC(O)C(CO)O1)C=N3
148 366.1771952881 CCCC1CC(O)N2C(=[OH+])C3=C(N=C2N1)N(C(=O)CC(O)CCO)C=N3 Intermediate Fragment 
149 368.1928453521 CCCC1CC(O)N2C(=[OH+])C3=C(N=C2N1)N(C1CC(O)C(CO)O1)CN3
150 378.1771952881 CCCCC1CC(O)N2C(=[OH+])C3=C(N=C2N1)N(C1CC(O)C(=CO)O1)C=N3
151 394.2084954161 CCCCCC1CC(O)N(C(=[OH+])C2=CN(C3CC(O)C(=CO)O3)C=N2)C(=N)N1 Intermediate Fragment 
152 394.2084954161 CCCCCC1CC(O)N(C=[OH+])C(=NC2=CN=CN2C2CC(O)C(=CO)O2)N1 Intermediate Fragment 
153 366.2135807961 CCCCCC1CC(O)N=C([NH+]=C2C=NCN2C2CC(O)C(=CO)O2)N1
154 394.2084954161 CCCCCC1CC(O)N=C(N=C2C(=C=[OH+])N=CN2C2CC(O)C(CO)O2)N1 Intermediate Fragment 
155 226.0822322841 [NH2+]=C1C(=C=O)N=CN1C1CC(O)C(CO)O1
156 394.2084954161 CCCCCC1CC(O)N(C([OH2+])=C2N=CN(C3CC(O)C(=C=O)O3)C2=N)CN1 Intermediate Fragment 
157 224.0665822201 [NH2+]=C1C(=C=O)N=CN1C1CC(O)C(=CO)O1
158 394.2084954161 CCCCCC1CC(O)N2C(=[OH+])C=C(N(C=N)C3CC(O)C(=CO)O3)N=C2N1 Intermediate Fragment 
159 377.1819463201 CCCCCC1CC(O)N2C(=O)C=C([NH+](C)C3C=C(O)C(=C=O)O3)N=C2N1
160 238.1550033001 CCCCCC1CC(O)N2C(=[OH+])C=CN=C2N1
161 394.2084954161 CCCCCC1CC(O)N2C(=[OH+])C(N=C=NC3CC(O)C(CO)O3)=CN=C2N1 Intermediate Fragment 
162 394.2084954161 C=NC1=C(N=C2CC(O)C(CO)O2)N=C2NC(CCCCC)CC(O)N2C1=[OH+] Intermediate Fragment 
163 269.1972024601 CCCCCC1CC(O)N2C(=NC=C([NH2+]C)C2O)N1
164 394.2084954161 CCCCCC1CC(O)N2C(=[OH+])C3=C(N=C2N1)N(CCC(O)C(=O)CO)C=N3 Intermediate Fragment 
165 376.1979307321 CCCCCC1CC(O)N2C(=[OH+])C3=C(N=C2N1)N(CCC(O)C#CO)C=N3
166 348.2030161121 C=C(O)CCN1C=NC2=C1N=C1NC(CCCCC)CC(O)N1C2=[OH+]
167 358.1873660481 C#CC(O)=CCN1C=NC2=C1N=C1NC(CCCCC)CC(O)N1C2=[OH+]
168 334.1873660481 CCCCCC1CC(O)N2C(=[OH+])C3=C(N=C2N1)N(CC=CO)C=N3
169 332.1717159841 CCCCCC1CC(O)N2C(=[OH+])C3=C(N=C2N1)N(CC#CO)C=N3
170 306.1924514281 CCCCCC1CC(O)N2C(=[OH+])C3=C(N=C2N1)N(CC)C=N3
171 304.1768013641 CCCCCC1=NC2=NC3=C(N=CN3CC)C(=[OH+])N2C(O)C1
172 302.1611513001 CCCCCC1=NC2=NC3=C(N=CN3CC)C(=[OH+])N2C(O)=C1
173 358.1873660481 CCCCCC1CC(O)N2C(=[OH+])C3=C(N=C2N1)N(CC=CC#CO)C=N3
174 338.2186661761 CCCCCC1CC(O)N2C(=[OH+])C3=C(N=C2N1)N(CCCO)CN3
175 336.2030161121 CCCCCC1CC(O)N2C(=[OH+])C3=C(N=C2N1)N(CCCO)C=N3
176 318.1924514281 C=CCN1C=NC2=C1N=C1NC(CCCCC)CC(O)N1C2=[OH+]
177 336.2030161121 CCCCCCCC(O)N1C(=[OH+])C2=C(N=C1N)N(CC=CO)C=N2 Intermediate Fragment 
178 334.1873660481 CCCCCCNC1=NC2=C(N=CN2CC#CO)C(=[OH+])N1C(C)O Intermediate Fragment 
179 334.1873660481 CCCCCC(C)NC1=NC2=C(N=CN2CC#CO)C(=[OH+])N1CO Intermediate Fragment 
180 306.1924514281 CCCCCC1CC(O)N=C(N=C2C(=C=[OH+])N=CN2CC)N1 Intermediate Fragment 
181 306.1924514281 CCCCCC=CC(O)N1C(=[OH+])C2=C(N=C1N)N(CC)C=N2 Intermediate Fragment 
182 394.2084954161 CCCCCC1CC(O)N2C(=[OH+])C3=C(N=C2N1)N(COC(=CO)C(C)O)C=N3 Intermediate Fragment 
183 394.2084954161 CCCCCC1CC(O)N2C(=[OH+])C3=C(N=C2N1)N(C(C)OC(=CO)CO)C=N3 Intermediate Fragment 
184 75.0440558841 OCC=C[OH2+]
185 318.1560659201 CCCCCC1=NC2=NC3=C(N=CN3C(C)=O)C(=[OH+])N2C(O)C1
186 320.1717159841 CCCCCC1CC(O)N2C(=[OH+])C3=C(N=C2N1)N(C(C)=O)C=N3
187 320.1717159841 CCCCCC=NC1=NC2=C(N=CN2C(C)=O)C(=[OH+])N1C(C)O Intermediate Fragment 
188 322.1873660481 CCCCCC1CC(O)N2C(=[OH+])C3=C(N=C2N1)N(C(C)O)C=N3
189 322.1873660481 CCCCCCCC(O)N1C(=[OH+])C2=C(N=C1N)N(C(C)=O)C=N2 Intermediate Fragment 
190 324.2030161121 CCCCCC1CC(O)N2C(=[OH+])C3=C(N=C2N1)N(C(C)O)CN3
191 364.1979307321 CCCCCC1CC(O)N2C(=[OH+])C3=C(N=C2N1)N(C(C)OC=CO)C=N3
192 394.2084954161 CCCCCC1CC(O)N2C(=[OH+])C3=C(N=C2N1)N(C(CCO)OC=CO)C=N3 Intermediate Fragment 
193 47.0491412641 CC[OH2+]
194 29.0385765801 C=[CH3+]
195 45.0334912001 C=C[OH2+]
196 348.1666306041 CCCCCC1CC(O)N2C(=[OH+])C3=C(N=C2N1)N(C(=O)C=CO)C=N3
197 350.1822806681 CCCCCC1CC(O)N2C(=[OH+])C3=C(N=C2N1)N(C(=O)CCO)C=N3
198 352.1979307321 CCCCCC1CC(O)N2C(=[OH+])C3=C(N=C2N1)N(C(O)CCO)C=N3
199 352.1979307321 CCCCCCCC(O)N1C(=[OH+])C2=C(N=C1N)N(C(=O)CCO)C=N2 Intermediate Fragment 
200 350.1822806681 CCCCCC1CC(O)N2C(=[OH+])C3=C(N=C2N1)N(COC=CO)C=N3
201 394.2084954161 CCCCCC1CC(O)N2C(=[OH+])C3=C(N=C2N1)N(C(=O)CC(O)CCO)C=N3 Intermediate Fragment 
202 326.2186661761 CCCCCC1CC(O)N2C(=NC3=C(NCN3C(C)O)C2[OH2+])N1
203 68.9971056921 [O+]#CC#CO
204 71.0127557561 O=CC#C[OH2+]
205 73.0284058201 OCC#C[OH2+]
206 43.0178411361 C#C[OH2+]
207 55.0178411361 C#CC=[OH+]
208 77.0597059481 OCCC[OH2+]
209 59.0491412641 C=CC[OH2+]
210 310.1873660481 CCCCCC1CC(O)N2C(=[OH+])C3=C(N=C2N1)N(CO)CN3
211 308.1717159841 CCCCCC1CC(O)N2C(=[OH+])C3=C(N=C2N1)N(CO)C=N3
212 306.1560659201 CCCCCC1CC(O)N2C(=[OH+])C3=C(N=C2N1)N(C=O)C=N3
213 304.1404158561 CCCCCC1=NC2=NC3=C(N=CN3C=O)C(=[OH+])N2C(O)C1
214 87.0440558841 CC(O)C#C[OH2+]
215 89.0597059481 CC(O)C=C[OH2+]
216 71.0491412641 C#CC(C)[OH2+]
217 71.0491412641 CCC#C[OH2+]
218 91.0753560121 CC(O)CC[OH2+]
219 73.0647913281 C=CC(C)[OH2+]
220 73.0647913281 CCC=C[OH2+]
221 392.1928453521 CCCCCC1CC(O)N2C(=[OH+])C3=C(N=C2N1)N(C(=O)CC(O)C=CO)C=N3
222 394.2084954161 CCCCCCCC(O)N1C(=[OH+])C2=C(N=C1N)N(C1CC(O)C(=CO)O1)C=N2 Intermediate Fragment 
223 296.0989449681 [NH3+]C1=NC2=C(N=CN2C2CC(O)C(=CO)O2)C(=O)N1CO
224 266.0883802841 [NH3+]C1=NC(O)=C2N=CN(C3CC(O)C(=CO)O3)C2=N1
225 394.2084954161 CCCCCCNC1=NC2=C(N=CN2C2CC(O)C(=CO)O2)C(=[OH+])N1C(C)O Intermediate Fragment 
226 310.1145950321 CC(O)N1C(=O)C2=C(N=C1[NH3+])N(C1CC(O)C(=CO)O1)C=N2
227 310.1145950321 CC(O)N1C(=O)C2=C(N=C1[NH3+])N(C(=O)CC(O)C=CO)C=N2 Intermediate Fragment 
228 312.1302450961 CC(O)N1C(=O)C2=C(N=C1[NH3+])N(C1CC(O)C(CO)O1)C=N2
229 312.1302450961 CC(O)N1C(=O)C2=C(N=C1[NH3+])N(C(=O)CC(O)CCO)C=N2 Intermediate Fragment 
230 352.1979307321 CCCCCC[NH2+]C1=NC(O)=C2N=CN(C3CC(O)C(CO)O3)C2=N1
231 352.1979307321 CCCCCC[NH2+]C1=NC(O)=C2N=CN(C(=O)CC(O)CCO)C2=N1 Intermediate Fragment 
232 350.1822806681 CCCCCC[NH2+]C1=NC(O)=C2N=CN(C3CC(O)C(=CO)O3)C2=N1
233 350.1822806681 CCCCCC[NH2+]C1=NC(O)=C2N=CN(CCC(O)C(=O)C=O)C2=N1 Intermediate Fragment 
234 350.1822806681 CCCCCC[NH2+]C1=NC(O)=C2N=CN(C(=O)CC(O)C=CO)C2=N1 Intermediate Fragment 
235 394.2084954161 CCCCCC(C)NC1=NC2=C(N=CN2C2CC(O)C(=CO)O2)C(=[OH+])N1CO Intermediate Fragment 
236 72.0807757401 CCC(C)=[NH2+]
237 55.0542266441 [CH2+]#CCC
238 294.0832949041 [NH3+]C1=NC2=C(N=CN2C2CC(O)C(=C=O)O2)C(=O)N1CO
239 298.1145950321 [NH3+]C1=NC2=C(N=CN2C2CC(O)C(CO)O2)C(=O)N1CO
240 280.1040303481 CN1C(=O)C2=C(N=C1[NH3+])N(C1CC(O)C(=CO)O1)C=N2
241 298.1145950321 [NH3+]C1=NC2=C(N=CN2C(=O)CC(O)CCO)C(=O)N1CO Intermediate Fragment 
242 300.1302450961 [NH3+]C1=NC2=C(NCN2C2CC(O)C(CO)O2)C(=O)N1CO
243 366.2135807961 CCCCCC(C)[NH2+]C1=NC(O)=C2N=CN(C3CC(O)C(CO)O3)C2=N1
244 364.1979307321 CCCCCC(C)[NH2+]C1=NC(O)=C2N=CN(C3CC(O)C(=CO)O3)C2=N1
245 364.1979307321 CCCCCC(C)[NH2+]C1=NC(O)=C2N=CN(C(=O)CC(O)C=CO)C2=N1 Intermediate Fragment 
246 394.2084954161 CCCCCC(CCO)NC1=NC([OH2+])=C2N=CN(C3CC(O)C(=CO)O3)C2=N1 Intermediate Fragment 
247 394.2084954161 CCCCCC(N)CC(O)N1C=NC2=C(N=CN2C2CC(O)C(=CO)O2)C1=[OH+] Intermediate Fragment 
248 377.1819463201 CCCCCCCC(O)N1C=NC2=C(N=CN2C2CC(O)C(=C=O)O2)C1=[OH+]
249 263.1502522681 CCCCCC=CC(O)N1C=NC2=C(N=CN2)C1=[OH+]
250 251.0774812521 OC=C1OC(N2C=NC3=C([OH2+])N=CN=C32)CC1O
251 98.0964258041 CCCCCC#[NH+]
252 102.1277259321 CCCCCC[NH3+]
253 112.1120758681 CCCC=CC(C)=[NH2+]
254 253.0931313161 OCC1OC(N2C=NC3=C([OH2+])N=CN=C32)CC1O
255 253.0931313161 O=C(CC(O)CCO)N1C=NC2=C([OH2+])N=CN=C21 Intermediate Fragment 
256 142.1226405521 CCCCCC(=[NH2+])C=CO
