#In-silico ESI-MS/MS [M+H]+ Spectra
#PREDICTED BY CFM-ID 4.0.8
#SMILES=O1[C@H](CO)[C@@H](C[C@@H]1n1cc(c(nc1=O)OCCCCO)C)O
#InChiKey=YCGXGWLSDXJRIU-IJLUTSLNSA-N
energy0
55.05423 15.13 109 (3.8847)
125.03455 28.52 24 (7.3237)
127.05020 77.85 25 (19.991)
181.09715 100.00 39 15 (25.603 0.077047)
199.10772 74.70 5 41 54 62 60 59 61 (17.2 0.82878 0.55667 0.34749 0.11709 0.10795 0.023801)
315.15506 15.83 0 178 133 171 193 191 177 192 197 175 199 189 (3.8315 0.14859 0.045287 0.012484 0.009346 0.0063472 0.0057589 0.0028299 0.0023276 0.0013298 0.00032871 0.00018166)
energy1
43.01784 12.86 78 (1.1996)
45.03349 24.76 77 (2.3102)
55.05423 70.30 109 (6.5599)
57.03349 21.44 83 (2.0003)
69.03349 10.40 22 164 (0.54477 0.4254)
73.06479 18.04 9 167 (1.4105 0.2733)
99.04406 48.31 81 7 74 (3.2233 0.94772 0.33677)
109.03964 86.11 16 (8.0351)
111.05529 22.60 17 (2.1089)
125.03455 70.52 24 (6.5807)
127.05020 83.51 25 (7.7923)
139.05020 19.89 29 (1.8557)
141.06585 20.08 30 (1.8732)
153.06585 30.27 34 (2.825)
167.08150 74.34 36 (6.9369)
169.09715 15.12 37 (1.4111)
171.11280 26.73 52 38 (1.9405 0.55375)
181.09715 100.00 39 15 (9.218 0.11319)
199.10772 81.62 5 54 41 62 61 60 59 (6.5925 0.55045 0.27862 0.069164 0.065224 0.033716 0.026127)
225.08698 16.45 10 163 114 98 99 (0.90662 0.34978 0.22746 0.044524 0.0064834)
225.12337 13.70 144 143 (1.2136 0.065107)
energy2
41.03858 6.87 107 (2.1631)
43.05423 5.10 105 (1.6063)
45.03349 6.60 77 (2.0794)
55.05423 100.00 109 (31.5)
57.03349 7.22 83 (2.2732)
57.06988 24.08 106 (7.585)
59.04914 3.65 90 (1.1492)
71.04914 4.41 165 21 (1.0816 0.30843)
73.06479 14.86 9 167 (4.4124 0.26998)
99.04406 3.66 7 74 81 (0.86544 0.19521 0.091697)
109.03964 7.65 16 (2.4094)
125.03455 17.56 24 (5.5302)
127.05020 13.77 25 (4.3379)
139.05020 5.42 29 (1.706)
169.06077 5.40 116 (1.7012)
181.09715 8.66 39 15 (2.6492 0.077775)
199.10772 4.51 41 5 62 61 54 59 60 (0.59501 0.41256 0.16917 0.087969 0.058282 0.057963 0.038484)
225.12337 4.24 144 143 (1.1942 0.14188)
227.13902 7.31 176 (2.3024)
255.13393 3.90 173 (1.2272)

0 315.1550628761 Cc1cn(C2CC(O)C(C[OH2+])O2)c(=O)nc1OCCCCO
1 283.1288481281 CC1=CN(C2=CC(O)=CO2)C([OH2+])N=C1OCCCCO
2 285.1444981921 CC1=CN(C2=CC(O)=CO2)C([OH2+])NC1OCCCCO
3 297.1444981921 C=C1OC(N2C=C(C)C(OCCCCO)=NC2[OH2+])C=C1O
4 201.1233688241 CC1=C(OCCCCO)NC([OH2+])N=C1
5 199.1077187601 CC1=C(OCCCCO)N=C([OH2+])N=C1
6 197.0920686961 CC1=C(OC=CCCO)N=C([OH2+])N=C1
7 99.0440558841 C=C1OC=CC1[OH2+]
8 75.0804413921 CCCC[OH2+]
9 73.0647913281 C=CCC[OH2+]
10 225.0869833161 C=C1OC(N2C=C(C)C(O)=NC2[OH2+])C=C1O
11 239.1026333801 C=C1OC(N2C=C(C)C(OC)=NC2[OH2+])C=C1O
12 279.1339335081 C=C1OC(N2C=C(C)C(OCCCC)=NC2=[OH+])C=C1O
13 205.1546689521 CC1CNC([OH2+])NC1OCCCCO
14 203.1390188881 CC1C=NC([OH2+])NC1OCCCCO
15 181.0971540761 CC1=C([OH+]C=CCCO)N=CN=C1
16 109.0396392001 [CH2+]C1=CN=C(O)N=C1
17 111.0552892641 CC1=CN=C([OH2+])N=C1
18 113.0709393281 CC1=CNC([OH2+])N=C1
19 115.0865893921 CC1C=NC([OH2+])NC1
20 117.1022394561 CC1CNC([OH2+])NC1
21 71.0491412641 C#CCC[OH2+]
22 69.0334912001 C#CC=C[OH2+]
23 67.0178411361 C#CC#C[OH2+]
24 125.0345538201 [CH2+]C1=C(O)N=C(O)N=C1
25 127.0502038841 CC1=C(O)N=C([OH2+])N=C1
26 129.0658539481 CC1=C(O)NC([OH2+])N=C1
27 131.0815040121 CC1C=NC([OH2+])NC1O
28 133.0971540761 CC1CNC([OH2+])NC1O
29 139.0502038841 C=[O+]C1=C(C)C=NC(O)=N1
30 141.0658539481 COC1=C(C)C=NC([OH2+])=N1
31 143.0815040121 COC1=C(C)C=NC([OH2+])N1
32 145.0971540761 COC1NC([OH2+])N=CC1C
33 147.1128041401 COC1NC([OH2+])NCC1C
34 153.0658539481 C=COC1=C(C)C=NC([OH2+])=N1
35 155.0815040121 CCOC1=C(C)C=NC([OH2+])=N1
36 167.0815040121 CC=COC1=C(C)C=NC([OH2+])=N1
37 169.0971540761 CCCOC1=C(C)C=NC([OH2+])=N1
38 171.1128041401 CCCOC1=C(C)C=NC([OH2+])N1
39 181.0971540761 CCC=COC1=C(C)C=NC([OH2+])=N1
40 183.0764186321 OCCC=COC1=CC=NC([OH2+])=N1
41 199.1077187601 CC(=C=N)C(=NC=[OH+])OCCCCO Intermediate Fragment 
42 182.0811696641 C=C(C)C(=[NH+]C=O)OC#CCCO
43 172.0968197281 CC=C([NH+]=C=O)OCCCCO
44 170.0811696641 CC=C([NH+]=C=O)OC=CCCO
45 142.0498695361 O=C[NH+]=COC#CCCO
46 54.0338255481 C=CC#[NH+]
47 56.0494756121 CCC#[NH+]
48 60.0807757401 CCC[NH3+]
49 152.0706049801 CC(C#[NH+])=COC#CCCO
50 154.0862550441 CC(C#[NH+])=COC=CCCO
51 156.1019051081 CC(C#[NH+])=COCCCCO
52 171.1128041401 CC(C#[NH+])=C(N)OCCCCO
53 197.0920686961 CC(C#[NH+])=C(N=C=O)OCCCCO
54 199.1077187601 CC(=C=NC=[OH+])C(=N)OCCCCO Intermediate Fragment 
55 156.1019051081 C=C(C)C(=[NH2+])OC=CCCO
56 154.0862550441 C=C(C)C(=[NH2+])OC#CCCO
57 152.0706049801 C=C(C)C(=[NH2+])OC#CC=CO
58 142.0862550441 CC=C([NH3+])OC#CCCO
59 199.1077187601 CC(=C=NC(=N)[OH2+])COC=CCCO Intermediate Fragment 
60 199.1077187601 CC=C=NC(=[OH+])N=COCCCCO Intermediate Fragment 
61 199.1077187601 C=NC([OH2+])=NC(=CC)OC=CCCO Intermediate Fragment 
62 199.1077187601 C=C(C)C(=NC(N)=[OH+])OC=CCCO Intermediate Fragment 
63 137.0597059481 C=C(C)C[OH+]C#CC#CO
64 139.0753560121 C=C(C)C[OH+]C#CC=CO
65 179.0815040121 CCC#COC1=C(C)C=NC([OH2+])=N1
66 111.0076703761 O=C1C=COC1=C=[OH+]
67 113.0233204401 OC1C=COC1=C=[OH+]
68 115.0389705041 OC1CCOC1=C=[OH+]
69 87.0440558841 [OH2+]C1=COCC1
70 115.0389705041 CC=C(O)C(=O)C=[OH+] Intermediate Fragment 
71 117.0546205681 OC1CCOC1=C[OH2+]
72 85.0284058201 [OH2+]C1=COC=C1
73 89.0597059481 [OH2+]C1CCOC1
74 99.0440558841 [OH+]=C=C1CCCO1
75 117.0546205681 OCCC(O)C#C[OH2+] Intermediate Fragment 
76 47.0491412641 CC[OH2+]
77 45.0334912001 C=C[OH2+]
78 43.0178411361 C#C[OH2+]
79 87.0440558841 CC(O)C#C[OH2+]
80 89.0597059481 CC(O)C=C[OH2+]
81 99.0440558841 CC=C(O)C#C[OH2+]
82 117.0546205681 OCCCOC#C[OH2+] Intermediate Fragment 
83 57.0334912001 CC#C[OH2+]
84 117.0546205681 CCOC(=C=[OH+])CO Intermediate Fragment 
85 75.0440558841 OCC=C[OH2+]
86 73.0284058201 OCC#C[OH2+]
87 91.0389705041 OCC(=[OH+])CO
88 117.0546205681 COC(=C=[OH+])C(C)O Intermediate Fragment 
89 117.0546205681 CCC(O)C(=O)C=[OH+] Intermediate Fragment 
90 59.0491412641 CC=C[OH2+]
91 59.0127557561 OC=C=[OH+]
92 61.0284058201 OCC=[OH+]
93 29.0385765801 C=[CH3+]
94 119.0702706321 OC1CCOC1C[OH2+]
95 101.0597059481 C=C1OCCC1[OH2+]
96 101.0597059481 [OH2+]C=C1CCCO1
97 119.0702706321 OCCC(O)C=C[OH2+] Intermediate Fragment 
98 225.0869833161 CC1=CN(C2C=C(O)C(=C=[OH+])O2)C(O)NC1
99 225.0869833161 CC1=CN(C=C=C(O)C(=O)C=[OH+])C(O)NC1 Intermediate Fragment 
100 227.1026333801 CC1CNC(O)N(C2C=C(O)C(=C=[OH+])O2)C1
101 227.1026333801 CC1CNC(O)N(C(O)=C=C(O)C#C[OH2+])C1 Intermediate Fragment 
102 229.1182834441 CC1CNC(O)N(C2CC(O)C(=C=[OH+])O2)C1
103 231.1339335081 CC1CNC(O)N(C2CC(O)C(=C[OH2+])O2)C1
104 233.1495835721 CC1CNC(O)N(C2CC(O)C(C[OH2+])O2)C1
105 43.0542266441 CC=[CH3+]
106 57.0698767081 CCC=[CH3+]
107 41.0385765801 [CH2+]#CC
108 45.0698767081 CC[CH4+]
109 55.0542266441 [CH2+]#CCC
110 53.0385765801 C=CC#[CH2+]
111 241.0818979361 CC1=CN(C2C=C(O)C(=C=[OH+])O2)C(O)NC1O
112 241.0818979361 CC1=CN(C=C=C(O)C(=O)C=[OH+])C(O)NC1O Intermediate Fragment 
113 243.0975480001 CC1CN(C2C=C(O)C(=C=[OH+])O2)C(O)NC1O
114 225.0869833161 CC1=CN(C2C=CC(=C=[OH+])O2)C(O)NC1O
115 243.0975480001 CC1CN(C(O)=C=C(O)C#C[OH2+])C(O)NC1O Intermediate Fragment 
116 169.0607685681 C=C([OH2+])N1C=C(C)C(O)=NC1=O
117 155.0451185041 CC1=CN(C=[OH+])C(=O)N=C1O
118 241.0818979361 CC1=CN(C([OH2+])=C=C(O)C#CO)C(O)NC1O
119 245.1131980641 CC1CN(C2CC(O)C(=C=[OH+])O2)C(O)NC1O
120 247.1288481281 CC1CN(C2CC(O)C(=C[OH2+])O2)C(O)NC1O
121 249.1444981921 CC1CN(C2CC(O)C(C[OH2+])O2)C(O)NC1O
122 61.0647913281 CCC[OH2+]
123 255.0975480001 COC1NC(O)N(C2C=C(O)C(=C=[OH+])O2)C=C1C
124 257.1131980641 COC1NC(O)N(C2C=C(O)C(=C=[OH+])O2)CC1C
125 261.1444981921 COC1NC(O)N(C2CC(O)C(=C[OH2+])O2)CC1C
126 263.1601482561 COC1NC(O)N(C2CC(O)C(C[OH2+])O2)CC1C
127 297.1444981921 CCCCOC1NC(O)N(C2C=C(O)C(=C=[OH+])O2)C=C1C
128 183.1128041401 CCCCOC1=C(C)C=NC([OH2+])=N1
129 297.1444981921 CCCCOC1NC(O)N(C=C=C(O)C(=O)C=[OH+])C=C1C Intermediate Fragment 
130 297.1444981921 CC1=CN(C2C=CC(=C=[OH+])O2)C(O)NC1OCCCCO
131 279.1339335081 CCCCOC1=NC(O)N(C2C=CC(=C=[OH+])O2)C=C1C
132 297.1444981921 CC1=CN(C=C=CC(=O)C=[OH+])C(O)NC1OCCCCO Intermediate Fragment 
133 315.1550628761 CC1CN(C(O)=C=C(O)C#C[OH2+])C(O)NC1OCCCCO Intermediate Fragment 
134 273.1444981921 CC1=CN(C([OH2+])C#CO)C(O)NC1OCCCCO
135 271.1288481281 CC1=CN(C([OH2+])C#CO)C(O)N=C1OCCCCO
136 199.0713332521 CC1=CN(C([OH2+])C#CO)C(O)N=C1O
137 269.1131980641 CC1=CN(C([OH2+])C#CO)C(=O)N=C1OCCCCO
138 251.1026333801 CCC=COC1=NC(=O)N(C([OH2+])C#CO)C=C1C
139 247.1652336361 C=C([OH2+])N1CC(C)C(OCCCCO)NC1O
140 245.1495835721 C=C([OH2+])N1C=C(C)C(OCCCCO)NC1O
141 243.1339335081 C=C([OH2+])N1C=C(C)C(OCCCCO)=NC1O
142 183.0764186321 C=C([OH2+])N1C=C(C)C(OC)=NC1=O
143 225.1233688241 C=C([OH2+])N1C=C(C)C(OCCCC)=NC1=O
144 225.1233688241 C#CN1C=C(C)C(OCCCCO)=NC1[OH2+]
145 243.1339335081 C=C([OH2+])N=C=C(C)C(=NCO)OCCCCO Intermediate Fragment 
146 243.1339335081 C=C([OH2+])N(C=O)C=C(C)C(=N)OCCCCO Intermediate Fragment 
147 243.1339335081 C=C([OH2+])N(C)C(O)=NC(=CC)OC=CCCO Intermediate Fragment 
148 241.1182834441 C=C([OH2+])N1C=C(C)C(OCCCCO)=NC1=O
149 223.1077187601 C=C([OH2+])N1C=C(C)C(OC=CCC)=NC1=O
150 223.1077187601 C#CN1C=C(C)C(OCCCCO)=NC1=[OH+]
151 241.1182834441 C=C([OH2+])N=C=C(C)C(=NC=O)OCCCCO Intermediate Fragment 
152 239.1026333801 C=C([OH2+])N1C=C(C)C(OC=CCCO)=NC1=O
153 221.0920686961 C=C([OH2+])N1C=C(C)C(OC#CCC)=NC1=O
154 68.9971056921 [O+]#CC#CO
155 71.0127557561 O=CC#C[OH2+]
156 55.0178411361 C#CC=[OH+]
157 77.0597059481 OCCC[OH2+]
158 231.1339335081 CC1=CN(C[OH2+])C(O)N=C1OCCCCO
159 229.1182834441 CC1=CN(C[OH2+])C(=O)N=C1OCCCCO
160 211.1077187601 CC1=CN(C)C(=[OH+])N=C1OC=CCCO
161 227.1026333801 CC1=CN(C[OH2+])C(=O)N=C1OC=CCCO
162 227.1026333801 CC=CN(C[OH2+])C(=O)N=COC#CCCO Intermediate Fragment 
163 225.0869833161 CC1=CN(C[OH2+])C(=O)N=C1OC#CCCO
164 69.0334912001 C#CC(=C)[OH2+]
165 71.0491412641 C#CC(C)[OH2+]
166 91.0753560121 CC(O)CC[OH2+]
167 73.0647913281 C=CC(C)[OH2+]
168 297.1444981921 CC1=CN(C=C=C(O)C#C[OH2+])C(O)NC1OCCCCO
169 279.1339335081 CCCCOC1=NC(O)N(C=C=C(O)C#C[OH2+])C=C1C
170 313.1394128121 CC1=CN(C([OH2+])=C=C(O)C#CO)C(O)NC1OCCCCO
171 315.1550628761 CC1CN(C(=C=CO)OC#C[OH2+])C(O)NC1OCCCCO Intermediate Fragment 
172 253.1182834441 CC1=CN(CC#CO)C(=[OH+])N=C1OCCCCO
173 255.1339335081 CC1=CN(CC#CO)C([OH2+])N=C1OCCCCO
174 257.1495835721 CC1=CN(CC#CO)C([OH2+])NC1OCCCCO
175 315.1550628761 C=C(OC(=C=[OH+])CO)N1C=C(C)C(OCCCCO)NC1O Intermediate Fragment 
176 227.1390188881 C#CN1C=C(C)C(OCCCCO)NC1[OH2+]
177 315.1550628761 C=C(O)C(=C=[OH+])OCN1C=C(C)C(OCCCCO)NC1O Intermediate Fragment 
178 315.1550628761 CC1CN(C=C=C(O)C(=O)C=[OH+])C(O)NC1OCCCCO Intermediate Fragment 
179 259.1652336361 CC1CN(CC#CO)C([OH2+])NC1OCCCCO
180 63.0440558841 OCC[OH2+]
181 231.1703190161 C=CN1CC(C)C(OCCCCO)NC1[OH2+]
182 229.1546689521 C#CN1CC(C)C(OCCCCO)NC1[OH2+]
183 89.0233204401 O=CC(=[OH+])CO
184 73.0284058201 CC(=[OH+])C=O
185 93.0546205681 OCC([OH2+])CO
186 75.0440558841 CC(=[OH+])CO
187 213.1233688241 CC1=CN(C)C(=[OH+])N=C1OCCCCO
188 209.0920686961 CC1=CN(C)C(=[OH+])N=C1OC#CCCO
189 315.1550628761 CC=C(NC(O)N(C)C1C=C(O)C(=C=[OH+])O1)OCCCCO Intermediate Fragment 
190 146.0811696641 C[NH2+]C1CC(O)C(=CO)O1
191 315.1550628761 CC=CN(C(O)NCOCCCCO)C1C=C(O)C(=C=[OH+])O1 Intermediate Fragment 
192 315.1550628761 CC(=CN(C(N)O)C1C=C(O)C(=C=[OH+])O1)COCCCCO Intermediate Fragment 
193 315.1550628761 CC(=CN(CO)C1C=C(O)C(=C=[OH+])O1)C(N)OCCCCO Intermediate Fragment 
194 287.1601482561 CC(C[NH2+]C1C=C(O)C(=C=O)O1)C(N)OCCCCO
195 287.1601482561 CC(C[NH2+]C(O)=C=C(O)C#CO)C(N)OCCCCO Intermediate Fragment 
196 285.1444981921 CC(C[NH+]=C1C=C(O)C(=C=O)O1)C(N)OCCCCO
197 315.1550628761 CC(CN=C1C=C(O)C(=C=[OH+])O1)C(NCO)OCCCCO Intermediate Fragment 
198 272.1492492241 CC(C[NH2+]C1C=C(O)C(=C=O)O1)COCCCCO
199 315.1550628761 CC(C)C(NC(O)N=C1C=C(O)C(=C=[OH+])O1)OCCCCO Intermediate Fragment 
