#In-silico ESI-MS/MS [M+H]+ Spectra
#PREDICTED BY CFM-ID 4.0.8
#SMILES=[nH]1c(nc2c(c1=O)nc(n2[C@@H]1O[C@H](CO)[C@@H](C1)O)Nc1ccc(cc1)C)N
#InChiKey=SHOPSBOWUOUXGM-IJLUTSLNSA-N
energy0
257.11454 32.61 10 27 37 63 42 59 20 38 49 57 64 53 44 (22.735 0.039907 0.030669 0.02755 0.016725 0.016504 0.0097775 0.0071158 0.0060013 0.0056151 0.0028311 0.0010709 0.00071343)
373.16188 100.00 0 185 149 182 115 217 147 121 136 137 172 170 148 210 146 139 220 (68.806 0.99315 0.21247 0.094089 0.029215 0.020873 0.010627 0.010172 0.0092597 0.0087038 0.0074457 0.0057022 0.003674 0.0034123 0.0020745 0.0011401 0.00080744)
energy1
240.08799 5.38 19 21 45 56 (2.8463 0.52945 0.069784 0.052061)
255.09889 2.98 9 36 69 48 58 (1.8964 0.025616 0.012864 0.00080826 0.00051602)
257.11454 100.00 10 27 64 20 37 59 44 53 38 63 42 57 49 (61.44 0.88328 0.84073 0.52239 0.38765 0.29113 0.1807 0.14031 0.11537 0.071861 0.071084 0.023161 0.017814)
329.13566 2.72 93 (1.7662)
355.15131 5.38 77 150 91 88 1 95 85 92 94 82 96 84 (2.57 0.56484 0.084751 0.083292 0.065152 0.043105 0.022918 0.020188 0.018578 0.016259 0.0041314 0.00060242)
373.16188 7.48 0 185 149 121 172 136 170 137 182 115 210 147 217 220 146 139 148 (3.3049 1.217 0.1692 0.042257 0.035821 0.024593 0.013645 0.013127 0.010959 0.0069191 0.0068357 0.0040225 0.0033553 0.0032887 0.0017188 0.00038449 0.00017635)
energy2
43.01784 3.74 194 (0.74626)
45.03349 9.02 161 (1.8013)
55.01784 4.45 195 (0.88788)
73.06479 3.64 207 206 (0.36638 0.35952)
75.04406 29.48 132 (5.8872)
89.05971 9.29 171 (1.8555)
91.05423 5.23 16 (1.0451)
106.06513 30.35 105 (6.0593)
108.08078 13.09 12 107 101 106 (2.1164 0.21184 0.14734 0.13854)
167.06759 4.93 73 (0.98405)
191.06759 7.51 62 (1.4989)
240.08799 5.77 19 45 21 56 (1.1054 0.030492 0.013457 0.0036298)
255.09889 9.82 9 48 69 58 36 (1.7888 0.059764 0.056627 0.030776 0.025426)
257.11454 100.00 10 27 64 38 20 44 59 57 49 53 63 37 42 (10.018 2.804 1.5212 0.9798 0.82537 0.78752 0.73841 0.65498 0.60469 0.37246 0.30376 0.1794 0.17868)
261.14584 3.80 71 (0.75884)
281.11454 13.02 164 (2.5995)
283.13019 45.02 89 (8.9888)
285.10945 6.03 198 199 200 201 (0.6173 0.27728 0.17006 0.13938)
286.11862 4.51 119 (0.8997)
295.13019 4.47 154 (0.89174)
299.12510 9.67 173 174 175 176 (0.72565 0.43005 0.39171 0.38425)
303.15640 4.26 178 (0.84988)
305.09928 4.18 215 (0.83464)
313.14075 25.19 87 156 157 184 158 (1.702 1.155 0.78954 0.78802 0.59565)
321.13058 4.17 219 (0.83334)
329.13566 3.90 93 (0.77782)
343.15131 4.06 75 180 (0.58467 0.2258)
347.14623 5.84 218 (1.1659)
353.13566 4.45 209 (0.88855)
371.14623 9.80 135 145 169 208 (1.4285 0.29056 0.15995 0.077644)

0 373.1618795721 Cc1ccc([NH2+]c2nc3c(=O)[nH]c(N)nc3n2C2CC(O)C(CO)O2)cc1
1 355.1513148881 CC1CCC(=[NH+]C2=NC3=CN=C(N)N=C3N2C2C=C(O)C(=C=O)O2)CC1
2 241.1196208361 CC1C=CC(=[NH+]C2=NC3=CN=C(N)N=C3N2)C=C1
3 117.0546205681 OC1CCOC1=C[OH2+]
4 99.0440558841 C=C1OCC=C1[OH2+]
5 117.0546205681 CCC(O)C(=O)C=[OH+] Intermediate Fragment 
6 99.0440558841 CC=C(O)C#C[OH2+]
7 117.0546205681 O=CCC(O)C=C[OH2+] Intermediate Fragment 
8 115.0389705041 OC1CCOC1=C=[OH+]
9 255.0988853921 [CH2+]C1=CCC(=NC2=NC3=C(O)N=C(N)N=C3N2)C=C1
10 257.1145354561 CC1=CCC(=[NH+]C2=NC3=C(O)N=C(N)N=C3N2)C=C1
11 239.1039707721 [CH2+]C1=CCC(=NC2=NC3=CN=C(N)N=C3N2)C=C1
12 108.0807757401 CC1C=CC(=[NH2+])C=C1
13 150.0410361681 [NH3+]C1=NC(=O)C2=NC=NC2=N1
14 152.0566862321 [NH3+]C1=NC(=O)C2=NCNC2=N1
15 93.0698767081 [CH4+]C1=CC=CC=C1
16 91.0542266441 [CH2+]C1=CC=CC=C1
17 165.0519352001 NC1=NC(=O)C2=NC([NH3+])=NC2=N1
18 241.0832353281 NC1=NC(=O)C2=NC([NH+]=C3C=CC=CC3)=NC2=N1
19 240.0879863601 [CH2+]C1=CCC(=NC2=NC3=C(O)N=CN=C3N2)C=C1
20 257.1145354561 CC1=CCC(=[NH+]C2=NC(=C=O)C(=NC(=N)N)N2)C=C1 Intermediate Fragment 
21 240.0879863601 CC1=CCC(=NC2=NC(C#[O+])=C(N=C=N)N2)C=C1
22 215.0927373921 CC1C=CC(=NC2=NC(=C=O)C(=[NH2+])N2)C=C1
23 213.0770873281 C=C1C=CC(=NC2=NC(=C=O)C(=[NH2+])N2)C=C1
24 198.0661882961 C=C1C=CC(=[NH+]C2=NC(=C=O)C=N2)C=C1
25 196.0505382321 [CH+]=C1C=CC(=NC2=NC(=C=O)C=N2)C=C1
26 229.1196208361 CC1C=CC(=NC2=NC(=NC(N)=[NH2+])C=N2)C=C1
27 257.1145354561 CC1=CCC(=[NH+]C2=NC(=NC(N)=NC=O)C=N2)C=C1 Intermediate Fragment 
28 214.1087218041 C=C1C=CC(=NC2=NC=C([NH+]=CN)N2)C=C1
29 212.0930717401 C=C1C=CC(=NC2=NC=C([NH+]=C=N)N2)C=C1
30 210.0774216761 [CH+]=C1C=CC(=NC2=NC=C(N=C=N)N2)C=C1
31 187.0978227721 CC1C=CC(=NC2=NC(=[NH2+])C=N2)C=C1
32 185.0821727081 C=C1C=CC(=NC2=NC(=[NH2+])C=N2)C=C1
33 172.0869237401 C=C1C=CC(=[NH+]C2=NC=CN2)C=C1
34 170.0712736761 [CH+]=C1C=CC(=NC2=NC=CN2)C=C1
35 227.1039707721 C=C1C=CC(=NC2=NC(=NC(N)=[NH2+])C=N2)C=C1
36 255.0988853921 CC1=CCC(=NC2=NC(=NC(N)=NC#[O+])C=N2)C=C1
37 257.1145354561 [CH2+]C1=CCC(=NC2=NC(C(=O)N=C(N)N)=CN2)C=C1 Intermediate Fragment 
38 257.1145354561 CC1=CCC(=[NH+]C2=NC(=C(O)N=C=N)C(=N)N2)C=C1 Intermediate Fragment 
39 228.0879863601 C=C1C=CC(=NC2=NC(=N)C(C([NH3+])=O)=N2)C=C1
40 230.1036364241 CC1C=CC(=NC2=NC(=N)C(C([NH3+])=O)=N2)C=C1
41 211.0614372641 [CH+]=C1C=CC(=NC2=NC(=C=O)C(=N)N2)C=C1
42 257.1145354561 CC1=CCC(=[NH+]C2=NC(C(N)=O)=C(N=C=N)N2)C=C1 Intermediate Fragment 
43 215.0927373921 C=C1C=CC(=NC2=NC(C([NH3+])=O)=CN2)C=C1
44 257.1145354561 [CH2+]C1=CCC(=NC(=N)NC2=NC(N)=NC(O)=C2)C=C1 Intermediate Fragment 
45 240.0879863601 [CH2+]C1=CC=C(N=C=NC2=NC(N)=NC(O)=C2)C=C1
46 131.0603746441 C=C1C=CC(=NC#[NH+])C=C1
47 146.0712736761 [CH+]=C1C=CC(=NC(=N)N)C=C1
48 255.0988853921 [CH+]=C1C=CC(=NC(=N)NC2=NC(N)=NC(O)=C2)C=C1
49 257.1145354561 [CH2+]C1=CCC(=NC(N)=NC2=C(O)N=C(N)N=C2)C=C1 Intermediate Fragment 
50 133.0760247081 CC1C=CC(=NC#[NH+])C=C1
51 125.0457872001 NC1=NC(=O)C(=[NH2+])C=N1
52 127.0614372641 NC1=NC(=O)C([NH3+])C=N1
53 257.1145354561 CC1=CC=C([NH+]=C=NC2=C(O)N=C(N)N=C2N)C=C1 Intermediate Fragment 
54 118.0651256761 C#[N+]C1=CC=C(C)C=C1
55 140.0566862321 NC1=NC(=O)C(=[NH2+])C(N)=N1
56 240.0879863601 [CH2+]C1=CC=C(N=C=NC2=C(O)N=C(N)N=C2)C=C1
57 257.1145354561 CC1=CC=C([NH+]=C=NC2=NC(N)=NC(O)=C2N)C=C1 Intermediate Fragment 
58 255.0988853921 [CH2+]C1=CC=C(N=C=NC2=NC(N)=NC(O)=C2N)C=C1
59 257.1145354561 C=C([CH2+])C=CC(C)=NC1=NC2=C(O)N=C(N)N=C2N1 Intermediate Fragment 
60 241.0832353281 C=C(C)C#CC#[N+]C1=NC2=C(O)N=C(N)N=C2N1
61 217.0832353281 C=CC(C)=[NH+]C1=NC2=NC(N)=NC(=O)C2=N1
62 191.0675852641 CC=[NH+]C1=NC2=NC(N)=NC(=O)C2=N1
63 257.1145354561 C=CC(C=C=CC)=[NH+]C1=NC2=C(O)N=C(N)N=C2N1 Intermediate Fragment 
64 257.1145354561 CCC(C)=C=C=C=[NH+]C1=NC2=C(O)N=C(N)N=C2N1 Intermediate Fragment 
65 175.0362851361 C#[N+]C1=NC2=NC(N)=NC(=O)C2=N1
66 179.0675852641 C[NH2+]C1=NC2=NC(N)=NC(=O)C2=N1
67 181.0832353281 C[NH2+]C1N=C2C(=O)N=C(N)N=C2N1
68 189.0519352001 C=C=[NH+]C1=NC2=NC(N)=NC(=O)C2=N1
69 255.0988853921 C=CC(C)=C=C=C=[NH+]C1=NC2=C(O)N=C(N)N=C2N1
70 259.1301855201 CC1C=CC(=[NH+]C2=NC3=C(O)N=C(N)N=C3N2)CC1
71 261.1458355841 CC1CCC(=[NH+]C2=NC3=C(O)N=C(N)N=C3N2)CC1
72 263.1614856481 CC1CCC([NH2+]C2=NC3=C(O)N=C(N)N=C3N2)CC1
73 167.0675852641 NC1=NC(=O)C2=NC([NH3+])NC2=N1
74 341.1356648241 CC1=CCC(=[NH+]C2=NC3=C(O)N=C(N)N=C3N2C2CC(O)=CO2)C=C1
75 343.1513148881 CC1C=CC(=[NH+]C2=NC3=C(O)N=C(N)N=C3N2C2CC(O)=CO2)CC1
76 345.1669649521 CC1CCC(=[NH+]C2=NC3=C(O)N=C(N)N=C3N2C2CC(O)=CO2)CC1
77 355.1513148881 C=C1OC(N2C([NH+]=C3C=CC(C)CC3)=NC3=C(O)N=C(N)N=C32)C=C1O
78 337.1407502041 C=C1C=CC(N2C([NH+]=C3C=CC(C)=CC3)=NC3=C(O)N=C(N)N=C32)O1
79 110.0964258041 CC1C=CC(=[NH2+])CC1
80 250.0934656641 C=C1OC(N2C=NC3=C(O)N=C([NH3+])N=C32)CC1O
81 339.1200147601 C=C1OC(N2C([NH+]=C3C=CC=CC3)=NC3=C(O)N=C(N)N=C32)C=C1O
82 355.1513148881 C=C1OC(N2C(=NC(N)=NC=O)C=NC2=[NH+]C2=CC=C(C)CC2)C=C1O Intermediate Fragment 
83 285.1346022041 C=C1OC(N2C(=[NH2+])C=NC2=NC2=CC=C(C)CC2)C=C1O
84 355.1513148881 C=C1OC(N(C(=N)[NH+]=C2C=CC(C)=CC2)C2=NC(N)=NC(O)=C2)C=C1O Intermediate Fragment 
85 355.1513148881 CC(=O)C(O)=CCN1C([NH+]=C2C=CC(C)=CC2)=NC2=C(O)N=C(N)N=C21 Intermediate Fragment 
86 337.1407502041 C#CC(O)=CCN1C([NH+]=C2C=CC(C)=CC2)=NC2=C(O)N=C(N)N=C21
87 313.1407502041 CC1C=CC(=[NH+]C2=NC3=C(O)N=C(N)N=C3N2CC#CO)CC1
88 355.1513148881 C=C(C=O)OC(C)N1C([NH+]=C2C=CC(C)=CC2)=NC2=C(O)N=C(N)N=C21 Intermediate Fragment 
89 283.1301855201 C=CN1C([NH+]=C2C=CC(C)=CC2)=NC2=C(O)N=C(N)N=C21
90 285.1458355841 CCN1C([NH+]=C2C=CC(C)=CC2)=NC2=C(O)N=C(N)N=C21
91 355.1513148881 C#COC(C=C=O)N1C([NH+]=C2CCC(C)CC2)=NC2=C(O)N=C(N)N=C21 Intermediate Fragment 
92 355.1513148881 C#CC(O)=CC(=O)N1C([NH+]=C2CCC(C)CC2)=NC2=C(O)N=C(N)N=C21 Intermediate Fragment 
93 329.1356648241 CC1CCC(=[NH+]C2=NC3=C(O)N=C(N)N=C3N2C(=O)C#CO)CC1
94 355.1513148881 C=C1OC(N2C([NH+]=C(C=C=CC)CC)=NC3=C(O)N=C(N)N=C32)C=C1O Intermediate Fragment 
95 355.1513148881 C=C1OC(N2C([NH+]=C(C)C=C=C(C)C)=NC3=C(O)N=C(N)N=C32)C=C1O Intermediate Fragment 
96 355.1513148881 C=C1OC(N2C([NH+]=C=C=CC(C)CC)=NC3=C(O)N=C(N)N=C32)C=C1O Intermediate Fragment 
97 114.1277259321 CC1CCC([NH3+])CC1
98 112.1120758681 CC1CCC(=[NH2+])CC1
99 95.0855267721 [CH4+]C1=CC=CCC1
100 112.1120758681 CCC=CC(=[NH2+])CC Intermediate Fragment 
101 108.0807757401 CCC(C)=C=CC#[NH+] Intermediate Fragment 
102 81.0698767081 [CH2+]#CC(C)=CC
103 79.0542266441 C=C=C(C)C#[CH2+]
104 77.0385765801 [C+]#CC(C)=C=C
105 106.0651256761 CC=C(C)C#CC#[NH+]
106 108.0807757401 [CH2+]C(C)=C=CC(C)=N Intermediate Fragment 
107 108.0807757401 C=CC(=[NH2+])C=C=CC Intermediate Fragment 
108 264.0727302201 [NH3+]C1=NC(O)=C2N=CN(C3CC(O)C(=C=O)O3)C2=N1
109 266.0883802841 [NH3+]C1=NC(O)=C2N=CN(C3CC(O)C(=CO)O3)C2=N1
110 268.1040303481 [NH3+]C1=NC(O)=C2N=CN(C3CC(O)C(CO)O3)C2=N1
111 268.1040303481 [NH3+]C1=NC(O)=C2N=CN(C(=O)CC(O)CCO)C2=N1 Intermediate Fragment 
112 99.1168269001 [CH4+]C1CCCCC1
113 357.1305794441 NC1=NC(O)=C2N=C([NH+]=C3CCCCC3)N(C3C=C(O)C(=C=O)O3)C2=N1
114 356.1353304761 CC1CCC(=[NH+]C2=NC3=C(O)N=CN=C3N2C2C=C(O)C(=C=O)O2)CC1
115 373.1618795721 CC1CCC([NH2+]C2=NC(=C=O)C(=NC(=N)N)N2C2C=C(O)C(=C=O)O2)CC1 Intermediate Fragment 
116 356.1353304761 CC1C=CC(=NC2=NC(C=O)=C([NH+]=CN)N2C2C=C(O)C(=C=O)O2)CC1
117 331.1400815081 CC1CCC(NC2=NC(=C=O)C(=[NH2+])N2C2C=C(O)C(=C=O)O2)CC1
118 314.1135324121 CC1C=CC(=[NH+]C2=NC(C=O)=CN2C2C=C(O)C(=C=O)O2)CC1
119 286.1186177921 CC1C=CC(=[NH+]C2=NC=CN2C2C=C(O)C(=C=O)O2)CC1
120 345.1669649521 CC1CCC(N=C2N=CC(=NC(N)=[NH2+])N2C2C=C(O)C(=C=O)O2)CC1
121 373.1618795721 CC1CCC([NH+]=C2N=CC(=NC(N)=NC=O)N2C2C=C(O)C(=C=O)O2)CC1 Intermediate Fragment 
122 330.1560659201 CC1CCC(=NC2=NC=C([NH+]=CN)N2C2C=C(O)C(=C=O)O2)CC1
123 303.1451668881 CC1CCC(N=C2N=CC(=[NH2+])N2C2C=C(O)C(=C=O)O2)CC1
124 330.1560659201 CC1C=CC(=NC2=NC=C([NH+]=CN)N2CC=C(O)C(=O)C=O)CC1 Intermediate Fragment 
125 330.1560659201 CC1CCC(=NC2=NC=C([NH+]=CN)N2C(=O)C=C(O)C#CO)CC1 Intermediate Fragment 
126 328.1404158561 CC1C=CC(=NC2=NC=C([NH+]=CN)N2C2C=C(O)C(=C=O)O2)CC1
127 328.1404158561 CC1=CCC(=NC2=NC=C([NH+]=CN)N2CC=C(O)C(=O)C=O)C=C1 Intermediate Fragment 
128 326.1247657921 CC1=CCC(=NC2=NC=C([NH+]=CN)N2C2C=C(O)C(=C=O)O2)C=C1
129 285.1346022041 CC1CC=C(N=C2N=CC(=[NH2+])N2C2C=CC(=C=O)O2)CC1
130 303.1451668881 CC1CC=C(N=C2N=CC(=[NH2+])N2CC=C(O)C(=O)C=O)CC1 Intermediate Fragment 
131 303.1451668881 CC1CCC(N=C2N=CC(=[NH2+])N2C(=O)C=C(O)C#CO)CC1 Intermediate Fragment 
132 75.0440558841 OCC=C[OH2+]
133 301.1295168241 CC1CC=C(N=C2N=CC(=[NH2+])N2C2C=C(O)C(=C=O)O2)CC1
134 288.1342678561 CC1CCC(=[NH+]C2=NC=CN2C2C=C(O)C(=C=O)O2)CC1
135 371.1462295081 CC1CC=C(N=C2N=CC(=NC(N)=[NH+]C=O)N2C2C=C(O)C(=C=O)O2)CC1
136 373.1618795721 CC1CCC(=[NH+]C2=NC(C(=O)N=C(N)N)=CN2C2C=C(O)C(=C=O)O2)CC1 Intermediate Fragment 
137 373.1618795721 CC1CCC(=[NH+]C2=NC(=C(O)N=CN)C(=N)N2C2C=C(O)C(=C=O)O2)CC1 Intermediate Fragment 
138 329.1244314441 CC1CCC(=NC2=NC(=C=O)C(=[NH2+])N2C2C=C(O)C(=C=O)O2)CC1
139 373.1618795721 CC1CCC(=[NH+]C(=N)N(C2=NC(N)=NC(O)=C2)C2C=C(O)C(=C=O)O2)CC1 Intermediate Fragment 
140 356.1353304761 CC1=CC=C(N=C[NH+](C2=NC(N)=NC(O)=C2)C2C=C(O)C(=C=O)O2)CC1
141 243.1087813801 NC1=NC(O)=CC([NH2+]C2CC(O)C(CO)O2)=N1
142 241.0931313161 NC1=NC(O)=CC([NH+]=C2CC(O)C(CO)O2)=N1
143 241.0931313161 NC1=NC(O)=CC([NH+]=C(O)CC(O)C=CO)=N1 Intermediate Fragment 
144 262.1186177921 CC1CCC(=NC(=[NH2+])N=C2C=C(O)C(=C=O)O2)CC1
145 371.1462295081 CC1C=CC(=NC(=[NH2+])N(C2=NC(N)=NC(O)=C2)C2C=C(O)C(=C=O)O2)CC1
146 373.1618795721 CC1CCC([NH2+]C(=NC2=C(O)N=C(N)N=C2)N=C2C=C(O)C(=C=O)O2)CC1 Intermediate Fragment 
147 373.1618795721 CC1CCC([NH2+]C=NC2=C(O)N=C(N)N=C2N=C2C=C(O)C(=C=O)O2)CC1 Intermediate Fragment 
148 373.1618795721 CC1CC=C([NH+]=CN(C2=NC(N)=NC(O)=C2N)C2C=C(O)C(=C=O)O2)CC1 Intermediate Fragment 
149 373.1618795721 CC1CCC(=[NH+]C2=NC3=C(O)N=C(N)N=C3N2CC=C(O)C(=O)C=O)CC1 Intermediate Fragment 
150 355.1513148881 CC1C=CC(=[NH+]C2=NC3=C(O)N=C(N)N=C3N2CC=C(O)C#CO)CC1
151 317.1720503321 CC1CCC([NH2+]C2=NC3=C(O)N=C(N)N=C3N2CC#CO)CC1
152 315.1564002681 CC1CCC(=[NH+]C2=NC3=C(O)N=C(N)N=C3N2CC#CO)CC1
153 297.1458355841 C#CCN1C([NH+]=C2C=CC(C)CC2)=NC2=C(O)N=C(N)N=C21
154 295.1301855201 C#CCN1C([NH+]=C2C=CC(C)=CC2)=NC2=C(O)N=C(N)N=C21
155 269.1145354561 C=C1C=CC(=[NH+]C2=NC3=C(O)N=C(N)N=C3N2C)C=C1
156 313.1407502041 CC1=CC=C([NH+]=C2N=CC(=NC(N)=NC=O)N2CC#CO)CC1 Intermediate Fragment 
157 313.1407502041 CC1=CCC(=[NH+]C(=N)N(CC#CO)C2=NC(N)=NC(O)=C2)C=C1 Intermediate Fragment 
158 313.1407502041 CC1C=CC(=[NH+]C(N=CC#CO)=NC2=C(O)N=C(N)N=C2)CC1 Intermediate Fragment 
159 311.1251001401 CC1=CCC(=[NH+]C2=NC3=C(O)N=C(N)N=C3N2CC#CO)C=C1
160 63.0440558841 OCC[OH2+]
161 45.0334912001 C=C[OH2+]
162 289.1771357121 CCN1C([NH+]=C2CCC(C)CC2)=NC2=C(O)N=C(N)N=C21
163 287.1614856481 CCN1C([NH+]=C2C=CC(C)CC2)=NC2=C(O)N=C(N)N=C21
164 281.1145354561 C#CN1C([NH+]=C2C=CC(C)=CC2)=NC2=C(O)N=C(N)N=C21
165 91.0389705041 OCC(=[OH+])CO
166 73.0284058201 OCC#C[OH2+]
167 93.0546205681 OCC([OH2+])CO
168 267.0988853921 C=C1C=CC(=NC2=NC3=C(O)N=C(N)N=C3N2[CH2+])C=C1
169 371.1462295081 CC1C=CC(=[NH+]C2=NC3=C(O)N=C(N)N=C3N2CC=C(O)C(=O)C=O)CC1
170 373.1618795721 C=C(O)C(=C=O)OCN1C([NH+]=C2CCC(C)CC2)=NC2=C(O)N=C(N)N=C21 Intermediate Fragment 
171 89.0597059481 CC(O)C=C[OH2+]
172 373.1618795721 CC1CCC(=[NH+]C2=NC3=C(O)N=C(N)N=C3N2C(C)OC(=C=O)C=O)CC1 Intermediate Fragment 
173 299.1251001401 CC(=O)N1C([NH+]=C2C=CC(C)=CC2)=NC2=C(O)N=C(N)N=C21
174 299.1251001401 CC(=O)N1C(=NC(N)=NC=O)C=NC1=[NH+]C1=CC=C(C)C=C1 Intermediate Fragment 
175 299.1251001401 [CH2+]C(=O)N(C(=N)N=C1C=CC(C)=CC1)C1=NC(N)=NC(O)=C1 Intermediate Fragment 
176 299.1251001401 CCC(C)=C=C=C=[NH+]C1=NC2=C(O)N=C(N)N=C2N1C(C)=O Intermediate Fragment 
177 301.1407502041 CC(=O)N1C([NH+]=C2C=CC(C)CC2)=NC2=C(O)N=C(N)N=C21
178 303.1564002681 CC(=O)N1C([NH+]=C2CCC(C)CC2)=NC2=C(O)N=C(N)N=C21
179 305.1720503321 CC(=O)N1C([NH2+]C2CCC(C)CC2)=NC2=C(O)N=C(N)N=C21
180 343.1513148881 CC1C=CC(=[NH+]C2=NC3=C(O)N=C(N)N=C3N2C(C)OC#CO)CC1
181 345.1669649521 CC1CCC(=[NH+]C2=NC3=C(O)N=C(N)N=C3N2C(C)OC#CO)CC1
182 373.1618795721 CC1CCC([NH2+]C2=NC3=C(O)N=C(N)N=C3N2C(C=C=O)OC#CO)CC1 Intermediate Fragment 
183 331.1513148881 CC1CCC([NH2+]C2=NC3=C(O)N=C(N)N=C3N2C(=O)C#CO)CC1
184 313.1407502041 C#CC(=O)N1C([NH+]=C2CCC(C)CC2)=NC2=C(O)N=C(N)N=C21
185 373.1618795721 CC1CCC([NH2+]C2=NC3=C(O)N=C(N)N=C3N2C(=O)C=C(O)C#CO)CC1 Intermediate Fragment 
186 327.1200147601 CC1C=CC(=[NH+]C2=NC3=C(O)N=C(N)N=C3N2C(=O)C#CO)CC1
187 309.1094500761 CC1=CCC(=NC2=NC3=C(O)N=C(N)N=C3N2[CH+]C#CO)C=C1
188 47.0491412641 CC[OH2+]
189 29.0385765801 C=[CH3+]
190 297.1094500761 [CH2+]C(=O)N1C(N=C2C=CC(C)=CC2)=NC2=C(O)N=C(N)N=C21
191 68.9971056921 [O+]#CC#CO
192 41.0021910721 [C+]#CO
193 71.0127557561 O=CC#C[OH2+]
194 43.0178411361 C#C[OH2+]
195 55.0178411361 C#CC=[OH+]
196 289.1407502041 CC1CCC(=[NH+]C2=NC3=C(O)N=C(N)N=C3N2C=O)CC1
197 287.1251001401 CC1C=CC(=[NH+]C2=NC3=C(O)N=C(N)N=C3N2C=O)CC1
198 285.1094500761 CC1=CCC(=[NH+]C2=NC3=C(O)N=C(N)N=C3N2C=O)C=C1
199 285.1094500761 CC1=CC=C([NH+]=C2N=CC(=NC(N)=NC=O)N2C=O)C=C1 Intermediate Fragment 
200 285.1094500761 CC1=CCC(=NC(=N)N(C#[O+])C2=NC(N)=NC(O)=C2)C=C1 Intermediate Fragment 
201 285.1094500761 CCC(C)=C=C=C=[NH+]C1=NC2=C(O)N=C(N)N=C2N1C=O Intermediate Fragment 
202 283.0938000121 CC1=CCC(=NC2=NC3=C(O)N=C(N)N=C3N2C#[O+])C=C1
203 87.0440558841 CC(O)C#C[OH2+]
204 69.0334912001 C=CC#C[OH2+]
205 91.0753560121 CC(O)CC[OH2+]
206 73.0647913281 C=CC(C)[OH2+]
207 73.0647913281 CCC=C[OH2+]
208 371.1462295081 CC1CCC(=[NH+]C2=NC3=C(O)N=C(N)N=C3N2C(=O)C=C(O)C#CO)CC1
209 353.1356648241 CC1=CCC(=[NH+]C2=NC3=C(O)N=C(N)N=C3N2CC=C(O)C#CO)C=C1
210 373.1618795721 CC(CCC(C)C)=[NH+]C1=NC2=C(O)N=C(N)N=C2N1C1C=C(O)C(=C=O)O1 Intermediate Fragment 
211 331.1149293801 CCC(C)=[NH+]C1=NC2=C(O)N=C(N)N=C2N1C1C=C(O)C(=C=O)O1
212 317.0992793161 CC(C)=[NH+]C1=NC2=C(O)N=C(N)N=C2N1C1C=C(O)C(=C=O)O1
213 307.1149293801 CC[NH2+]C1=NC2=C(O)N=C(N)N=C2N1C1CC(O)C(=C=O)O1
214 307.1149293801 CC[NH2+]C1=NC2=C(O)N=C(N)N=C2N1C(=O)CC(O)C#CO Intermediate Fragment 
215 305.0992793161 CC[NH2+]C1=NC2=C(O)N=C(N)N=C2N1C1C=C(O)C(=C=O)O1
216 303.0836292521 CC=[NH+]C1=NC2=C(O)N=C(N)N=C2N1C1C=C(O)C(=C=O)O1
217 373.1618795721 CCCCC(CC)=[NH+]C1=NC2=C(O)N=C(N)N=C2N1C1C=C(O)C(=C=O)O1 Intermediate Fragment 
218 347.1462295081 CCCCC[NH2+]C1=NC2=C(O)N=C(N)N=C2N1C1C=C(O)C(=C=O)O1
219 321.1305794441 CCC[NH2+]C1=NC2=C(O)N=C(N)N=C2N1C1CC(O)C(=C=O)O1
220 373.1618795721 CCC(C)CCC=[NH+]C1=NC2=C(O)N=C(N)N=C2N1C1C=C(O)C(=C=O)O1 Intermediate Fragment 
221 297.1305794441 C[NH2+]C1=NC2=C(O)N=C(N)N=C2N1C1CC(O)C(CO)O1
