a) cout << х;  __2
b) cout << х + х;  __4
c) cout << “х=” ; __x=
d) cout << "х =" <  х;  __ nothing(error)
e) cout<< х + у <<  " = " << у + х;  __ 5 = 5
f) z = х + у;  ___ nothing
g) cin >> x >> у; ___ nothing because here I should type x and y
h) // cout <<"х + у = " << х + у; __ nothing, it is comment
i) cout << "\n" ; empty string

