{
  "extends": [
    "tslint:latest",
    "tslint-eslint-rules",
    "tslint-plugin-prettier",
    "tslint-config-prettier"
  ],
  "rules": {
    "no-submodule-imports": false,
    "no-implicit-dependencies": false,
    "prettier": true
  }
}
