<svg width="24" height="24" viewBox="0 0 24 24" fill="none" xmlns="http://www.w3.org/2000/svg">
<path d="M2 2H5L5.7561 6M5.7561 6L6.75469 11.2828C6.89545 12.2681 7.73929 13 8.73459 13H18.3957C19.3331 13 20.1447 12.3489 20.348 11.4339L21.5 6H5.7561ZM11.5 22C11.5 22 12 21 13.5 21C15 21 15.5 22 15.5 22M9 18C9 18.5523 8.55228 19 8 19C7.44772 19 7 18.5523 7 18C7 17.4477 7.44772 17 8 17C8.55228 17 9 17.4477 9 18ZM20 18C20 18.5523 19.5523 19 19 19C18.4477 19 18 18.5523 18 18C18 17.4477 18.4477 17 19 17C19.5523 17 20 17.4477 20 18Z" stroke="black" stroke-width="2" stroke-linecap="round" stroke-linejoin="round"/>
</svg>
