<svg width="24" height="24" viewBox="0 0 24 24" fill="none" xmlns="http://www.w3.org/2000/svg">
<path d="M2 21V19C2 17.9391 2.42143 16.9217 3.17157 16.1716C3.92172 15.4214 4.93913 15 6 15H7M18 18H17M13 7C13 9.20914 11.2091 11 9 11C6.79086 11 5 9.20914 5 7C5 4.79086 6.79086 3 9 3C11.2091 3 13 4.79086 13 7ZM13 22H20C21.1046 22 22 21.1046 22 20V16C22 14.8954 21.1046 14 20 14H13C11.8954 14 11 14.8954 11 16V20C11 21.1046 11.8954 22 13 22Z" stroke="black" stroke-width="2" stroke-linecap="round"/>
</svg>
