<svg width="24" height="24" viewBox="0 0 24 24" fill="none" xmlns="http://www.w3.org/2000/svg">
<path d="M10 9C9.20435 9 8.44129 9.31607 7.87868 9.87868C7.31607 10.4413 7 11.2044 7 12C7 12.7956 7.31607 13.5587 7.87868 14.1213C8.44129 14.6839 9.20435 15 10 15M2 12H3M14 21V3M10 4V3M10 21V20M3.64001 18.36L4.34001 17.66M4.34001 6.34001L3.64001 5.64001M14 12H22M17 4L14 7M14 17L17 20M21 15L18 12L21 9" stroke="black" stroke-width="2" stroke-linecap="round" stroke-linejoin="round"/>
</svg>
