<svg width="24" height="24" viewBox="0 0 24 24" fill="none" xmlns="http://www.w3.org/2000/svg">
<path d="M5 8H4C2.89543 8 2 8.89543 2 10V19C2 20.1046 2.89543 21 4 21H20C21.1046 21 22 20.1046 22 19V10C22 8.89543 21.1046 8 20 8H19M5 8V7C5 5.89543 5.89543 5 7 5C8.10457 5 9 5.89543 9 7V8M5 8H9M9 8H15M19 8V7C19 5.89543 18.1046 5 17 5C15.8954 5 15 5.89543 15 7V8M19 8H15M16 13V15M16 15V17M16 15H14M16 15H18M6 15H9" stroke="black" stroke-width="2" stroke-linecap="round"/>
</svg>
