<svg width="215" height="43" viewBox="0 0 215 43" fill="none" xmlns="http://www.w3.org/2000/svg">
<g clip-path="url(#clip0_2700_489)">
<path d="M8.27176 15.4375H21.4195C21.5626 15.4375 21.6787 15.4875 21.7685 15.5861C21.8574 15.6852 21.9026 15.798 21.9026 15.9239V19.1657C21.9026 19.2916 21.8574 19.4048 21.7685 19.5034C21.6787 19.6025 21.5626 19.652 21.4195 19.652H12.5114V22.4616H19.9974C20.1225 22.4616 20.2345 22.5111 20.3329 22.6102C20.4308 22.7093 20.4805 22.822 20.4805 22.948V26.1898C20.4805 26.3161 20.4308 26.4284 20.3329 26.5275C20.2345 26.6266 20.1225 26.6761 19.9974 26.6761H12.5114V29.6207H21.4195C21.5626 29.6207 21.6787 29.6657 21.7685 29.7557C21.8574 29.8461 21.9026 29.963 21.9026 30.107V33.3489C21.9026 33.4934 21.8574 33.6102 21.7685 33.7002C21.6787 33.7902 21.5626 33.8352 21.4195 33.8352H8.27176C8.12864 33.8352 8.01217 33.7902 7.92278 33.7002C7.83339 33.6102 7.7887 33.4934 7.7887 33.3489V15.9239C7.7887 15.798 7.83339 15.6852 7.92278 15.5861C8.01217 15.4875 8.12864 15.4375 8.27176 15.4375Z" fill="#FCB731"/>
<path d="M32.2867 34.1057C29.2281 34.1057 26.8304 33.2594 25.0955 31.5657C23.3605 29.873 22.4933 27.5589 22.4933 24.623C22.4933 21.9212 23.4454 19.6748 25.3506 17.883C27.2557 16.0907 29.6123 15.1948 32.4208 15.1948C34.46 15.1948 36.2848 15.5912 37.8947 16.3835C38.1629 16.5276 38.2256 16.7344 38.0825 17.0048L36.553 20.2198C36.4275 20.4357 36.2311 20.4989 35.9629 20.4085C34.6564 19.7966 33.4312 19.4903 32.2867 19.4903C30.945 19.4903 29.8001 19.9762 28.8521 20.9489C27.904 21.9212 27.43 23.1466 27.43 24.623C27.43 26.1185 27.8905 27.3516 28.8119 28.3239C29.7333 29.2966 30.9003 29.783 32.3134 29.783C33.619 29.783 34.8984 29.468 36.1508 28.8376C36.4009 28.7116 36.5887 28.7657 36.7142 28.9994L38.2433 32.2685C38.3507 32.5385 38.2789 32.7371 38.0288 32.863C36.2934 33.6916 34.3797 34.1057 32.2867 34.1057Z" fill="#FCB731"/>
<path d="M81.1434 15.9239V33.3489C81.1434 33.4934 81.0937 33.6102 80.9957 33.6998C80.8973 33.7902 80.7853 33.8352 80.6603 33.8352H77.0649C76.9394 33.8352 76.8274 33.7902 76.7295 33.6998C76.631 33.6102 76.5818 33.4934 76.5818 33.3489V23.7039L73.7643 28.972C73.5855 29.2966 73.3354 29.4584 73.0131 29.4584H70.2493C69.945 29.4584 69.6949 29.2966 69.498 28.972L66.5198 23.7039V33.3489C66.5198 33.4934 66.4751 33.6102 66.3857 33.6998C66.2958 33.7902 66.1798 33.8352 66.0372 33.8352H62.4413C62.2982 33.8352 62.1817 33.7902 62.0923 33.6998C62.0029 33.6102 61.9583 33.4934 61.9583 33.3489V15.9239C61.9583 15.798 62.0029 15.6852 62.0923 15.5861C62.1817 15.4875 62.2982 15.4375 62.4413 15.4375H66.225C66.6177 15.4375 66.9044 15.5998 67.0832 15.9239L71.5377 23.9743L75.9918 15.9239C76.1701 15.5998 76.4568 15.4375 76.8505 15.4375H80.6603C80.7853 15.4375 80.8973 15.4875 80.9957 15.5861C81.0937 15.6852 81.1434 15.798 81.1434 15.9239Z" fill="#002B6F"/>
<path d="M96.0347 28.2698C96.9471 27.3334 97.4031 26.1357 97.4031 24.6766C97.4031 23.218 96.9471 22.0157 96.0347 21.0702C95.1223 20.1248 93.9593 19.6521 92.5463 19.6521C91.1332 19.6521 89.9662 20.1248 89.0452 21.0702C88.1234 22.0157 87.6633 23.218 87.6633 24.6766C87.6633 26.1357 88.1193 27.3334 89.0317 28.2698C89.9441 29.2066 91.1152 29.6748 92.5463 29.6748C93.9593 29.6748 95.1223 29.2066 96.0347 28.2698ZM102.421 24.6766C102.421 27.4866 101.459 29.7602 99.5362 31.4984C97.613 33.2362 95.2835 34.1052 92.5463 34.1052C89.8096 34.1052 87.4755 33.2275 85.5433 31.4712C83.6115 29.7152 82.6454 27.4502 82.6454 24.6766C82.6454 21.8671 83.6115 19.5843 85.5433 17.828C87.4755 16.0725 89.8096 15.1943 92.5463 15.1943C95.2654 15.1943 97.5909 16.0766 99.5231 17.8416C101.455 19.6071 102.421 21.8852 102.421 24.6766Z" fill="#002B6F"/>
<path d="M120.022 16.113L113.368 33.4302C113.243 33.7543 112.992 33.9161 112.617 33.9161H108.646C108.27 33.9161 108.019 33.7543 107.894 33.4302L101.455 16.113C101.258 15.663 101.383 15.4375 101.83 15.4375H105.828C106.239 15.4375 106.508 15.618 106.633 15.978L110.631 27.9457H110.685L114.844 15.978C114.969 15.618 115.237 15.4375 115.649 15.4375H119.647C120.04 15.4375 120.165 15.663 120.022 16.113Z" fill="#002B6F"/>
<path d="M121.659 15.4375H125.415C125.559 15.4375 125.675 15.4875 125.764 15.5861C125.853 15.6852 125.898 15.798 125.898 15.9239V33.3489C125.898 33.4934 125.853 33.6102 125.764 33.7002C125.675 33.7902 125.559 33.8352 125.415 33.8352H121.659C121.516 33.8352 121.399 33.7902 121.31 33.7002C121.22 33.6102 121.176 33.4934 121.176 33.3489V15.9239C121.176 15.798 121.22 15.6852 121.31 15.5861C121.399 15.4875 121.516 15.4375 121.659 15.4375Z" fill="#002B6F"/>
<path d="M128.071 15.4375H131.828C131.971 15.4375 132.087 15.4875 132.177 15.5861C132.266 15.6852 132.311 15.798 132.311 15.9239V29.6207H139.368C139.493 29.6207 139.605 29.6657 139.703 29.7557C139.801 29.8461 139.851 29.963 139.851 30.107V33.3489C139.851 33.4934 139.801 33.6102 139.703 33.7002C139.605 33.7902 139.493 33.8352 139.368 33.8352H128.071C127.928 33.8352 127.812 33.7902 127.722 33.7002C127.633 33.6102 127.588 33.4934 127.588 33.3489V15.9239C127.588 15.798 127.633 15.6852 127.722 15.5861C127.812 15.4875 127.928 15.4375 128.071 15.4375Z" fill="#002B6F"/>
<path d="M142.077 15.4375H145.834C145.977 15.4375 146.093 15.4875 146.183 15.5861C146.272 15.6852 146.317 15.798 146.317 15.9239V33.3489C146.317 33.4934 146.272 33.6102 146.183 33.7002C146.093 33.7902 145.977 33.8352 145.834 33.8352H142.077C141.934 33.8352 141.818 33.7902 141.728 33.7002C141.639 33.6102 141.594 33.4934 141.594 33.3489V15.9239C141.594 15.798 141.639 15.6852 141.728 15.5861C141.818 15.4875 141.934 15.4375 142.077 15.4375Z" fill="#002B6F"/>
<path d="M155.01 34.1057C152.47 34.1057 150.234 33.5385 148.302 32.4035C148.051 32.2598 147.989 32.0525 148.114 31.7821L149.644 28.5675C149.769 28.2794 149.966 28.2162 150.234 28.378C151.969 29.4589 153.543 29.9994 154.956 29.9994C155.708 29.9994 156.262 29.8644 156.62 29.5939C156.978 29.3421 157.157 28.9907 157.157 28.5403C157.157 28.108 156.964 27.7571 156.58 27.4866C156.195 27.2166 155.636 26.9648 154.903 26.7303C154.742 26.6762 154.384 26.5639 153.83 26.3926C153.275 26.2216 152.85 26.0866 152.555 25.9871C152.26 25.8885 151.893 25.7353 151.455 25.528C151.017 25.3212 150.636 25.1007 150.315 24.8662C148.937 23.8216 148.249 22.3989 148.249 20.598C148.249 18.8866 148.937 17.5448 150.315 16.5721C151.566 15.6539 153.275 15.1948 155.44 15.1948C157.657 15.1948 159.697 15.6721 161.557 16.6266C161.808 16.7707 161.87 16.978 161.745 17.2476L160.215 20.4626C160.072 20.733 159.876 20.7962 159.625 20.6516C157.979 19.7516 156.495 19.3012 155.171 19.3012C154.635 19.3012 154.187 19.3821 153.83 19.5444C153.436 19.7603 153.239 20.0398 153.239 20.3816C153.239 20.7598 153.418 21.0662 153.776 21.3003C154.133 21.5344 154.679 21.7594 155.412 21.9757C155.538 22.0116 155.923 22.1198 156.566 22.2994C157.211 22.4798 157.68 22.6239 157.975 22.7321C158.27 22.8398 158.655 23.0066 159.129 23.2321C159.602 23.4571 160.01 23.6957 160.35 23.9476C161.673 24.9566 162.335 26.3616 162.335 28.1621C162.335 29.9276 161.638 31.368 160.243 32.4848C158.901 33.5653 157.157 34.1057 155.01 34.1057Z" fill="#002B6F"/>
<path d="M163.274 15.4375H178.3C178.443 15.4375 178.559 15.4875 178.649 15.5861C178.738 15.6852 178.783 15.798 178.783 15.9239V19.1657C178.783 19.2916 178.738 19.4048 178.649 19.5034C178.559 19.6025 178.443 19.652 178.3 19.652H173.148V33.3489C173.148 33.4934 173.104 33.6102 173.014 33.7002C172.924 33.7902 172.808 33.8352 172.665 33.8352H168.909C168.766 33.8352 168.65 33.7902 168.56 33.7002C168.47 33.6102 168.426 33.4934 168.426 33.3489V19.652H163.274C163.131 19.652 163.014 19.6025 162.925 19.5034C162.836 19.4048 162.791 19.2916 162.791 19.1657V15.9239C162.791 15.798 162.836 15.6852 162.925 15.5861C163.014 15.4875 163.131 15.4375 163.274 15.4375Z" fill="#002B6F"/>
<path d="M186.43 26.7033L184.794 21.111L183.103 26.7033H186.43ZM181.95 30.5124L181.118 33.2951C181.01 33.6555 180.742 33.8355 180.313 33.8355H176.61C176.324 33.8355 176.18 33.7096 176.18 33.4574C176.18 33.4033 176.198 33.3042 176.234 33.1601L182.11 15.8428C182.218 15.5187 182.468 15.3564 182.862 15.3564H186.833C187.226 15.3564 187.477 15.5187 187.584 15.8428L193.353 33.1601C193.389 33.3042 193.407 33.4033 193.407 33.4574C193.407 33.7096 193.264 33.8355 192.977 33.8355H189.167C188.738 33.8355 188.47 33.6555 188.362 33.2951L187.557 30.5124H181.95Z" fill="#002B6F"/>
<path d="M200.464 34.1057C197.923 34.1057 195.687 33.5385 193.756 32.4035C193.505 32.2598 193.442 32.0525 193.568 31.7821L195.097 28.5675C195.222 28.2794 195.419 28.2162 195.687 28.378C197.422 29.4589 198.997 29.9994 200.41 29.9994C201.161 29.9994 201.715 29.8644 202.074 29.5939C202.431 29.3421 202.61 28.9907 202.61 28.5403C202.61 28.108 202.418 27.7571 202.033 27.4866C201.648 27.2166 201.089 26.9648 200.356 26.7303C200.195 26.6762 199.837 26.5639 199.283 26.3926C198.728 26.2216 198.304 26.0866 198.008 25.9871C197.713 25.8885 197.346 25.7353 196.909 25.528C196.47 25.3212 196.09 25.1007 195.768 24.8662C194.39 23.8216 193.702 22.3989 193.702 20.598C193.702 18.8866 194.39 17.5448 195.768 16.5721C197.02 15.6539 198.728 15.1948 200.893 15.1948C203.111 15.1948 205.15 15.6721 207.011 16.6266C207.261 16.7707 207.323 16.978 207.199 17.2476L205.669 20.4626C205.526 20.733 205.329 20.7962 205.079 20.6516C203.433 19.7516 201.948 19.3012 200.624 19.3012C200.088 19.3012 199.641 19.3821 199.283 19.5444C198.89 19.7603 198.693 20.0398 198.693 20.3816C198.693 20.7598 198.871 21.0662 199.229 21.3003C199.587 21.5344 200.132 21.7594 200.866 21.9757C200.991 22.0116 201.376 22.1198 202.02 22.2994C202.664 22.4798 203.134 22.6239 203.428 22.7321C203.724 22.8398 204.108 23.0066 204.582 23.2321C205.056 23.4571 205.463 23.6957 205.803 23.9476C207.127 24.9566 207.789 26.3616 207.789 28.1621C207.789 29.9276 207.091 31.368 205.696 32.4848C204.354 33.5653 202.61 34.1057 200.464 34.1057Z" fill="#002B6F"/>
<path d="M55.7787 18.1167L55.78 20.614L52.9323 22.5231C52.9323 22.5231 53.2993 23.4358 53.2993 24.5799C53.2993 26.0345 52.8447 27.229 51.935 28.1622C51.0253 29.0963 49.866 29.5631 48.457 29.5631C47.0299 29.5631 45.862 29.0963 44.9523 28.1622C44.0431 27.229 43.588 26.0345 43.588 24.5799C43.588 23.1254 44.0471 21.9267 44.9658 20.984C45.8841 20.0413 47.048 19.5699 48.457 19.5699C49.2059 19.5699 49.8822 19.7072 50.4903 19.9735L49.7883 21.294C49.6502 21.5545 49.7472 21.8781 50.0059 22.0176C50.1784 22.1104 50.3878 22.1004 50.5504 21.9913L54.4257 19.3926L54.4234 14.7063C54.4234 14.5095 54.3155 14.3281 54.1431 14.2354C53.8844 14.0958 53.5629 14.194 53.4243 14.4545L52.6271 15.9549C51.358 15.4063 49.9702 15.1254 48.457 15.1254C45.7284 15.1254 43.4006 16.0008 41.4747 17.7517C39.5484 19.5026 38.585 21.7785 38.585 24.5799C38.585 27.3454 39.5484 29.6035 41.4747 31.3545C43.4006 33.1049 45.7284 33.9804 48.457 33.9804C51.186 33.9804 53.5088 33.1145 55.4261 31.3813C57.3434 29.6485 58.3019 27.3813 58.3019 24.5799C58.3019 20.7213 55.7787 18.1167 55.7787 18.1167Z" fill="#FCB731"/>
</g>
<defs>
<clipPath id="clip0_2700_489">
<rect width="200" height="20" fill="white" transform="translate(7.7887 14.1719)"/>
</clipPath>
</defs>
</svg>
