{
	"$schema": "https://json.schemastore.org/jsconfig",
	"compilerOptions": {
		"moduleResolution": "node",
		"target": "esnext",
		"module": "es6",
		"lib": [
			"dom",
			"es2021",
			"esnext"
		],
		"types": ["@league-of-foundry-developers/foundry-vtt-types/index-lenient"],
		"skipLibCheck": true,
		"noImplicitAny": false,
		"noImplicitThis": true,
		"checkJs": true,
		"allowSyntheticDefaultImports": true,
		"disableReferencedProjectLoad": true,
		"experimentalDecorators": false,
		"isolatedModules": false,
		"strict": true,
		"alwaysStrict": true,
		"strictFunctionTypes": true,
		"strictBindCallApply": true,
		"strictNullChecks": true,
		"strictPropertyInitialization": false,
		"forceConsistentCasingInFileNames": true,
		"newLine": "lf"
	},
	"display": "Recommended",
	"exclude": [
		"node_modules",
		"template",
		"foundry*.js"
	],
	"typeAcquisition": {
		"enable": true,
		"include": [
			"jquery",
			"handlebars",
			"@league-of-foundry-developers/foundry-vtt-types"
		]
	}
}
