tstart	tend
8.00691244239631	8.7442396313364
15.8870967741935	16.8548387096774
20.0806451612903	20.8640552995392
34.7350230414746	35.5645161290323
38.9746543778802	39.758064516129
45.1958525345622	45.9331797235023
51.7396313364055	52.4308755760369
57.3617511520737	58.6520737327189
51.4170506912442	52.5691244239631
62.9377880184332	64.4585253456221
72.7073732718894	74.3202764976959
80.6797235023041	81.5552995391705
88.2834101382489	89.2972350230415
95.8410138248848	96.6705069124424
103.029953917051	103.8133640553
109.389400921659	110.541474654378
118.052995391705	119.389400921659
121.417050691244	122.707373271889
130.264976958525	137.592165898618
139.066820276498	140.81797235023
140.725806451613	141.463133640553
146.255760368664	147.776497695853
161.094470046083	161.831797235023
168.513824884793	170.218894009217
182.292626728111	183.951612903226
201.693548387097	202.384792626728
206.117511520737	207.453917050691
210.44930875576	213.122119815668
218.191244239631	219.389400921659
223.122119815668	223.997695852535
229.435483870968	230.633640552995
234.873271889401	235.794930875576
240.679723502304	242.338709677419
246.39400921659	247.039170506912
251.739631336406	252.523041474654
259.158986175115	259.942396313364
260.357142857143	261.278801843318
267.86866359447	269.619815668203
260.218894009217	261.370967741935
275.103686635945	275.979262672811
282.569124423963	283.444700460829
288.145161290323	288.928571428571
295.518433179724	297.177419354839
298.698156682028	300.44930875576
302.661290322581	307.13133640553
316.76267281106	319.251152073733
323.8133640553	325.103686635945
329.251152073733	330.172811059908
334.458525345622	335.564516129032
341.324884792627	342.246543778802
346.947004608295	347.86866359447
352.707373271889	353.629032258065
357.914746543779	358.836405529954
362.338709677419	363.122119815668
366.440092165899	367.361751152074
370.587557603687	371.324884792627
380.771889400922	381.877880184332
391.232718894009	391.923963133641
399.527649769585	400.633640552995
405.748847926267	406.486175115207
411.785714285714	412.707373271889
421.831797235023	422.707373271889
429.481566820276	430.218894009217
434.735023041475	435.748847926267
441.324884792627	442.154377880184
452.523041474654	453.398617511521
455.195852534562	457.269585253456
461.785714285714	462.476958525346
469.112903225806	470.311059907834
476.440092165899	477.407834101382
481.324884792627	483.767281105991
489.020737327189	490.126728110599
494.320276497696	495.65668202765
500.587557603687	501.417050691244
508.099078341014	509.481566820276
514.55069124424	515.472350230415
521.463133640553	521.877880184332
526.900921658986	527.684331797235
532.523041474654	533.352534562212
538.744239631336	539.389400921659
