onset	duration	cue_onset	trial_type	stim_onset	stim_onset2	stim_amp	resp	sdt	conf	hitrate
17.9181	0.1	16.8715	other	1.0466	1.030519	110	no	miss	sure	0
24.2405	0.1	22.1936	other	2.0469	2.006791	112.2	no	miss	sure	0
29.3929	0.1	28.0424	other	1.3505	1.310619	114.4	no	miss	maybe	0
34.5029	0.1	33.5029	other	1	0.957614	116.6	no	miss	maybe	0
NaN	NaN	39.5587	other	-1	-1	0	no	cr	sure	-1
45.8802	0.1	44.6819	other	1.1983	1.156525	118.8	no	miss	sure	0
52.1077	0.1	50.4306	other	1.6771	1.63566	121	no	miss	sure	0
57.6276	0.1	55.7362	other	1.8914	1.849961	123.2	no	miss	sure	0
62.76	0.1	60.7338	other	2.0262	1.985807	125.4	no	miss	sure	0
68.0225	0.1	66.1579	other	1.8646	1.822227	127.6	no	n/a	maybe	-1
82.8573	0.1	80.3825	other	2.4748	2.435109	138.6	no	miss	sure	0
87.9997	0.1	85.3198	other	2.6799	2.639267	140.8	no	miss	sure	0
92.6997	0.1	90.769	other	1.9307	1.891269	143	no	miss	sure	0.0909090909090909
97.1521	0.1	95.8236	other	1.3285	1.284948	145.2	no	n/a	maybe	-1
105.0845	0.1	103.572	other	1.5125	1.470944	145.2	no	miss	sure	0.0909090909090909
116.1518	0.1	114.1356	other	2.0162	1.974842	147.4	no	miss	sure	0.0909090909090909
121.3268	0.1	119.5438	other	1.783	1.742277	149.6	no	miss	sure	0.0909090909090909
125.6892	0.1	124.8062	other	0.883	0.842416	151.8	no	miss	sure	0.0909090909090909
130.9841	0.1	129.8642	other	1.1199	1.079266	154	yes	hit	maybe	0.181818181818182
135.9091	0.1	135.0387	perithr	0.8704	0.828605	151.8	no	miss	maybe	0.272727272727273
141.9865	0.1	141.038	perithr	0.9485	0.908356	154	no	miss	sure	0.272727272727273
147.8914	0.1	146.6857	perithr	1.2057	1.162556	156.2	no	miss	sure	0.363636363636364
153.1938	0.1	151.9897	perithr	1.2041	1.163018	158.4	no	miss	sure	0.363636363636364
159.0813	0.1	157.0208	perithr	2.0605	2.016797	160.6	yes	hit	maybe	0.363636363636364
170.9086	0.1	168.9899	perithr	1.9187	1.876812	158.4	yes	hit	maybe	0.272727272727273
176.3635	0.1	174.5969	perithr	1.7666	1.724285	156.2	no	miss	sure	0.272727272727273
NaN	NaN	179.9035	perithr	-1	-1	0	yes	fa	maybe	-1
186.0784	0.1	185.0088	perithr	1.0696	1.029307	158.4	yes	hit	maybe	0.272727272727273
191.6208	0.1	189.8531	perithr	1.7677	1.727287	156.2	no	miss	sure	0.363636363636364
195.8683	0.1	194.7891	perithr	1.0792	1.043383	158.4	no	miss	sure	0.363636363636364
201.3082	0.1	200.1356	perithr	1.1726	1.132248	160.6	no	miss	sure	0.363636363636364
207.4156	0.1	205.2376	perithr	2.178	2.13407	162.8	no	miss	sure	0.272727272727273
213.053	0.1	210.5574	perithr	2.4956	2.452583	165	no	miss	maybe	0.272727272727273
NaN	NaN	216.2934	other	-1	-1	0	no	cr	sure	-1
NaN	NaN	222.5507	other	-1	-1	0	yes	fa	maybe	-1
230.1453	0.1	228.0795	other	2.0658	2.025495	167.2	yes	hit	maybe	0.181818181818182
NaN	NaN	233.4381	perithr	-1	-1	0	no	cr	sure	-1
240.1602	0.1	238.5426	other	1.6176	1.577758	165	no	miss	sure	0.181818181818182
246.0001	0.1	244.799	other	1.2011	1.158982	167.2	yes	hit	maybe	0.181818181818182
252.715	0.1	251.5506	other	1.1644	1.124323	169.4	no	miss	maybe	0.181818181818182
NaN	NaN	257.6853	perithr	-1	-1	0	no	cr	maybe	-1
NaN	NaN	262.8312	perithr	-1	-1	0	yes	fa	maybe	-1
270.6673	0.1	268.8049	other	1.8624	1.817099	171.6	no	miss	maybe	0.181818181818182
276.3197	0.1	275.4306	other	0.8891	0.851473	173.8	no	miss	sure	0.181818181818182
NaN	NaN	281.0792	perithr	-1	-1	0	no	cr	sure	-1
NaN	NaN	286.1179	perithr	-1	-1	0	no	cr	sure	-1
294.0944	0.1	293.2386	other	0.8558	0.813675	176	no	miss	sure	0.0909090909090909
NaN	NaN	299.5972	perithr	-1	-1	0	no	cr	sure	-1
308.4818	0.1	307.4512	other	1.0306	0.991791	178.2	no	miss	sure	0.0909090909090909
315.2692	0.1	312.7336	other	2.5356	2.494556	180.4	no	miss	sure	0
