onset	duration	cue_onset	trial_type	stim_onset	stim_onset2	stim_amp	resp	sdt	conf	hitrate
227.08878125	0.1	224.8185625	perithr	2.27021875	2.230012	2.5	yes	hit	sure	0.636363636363636
235.201375	0.1	232.8779375	perithr	2.3234375	2.283678	2.45	no	miss	maybe	0.636363636363636
265.88665625	0.1	264.44396875	perithr	1.4426875	1.403746	2.5	no	miss	sure	0.545454545454546
272.03921875	0.1	270.07434375	perithr	1.964875	1.925704	2.55	yes	hit	sure	0.545454545454546
277.07425	0.1	274.620875	perithr	2.453375	2.414815	2.5	yes	hit	sure	0.636363636363636
NaN	NaN	279.289	perithr	-1	-1	0	no	cr	sure	-1
285.36684375	0.1	283.69753125	perithr	1.6693125	1.631078	2.45	yes	hit	sure	0.636363636363636
289.636875	0.1	288.058875	perithr	1.578	1.539891	2.4	yes	hit	sure	0.636363636363636
294.36190625	0.1	291.85253125	perithr	2.509375	2.471199	2.35	no	miss	sure	0.727272727272727
298.37696875	0.1	296.5230625	other	1.85390625	1.815362	2.4	no	miss	sure	0.818181818181818
NaN	NaN	300.6183125	other	-1	-1	0	no	cr	sure	-1
306.64953125	0.1	304.834625	other	1.81490625	1.775752	2.45	yes	hit	sure	0.818181818181818
NaN	NaN	309.0216875	other	-1	-1	0	no	cr	sure	-1
316.349625	0.1	313.79596875	other	2.55365625	2.514416	2.4	yes	hit	sure	0.818181818181818
NaN	NaN	318.06165625	other	-1	-1	0	yes	fa	sure	-1
323.0521875	0.1	321.93053125	other	1.12165625	1.084003	2.35	yes	hit	sure	0.818181818181818
328.60221875	0.1	325.83428125	perithr	2.7679375	2.727083	2.3	yes	hit	maybe	0.727272727272727
330.97228125	0.1	329.7556875	other	1.21659375	1.179283	2.25	yes	hit	sure	0.818181818181818
336.6423125	0.1	334.34790625	other	2.29440625	2.256006	2.2	yes	hit	sure	0.909090909090909
340.92234375	0.1	338.77065625	other	2.1516875	2.113673	2.15	yes	hit	sure	0.909090909090909
344.62240625	0.1	343.43625	other	1.18615625	1.145856	2.1	yes	hit	sure	0.818181818181818
349.2799375	0.1	347.619625	other	1.6603125	1.624436	2.05	no	miss	maybe	0.818181818181818
353.30496875	0.1	351.883625	other	1.42134375	1.383451	2.1	yes	hit	sure	0.818181818181818
357.2475	0.1	355.93928125	other	1.30821875	1.269114	2.05	yes	hit	sure	0.818181818181818
362.0425625	0.1	359.747125	other	2.2954375	2.254901	2	yes	hit	sure	0.818181818181818
366.35759375	0.1	364.03646875	other	2.321125	2.284425	1.95	no	miss	maybe	0.818181818181818
369.465125	0.1	368.5008125	perithr	0.9643125	0.926943	2	yes	hit	sure	0.727272727272727
NaN	NaN	372.746875	perithr	-1	-1	0	no	cr	sure	-1
NaN	NaN	379.596875	perithr	-1	-1	0	yes	fa	maybe	-1
388.8003125	0.1	387.527125	perithr	1.2731875	1.233491	1.95	yes	hit	maybe	0.727272727272727
393.94284375	0.1	391.50065625	perithr	2.4421875	2.39843	1.9	yes	hit	maybe	0.636363636363636
399.01540625	0.1	397.05578125	perithr	1.959625	1.919021	1.85	yes	hit	maybe	0.636363636363636
406.53296875	0.1	404.1680625	perithr	2.36490625	2.327025	1.8	yes	hit	maybe	0.636363636363636
412.37334375	0.1	410.77384375	perithr	1.5995	1.560526	1.75	no	miss	maybe	0.727272727272727
417.70309375	0.1	415.34096875	perithr	2.362125	2.326638	1.8	no	miss	sure	0.636363636363636
NaN	NaN	419.64471875	perithr	-1	-1	0	yes	fa	maybe	-1
429.1031875	0.1	426.94275	perithr	2.1604375	2.12104	1.85	no	miss	sure	0.636363636363636
435.19825	0.1	433.6280625	perithr	1.5701875	1.529982	1.9	yes	hit	sure	0.545454545454546
439.21071875	0.1	437.5646875	perithr	1.64603125	1.609218	1.85	yes	hit	sure	0.545454545454546
NaN	NaN	441.5818125	perithr	-1	-1	0	no	cr	maybe	-1
450.1333125	0.1	448.5578125	perithr	1.5755	1.535609	1.8	yes	hit	sure	0.454545454545455
453.8984375	0.1	452.41384375	perithr	1.48459375	1.441907	1.75	no	miss	maybe	0.545454545454546
458.6634375	0.1	456.5343125	perithr	2.129125	2.088577	1.8	yes	hit	sure	0.545454545454546
461.2135625	0.1	460.38628125	perithr	0.82728125	0.789025	1.75	no	miss	maybe	0.545454545454546
467.0085	0.1	464.32390625	perithr	2.68459375	2.645743	1.8	yes	hit	maybe	0.454545454545455
470.561125	0.1	469.4668125	perithr	1.0943125	1.057458	1.75	no	miss	maybe	0.363636363636364
474.951125	0.1	473.50465625	perithr	1.44646875	1.408156	1.8	yes	hit	maybe	0.272727272727273
479.95115625	0.1	477.75840625	perithr	2.19275	2.153801	1.75	no	miss	sure	0.272727272727273
NaN	NaN	481.8640625	perithr	-1	-1	0	no	cr	sure	-1
491.69625	0.1	489.4084375	perithr	2.2878125	2.245016	1.8	no	miss	sure	0.272727272727273
NaN	NaN	493.265125	perithr	-1	-1	0	no	cr	sure	-1
499.363875	0.1	497.7295	perithr	1.634375	1.596379	1.85	no	miss	maybe	0.272727272727273
504.063875	0.1	501.8059375	other	2.2579375	2.218276	1.9	no	miss	maybe	0.181818181818182
508.7639375	0.1	506.33625	other	2.4276875	2.389095	1.95	no	miss	sure	0.181818181818182
512.63396875	0.1	511.7615625	other	0.87240625	0.833217	2	no	miss	sure	0.181818181818182
NaN	NaN	515.5668125	perithr	-1	-1	0	no	cr	sure	-1
521.2040625	0.1	519.66328125	perithr	1.54078125	1.50155	2.05	yes	hit	maybe	0.272727272727273
525.32159375	0.1	523.81834375	perithr	1.50325	1.464794	2	no	miss	sure	0.363636363636364
NaN	NaN	530.65009375	perithr	-1	-1	0	yes	fa	maybe	-1
538.75171875	0.1	537.7375	perithr	1.01421875	0.972561	2.05	no	miss	sure	0.363636363636364
547.0218125	0.1	544.6151875	perithr	2.406625	2.364853	2.1	no	miss	sure	0.454545454545455
550.6168125	0.1	548.7930625	perithr	1.82375	1.786369	2.15	yes	hit	maybe	0.545454545454546
NaN	NaN	553.1023125	perithr	-1	-1	0	no	cr	sure	-1
561.6294375	0.1	560.29575	perithr	1.3336875	1.289379	2.1	yes	hit	sure	0.545454545454546
568.3145	0.1	566.64125	perithr	1.67325	1.630819	2.05	yes	hit	maybe	0.454545454545455
573.32453125	0.1	570.7629375	perithr	2.56159375	2.522905	2	no	miss	sure	0.545454545454546
NaN	NaN	575.26615625	perithr	-1	-1	0	no	cr	sure	-1
580.549625	0.1	579.3713125	perithr	1.1783125	1.140202	2.05	yes	hit	maybe	0.636363636363636
585.604625	0.1	583.4746875	perithr	2.1299375	2.090203	2	yes	hit	maybe	0.636363636363636
591.47471875	0.1	590.3910625	perithr	1.08365625	1.046474	1.95	no	miss	sure	0.636363636363636
