onset	duration	cue_onset	trial_type	stim_onset	stim_onset2	stim_amp	resp	sdt	conf	hitrate
7.658125	0.1	5.202375	other	2.45575	2.455779	4	no	miss	maybe	0.0909090909090909
12.988875	0.1	11.001625	other	1.98725	1.987274	4.08	no	miss	maybe	0.0909090909090909
18.779	0.1	17.007625	other	1.771375	1.771385	4.16	no	miss	maybe	0.181818181818182
25.79775	0.1	24.354875	other	1.442875	1.442874	4.24	no	miss	maybe	0.181818181818182
32.6685	0.1	31.57175	other	1.09675	1.09673	4.32	no	miss	maybe	0.181818181818182
39.7015	0.1	38.67075	other	1.03075	1.030691	4.4	no	n/a	maybe	0
55.2185	0.1	52.474125	perithr	2.744375	2.744385	4.8	yes	hit	maybe	0.272727272727273
61.648375	0.1	59.184	perithr	2.464375	2.464381	4.72	no	miss	maybe	0.272727272727273
67.732	0.1	66.822	perithr	0.91	0.910014	4.8	yes	hit	maybe	0.272727272727273
82.673125	0.1	80.048375	perithr	2.62475	2.624699	4.72	no	miss	maybe	0.363636363636364
87.643875	0.1	86.836125	perithr	0.80775	0.807812	4.8	no	miss	maybe	0.363636363636364
99.95175	0.1	97.3445	perithr	2.60725	2.607213	4.88	yes	hit	maybe	0.454545454545455
106.807375	0.1	105.933375	perithr	0.874	0.873963	4.8	no	miss	maybe	0.454545454545455
113.667875	0.1	113.420625	other	-1	-1	0	no	cr	maybe	0
122.551625	0.1	120.16975	perithr	2.381875	2.381907	4.88	no	miss	maybe	0.545454545454546
127.7715	0.1	126.092375	other	1.679125	1.679105	4.96	no	n/a	maybe	0
141.368125	0.1	140.420625	perithr	0.9475	0.9475	5.84	yes	hit	maybe	0.545454545454546
148.390625	0.1	148.143375	other	-1	-1	0	no	cr	maybe	0
154.07025	0.1	153.824375	other	-1	-1	0	no	cr	maybe	0
159.712125	0.1	158.86225	perithr	0.849875	0.849907	5.76	no	miss	maybe	0.545454545454546
167.140125	0.1	166.893125	other	-1	-1	0	no	n/a	maybe	0
181.2475	0.1	181.001	other	-1	-1	0	no	cr	maybe	0
186.7495	0.1	185.791875	other	0.957625	0.957593	0.72	no	n/a	maybe	0
211.86175	0.1	210.880625	perithr	0.981125	0.981136	7.68	yes	hit	maybe	0.636363636363636
219.87825	0.1	217.448125	perithr	2.430125	2.430121	7.6	yes	hit	maybe	0.636363636363636
225.394	0.1	222.680625	perithr	2.713375	2.713315	7.52	yes	hit	maybe	0.727272727272727
231.884125	0.1	229.5665	other	2.317625	2.317585	7.44	yes	hit	maybe	0.818181818181818
236.52325	0.1	236.277875	perithr	-1	-1	0	no	cr	maybe	0
244.262	0.1	242.059125	other	2.202875	2.202914	7.36	no	miss	maybe	0.818181818181818
251.969375	0.1	249.355	other	2.614375	2.614391	7.44	yes	hit	maybe	0.818181818181818
256.1415	0.1	254.568625	other	1.572875	1.572912	7.36	yes	hit	maybe	0.818181818181818
261.7105	0.1	260.915125	other	0.795375	0.79543	7.28	yes	hit	maybe	0.818181818181818
269.146625	0.1	266.988125	perithr	2.1585	2.158536	7.2	yes	hit	maybe	0.727272727272727
273.313	0.1	272.234125	perithr	1.078875	1.078924	7.12	yes	hit	maybe	0.636363636363636
279.35375	0.1	277.1335	perithr	2.22025	2.220301	7.04	no	miss	maybe	0.727272727272727
284.219125	0.1	283.97225	perithr	-1	-1	0	no	cr	maybe	0
291.0105	0.1	289.546	perithr	1.4645	1.464448	7.12	yes	hit	maybe	0.727272727272727
296.1105	0.1	295.0105	perithr	1.1	1.099944	7.04	yes	hit	maybe	0.636363636363636
302.788375	0.1	301.686125	perithr	1.10225	1.102257	6.96	no	miss	maybe	0.636363636363636
308.74425	0.1	307.33175	perithr	1.4125	1.412532	7.04	no	miss	maybe	0.545454545454546
314.271875	0.1	313.17025	perithr	1.101625	1.101595	7.12	yes	hit	maybe	0.545454545454546
321.501	0.1	319.67425	perithr	1.82675	1.826729	7.04	yes	hit	maybe	0.636363636363636
327.176125	0.1	326.928625	perithr	-1	-1	0	no	cr	maybe	0
333.49625	0.1	333.25075	perithr	-1	-1	0	no	cr	maybe	0
339.959375	0.1	339.105625	perithr	0.85375	0.853737	6.96	no	miss	maybe	0.636363636363636
346.461125	0.1	344.784	perithr	1.677125	1.677112	7.04	yes	hit	maybe	0.636363636363636
350.701625	0.1	349.6885	perithr	1.013125	1.013127	6.96	no	miss	maybe	0.727272727272727
357.790875	0.1	356.1515	other	1.639375	1.639418	7.04	yes	hit	maybe	0.818181818181818
361.548625	0.1	361.30175	perithr	-1	-1	0	no	cr	maybe	0
369.440875	0.1	366.716875	other	2.724	2.723983	6.96	yes	hit	maybe	0.818181818181818
374.0585	0.1	372.649375	other	1.409125	1.409148	6.88	yes	hit	maybe	0.818181818181818
379.609625	0.1	377.53775	other	2.071875	2.071837	6.8	yes	hit	maybe	0.909090909090909
385.4825	0.1	384.06525	other	1.41725	1.417241	6.72	yes	hit	maybe	0.818181818181818
389.90575	0.1	389.658875	perithr	-1	-1	0	no	cr	maybe	0
397.0725	0.1	394.797875	other	2.274625	2.274643	6.64	yes	hit	maybe	0.909090909090909
400.478375	0.1	400.2335	perithr	-1	-1	0	no	cr	maybe	0
407.608625	0.1	405.746125	other	1.8625	1.86253	6.56	yes	hit	maybe	0.909090909090909
413.1155	0.1	411.573125	other	1.542375	1.542359	6.48	yes	hit	maybe	0.909090909090909
417.88125	0.1	416.531	other	1.35025	1.350238	6.4	yes	hit	maybe	0.818181818181818
422.197375	0.1	420.87525	other	1.322125	1.322114	6.32	no	miss	maybe	0.818181818181818
428.803125	0.1	426.260625	other	2.5425	2.542468	6.4	yes	hit	maybe	0.818181818181818
433.481125	0.1	431.6895	perithr	1.791625	1.791609	6.32	yes	hit	maybe	0.727272727272727
438.9325	0.1	436.889875	perithr	2.042625	2.042571	6.24	yes	hit	maybe	0.727272727272727
442.92975	0.1	442.07	perithr	0.85975	0.859755	6.16	no	miss	maybe	0.727272727272727
450.07	0.1	447.42775	perithr	2.64225	2.642218	6.24	yes	hit	maybe	0.636363636363636
454.7095	0.1	452.8145	perithr	1.895	1.894953	6.16	yes	hit	maybe	0.727272727272727
459.31025	0.1	457.972625	perithr	1.337625	1.337667	6.08	no	miss	maybe	0.727272727272727
464.854875	0.1	464.607875	perithr	-1	-1	0	no	cr	maybe	0
470.3285	0.1	470.08325	perithr	-1	-1	0	no	cr	maybe	0
477.557375	0.1	475.091	perithr	2.466375	2.466399	6.16	yes	hit	maybe	0.636363636363636
