onset	duration	cue_onset	trial_type	stim_onset	stim_onset2	stim_amp	resp	sdt	conf	hitrate
6.2463	0.1	3.9223	perithr	2.324	2.283713	40.8	no	miss	sure	0.454545454545455
15.3115	0.1	14.2492	perithr	1.0623	1.023952	41.6	no	miss	sure	0.454545454545455
25.7312	0.1	24.0585	perithr	1.6727	1.631116	42.4	yes	hit	sure	0.545454545454546
39.9486	0.1	38.2646	perithr	1.684	1.641952	41.6	no	miss	sure	0.454545454545455
45.5259	0.1	44.0077	perithr	1.5182	1.478999	42.4	yes	hit	sure	0.545454545454546
50.9961	0.1	49.4136	perithr	1.5825	1.53948	41.6	yes	hit	sure	0.545454545454546
57.8784	0.1	55.5666	perithr	2.3118	2.272222	40.8	yes	hit	sure	0.545454545454546
65.1635	0.1	63.9941	perithr	1.1694	1.129982	40	yes	hit	sure	0.545454545454546
NaN	NaN	72.9198	perithr	-1	-1	0	no	cr	sure	-1
NaN	NaN	80.3586	perithr	-1	-1	0	no	cr	sure	-1
92.9155	0.1	90.2628	perithr	2.6527	2.613183	39.2	no	miss	sure	0.454545454545455
NaN	NaN	100.9843	other	-1	-1	0	no	cr	sure	-1
114.0382	0.1	112.822	perithr	1.2162	1.176741	40	yes	hit	sure	0.454545454545455
120.5404	0.1	118.2456	perithr	2.2948	2.256001	39.2	no	miss	sure	0.363636363636364
129.3027	0.1	127.1494	perithr	2.1533	2.111663	40	no	miss	sure	0.272727272727273
138.6602	0.1	137.7504	perithr	0.9098	0.871572	40.8	no	miss	sure	0.272727272727273
NaN	NaN	149.4308	other	-1	-1	0	no	cr	sure	-1
NaN	NaN	159.2151	other	-1	-1	0	no	cr	sure	-1
NaN	NaN	170.6722	other	-1	-1	0	no	cr	sure	-1
180.3978	0.1	179.0867	other	1.3111	1.269099	41.6	no	miss	maybe	0.181818181818182
190.0251	0.1	187.7297	other	2.2954	2.255274	42.4	no	miss	sure	0.181818181818182
206.7651	0.1	204.033	other	2.7321	2.692277	43.2	no	miss	sure	0.0909090909090909
217.5925	0.1	215.262	other	2.3305	2.28852	44	no	miss	sure	0.0909090909090909
229.0048	0.1	227.7339	other	1.2709	1.230327	44.8	yes	hit	sure	0.0909090909090909
NaN	NaN	240.0056	other	-1	-1	0	no	cr	sure	-1
248.0848	0.1	246.1252	other	1.9596	1.91818	44	no	miss	maybe	0.0909090909090909
256.5471	0.1	254.9509	other	1.5962	1.557009	44.8	no	miss	sure	0.0909090909090909
264.5721	0.1	262.2057	other	2.3664	2.325949	45.6	no	miss	sure	0.0909090909090909
272.147	0.1	271.1746	other	0.9724	0.933979	46.4	no	miss	sure	0.0909090909090909
286.7971	0.1	284.6336	other	2.1635	2.121188	47.2	no	miss	sure	0.0909090909090909
304.1393	0.1	302.5699	other	1.5694	1.528949	48	no	miss	sure	0.0909090909090909
311.9943	0.1	310.3507	other	1.6436	1.605345	48.8	no	miss	sure	0.181818181818182
320.3192	0.1	317.8128	perithr	-1	-1	-1	no	bad	maybe	-1
341.3205	0.1	340.1775	perithr	1.143	1.100873	70	no	miss	sure	0.272727272727273
NaN	NaN	346.6067	perithr	-1	-1	0	no	cr	sure	-1
354.008	0.1	352.8055	perithr	1.2025	1.163363	71.4	no	miss	sure	0.363636363636364
359.458	0.1	358.6512	perithr	0.8068	0.771038	72.8	no	miss	sure	0.363636363636364
366.118	0.1	364.6693	perithr	1.4487	1.409037	74.2	yes	hit	sure	0.454545454545455
384.0178	0.1	381.4203	perithr	2.5975	2.556121	72.8	yes	hit	sure	0.454545454545455
392.5627	0.1	390.123	perithr	2.4397	2.397062	71.4	yes	hit	sure	0.454545454545455
397.4178	0.1	395.0752	perithr	2.3426	2.300494	70	yes	hit	sure	0.545454545454546
NaN	NaN	399.9316	perithr	-1	-1	0	no	cr	sure	-1
409.8302	0.1	408.4576	perithr	1.3726	1.332563	68.6	no	miss	sure	0.636363636363636
416.3976	0.1	414.1399	perithr	2.2577	2.218669	70	yes	hit	maybe	0.727272727272727
421.5701	0.1	419.2933	perithr	2.2768	2.237388	68.6	no	miss	sure	0.727272727272727
429.5175	0.1	427.6111	perithr	1.9064	1.868368	70	no	miss	sure	0.727272727272727
NaN	NaN	436.1722	perithr	-1	-1	0	no	cr	sure	-1
445.3175	0.1	444.3252	perithr	0.9923	0.954159	71.4	yes	hit	sure	0.727272727272727
452.0173	0.1	451.0523	perithr	0.965	0.92565	70	yes	hit	sure	0.636363636363636
459.3473	0.1	458.4368	perithr	0.9105	0.870397	68.6	yes	hit	sure	0.636363636363636
465.4923	0.1	462.7149	perithr	2.7774	2.736512	67.2	yes	hit	sure	0.545454545454546
469.5447	0.1	467.7481	perithr	1.7966	1.756168	65.8	yes	hit	sure	0.545454545454546
472.8399	0.1	471.9093	perithr	0.9306	0.889814	64.4	yes	hit	sure	0.545454545454546
477.6473	0.1	475.7946	perithr	1.8527	1.81372	63	no	miss	sure	0.545454545454546
NaN	NaN	481.4358	perithr	-1	-1	0	no	cr	sure	-1
490.6572	0.1	489.7722	perithr	0.885	0.842974	64.4	no	miss	maybe	0.545454545454546
501.5195	0.1	498.9241	perithr	2.5954	2.5568	65.8	no	miss	sure	0.545454545454546
507.6722	0.1	505.693	perithr	1.9792	1.939651	67.2	no	miss	sure	0.545454545454546
NaN	NaN	511.0522	perithr	-1	-1	0	no	cr	sure	-1
520.8896	0.1	518.3082	perithr	2.5814	2.541707	68.6	no	miss	sure	0.545454545454546
529.502	0.1	528.5161	perithr	0.9859	0.947105	70	yes	hit	maybe	0.545454545454546
538.4894	0.1	537.3087	perithr	1.1807	1.140084	68.6	yes	hit	sure	0.636363636363636
545.5817	0.1	544.1998	perithr	1.3819	1.342273	67.2	yes	hit	sure	0.636363636363636
NaN	NaN	551.4526	perithr	-1	-1	0	yes	fa	sure	-1
560.7017	0.1	559.237	perithr	1.4647	1.421402	65.8	yes	hit	sure	0.727272727272727
565.4018	0.1	563.5644	other	1.8374	1.798402	64.4	yes	hit	sure	0.818181818181818
570.3416	0.1	567.9899	other	2.3517	2.307943	63	yes	hit	sure	0.909090909090909
574.0916	0.1	572.0436	other	2.048	2.00862	61.6	yes	hit	sure	0.818181818181818
NaN	NaN	576.1646	perithr	-1	-1	0	no	cr	sure	-1
583.8768	0.1	582.8695	perithr	1.0073	0.964275	60.2	no	miss	sure	0.727272727272727
NaN	NaN	591.1293	perithr	-1	-1	0	no	cr	sure	-1
601.239	0.1	600.3586	perithr	0.8804	0.839479	61.6	yes	hit	sure	0.727272727272727
NaN	NaN	607.004	perithr	-1	-1	0	yes	fa	sure	-1
614.3915	0.1	613.1796	perithr	1.2119	1.170637	60.2	yes	hit	sure	0.727272727272727
619.069	0.1	617.6693	perithr	1.3997	1.360285	58.8	yes	hit	maybe	0.727272727272727
623.7337	0.1	621.6092	perithr	2.1245	2.082605	57.4	no	miss	sure	0.727272727272727
NaN	NaN	628.0035	perithr	-1	-1	0	no	cr	sure	-1
635.4789	0.1	634.3249	perithr	1.154	1.113164	58.8	no	miss	sure	0.727272727272727
644.4162	0.1	642.1092	other	2.307	2.268334	60.2	yes	hit	sure	0.818181818181818
648.1262	0.1	646.7408	other	1.3854	1.346285	58.8	yes	hit	sure	0.818181818181818
653.5487	0.1	650.9397	perithr	2.609	2.569859	57.4	yes	hit	sure	0.727272727272727
656.8663	0.1	655.8926	perithr	0.9737	0.931338	56	yes	hit	sure	0.727272727272727
NaN	NaN	660.0281	perithr	-1	-1	0	no	cr	sure	-1
668.8811	0.1	666.6368	other	2.2443	2.204656	54.6	yes	hit	sure	0.818181818181818
674.4563	0.1	672.1818	other	2.2745	2.236331	53.2	yes	hit	sure	0.818181818181818
684.5362	0.1	683.0733	perithr	1.4629	1.418898	51.8	yes	hit	maybe	0.727272727272727
692.0014	0.1	690.7322	perithr	1.2692	1.229765	50.4	no	miss	sure	0.727272727272727
699.421	0.1	696.8448	perithr	2.5762	2.534324	51.8	yes	hit	maybe	0.636363636363636
NaN	NaN	704.061	perithr	-1	-1	0	no	cr	sure	-1
710.2959	0.1	709.244	perithr	1.0519	1.013698	50.4	yes	hit	sure	0.545454545454546
718.1108	0.1	715.9091	perithr	2.2017	2.162337	49	no	miss	sure	0.545454545454546
729.7033	0.1	728.3247	perithr	1.3786	1.339072	50.4	no	miss	sure	0.545454545454546
NaN	NaN	734.5	perithr	-1	-1	0	no	cr	sure	-1
740.9708	0.1	740.0223	perithr	0.9485	0.90606	51.8	yes	hit	sure	0.454545454545455
745.4406	0.1	744.6301	perithr	0.8105	0.76791	50.4	no	miss	sure	0.545454545454546
753.4383	0.1	751.7409	perithr	1.6974	1.657778	51.8	no	miss	sure	0.545454545454546
759.3432	0.1	757.205	perithr	2.1382	2.09504	53.2	yes	hit	sure	0.454545454545455
763.2755	0.1	761.4412	perithr	1.8343	1.792015	51.8	yes	hit	sure	0.454545454545455
767.1481	0.1	765.4796	perithr	1.6685	1.628319	50.4	no	miss	sure	0.545454545454546
NaN	NaN	772.7009	perithr	-1	-1	0	no	cr	sure	-1
779.5207	0.1	777.7953	perithr	1.7254	1.683098	51.8	yes	hit	sure	0.545454545454546
786.2804	0.1	784.2846	perithr	1.9958	1.951286	50.4	yes	hit	maybe	0.545454545454546
790.6454	0.1	789.7477	perithr	0.8977	0.853929	49	no	miss	sure	0.636363636363636
