onset	duration	cue_onset	trial_type	stim_onset	stim_onset2	stim_amp	resp	sdt	conf	hitrate
NaN	NaN	3.7548	other	-1	-1	0	no	cr	sure	-1
NaN	NaN	11.2824	other	-1	-1	0	no	cr	sure	-1
20.5706	0.1	19.5665	other	1.0041	0.965019	10	no	miss	sure	0
30.6955	0.1	28.5193	other	2.1762	2.136323	10.2	no	miss	sure	0
39.8831	0.1	37.744	other	2.1391	2.096591	10.4	no	miss	sure	0
47.9777	0.1	46.5398	other	1.4379	1.396239	10.6	no	miss	sure	0.0909090909090909
56.9527	0.1	55.6459	other	1.3068	1.266878	10.8	no	miss	sure	0.181818181818182
67.9354	0.1	65.3377	other	2.5977	2.557895	11	no	miss	sure	0.181818181818182
75.7127	0.1	73.7311	other	1.9816	1.94175	11.2	no	miss	sure	0.181818181818182
85.3378	0.1	83.7007	other	1.6371	1.595303	11.4	no	miss	sure	0.181818181818182
93.9727	0.1	91.7492	other	2.2235	2.180974	11.6	yes	hit	maybe	0.181818181818182
101.1225	0.1	99.2721	other	1.8504	1.808905	11.4	yes	hit	sure	0.181818181818182
112.4075	0.1	111.3009	other	1.1066	1.068272	11.2	no	miss	sure	0.181818181818182
123.8179	0.1	122.1157	other	1.7022	1.659747	11.4	no	miss	sure	0.181818181818182
136.4826	0.1	133.7812	perithr	2.7014	2.660405	11.6	no	miss	sure	0.272727272727273
144.0746	0.1	142.4453	perithr	1.6293	1.591226	11.8	no	miss	sure	0.272727272727273
153.5872	0.1	151.8605	other	1.7267	1.686954	12	no	miss	sure	0.181818181818182
164.5421	0.1	163.2759	other	1.2662	1.225612	12.2	no	miss	sure	0.181818181818182
NaN	NaN	171.9809	perithr	-1	-1	0	no	cr	sure	-1
182.2675	0.1	180.2931	other	1.9744	1.93335	12.4	no	miss	maybe	0.181818181818182
NaN	NaN	200.004	perithr	-1	-1	0	no	cr	sure	-1
208.4769	0.1	207.1573	perithr	1.3196	1.281505	12.6	yes	hit	sure	0.272727272727273
NaN	NaN	211.4211	perithr	-1	-1	0	no	cr	sure	-1
221.5147	0.1	220.1655	perithr	1.3492	1.306565	12.4	no	miss	sure	0.363636363636364
NaN	NaN	228.3803	other	-1	-1	0	no	cr	sure	-1
239.362	0.1	238.4384	perithr	0.9236	0.881642	12.6	no	miss	sure	0.454545454545455
250.1669	0.1	248.1613	perithr	2.0056	1.966971	12.8	yes	hit	sure	0.545454545454546
258.5516	0.1	256.2046	perithr	2.347	2.30349	12.6	no	miss	sure	0.636363636363636
NaN	NaN	264.7646	other	-1	-1	0	no	cr	sure	-1
NaN	NaN	272.9404	other	-1	-1	0	yes	fa	sure	-1
281.4638	0.1	279.51	perithr	1.9538	1.91308	12.8	yes	hit	sure	0.727272727272727
286.252	0.1	283.8325	perithr	2.4195	2.380582	12.6	yes	hit	sure	0.636363636363636
291.4719	0.1	289.2928	perithr	2.1791	2.135151	12.4	yes	hit	sure	0.727272727272727
296.4968	0.1	293.8232	other	2.6736	2.632507	12.2	yes	hit	sure	0.818181818181818
303.2368	0.1	301.1168	other	2.12	2.081145	12	yes	hit	sure	0.818181818181818
311.4063	0.1	310.1093	other	1.297	1.25506	11.8	yes	hit	sure	0.909090909090909
320.4044	0.1	319.551	other	0.8534	0.810928	11.6	no	miss	sure	0.909090909090909
331.7614	0.1	329.5747	other	2.1867	2.145079	11.8	yes	hit	sure	0.909090909090909
336.2672	0.1	334.4441	other	1.8231	1.781583	11.6	yes	hit	sure	0.909090909090909
NaN	NaN	338.7077	perithr	-1	-1	0	no	cr	sure	-1
348.2698	0.1	347.2699	other	0.9999	0.955906	11.4	yes	hit	sure	0.909090909090909
352.6863	0.1	351.8533	other	0.833	0.792126	11.2	yes	hit	sure	0.909090909090909
358.6162	0.1	356.0805	other	2.5357	2.49547	11	yes	hit	sure	0.818181818181818
365.8537	0.1	364.2529	other	1.6008	1.559456	10.8	yes	hit	sure	0.909090909090909
374.1687	0.1	373.2462	other	0.9225	0.882484	10.6	yes	hit	maybe	0.818181818181818
384.0643	0.1	382.6382	perithr	1.4261	1.386171	10.4	yes	hit	sure	0.727272727272727
389.2563	0.1	387.1284	perithr	2.1279	2.087315	10.2	yes	hit	sure	0.636363636363636
396.3511	0.1	395.1167	perithr	1.2344	1.193313	10	no	miss	maybe	0.636363636363636
405.8559	0.1	404.007	perithr	1.8489	1.80769	10.2	yes	hit	sure	0.545454545454546
410.0841	0.1	408.4465	perithr	1.6376	1.592942	10	no	miss	sure	0.454545454545455
418.0062	0.1	416.9138	perithr	1.0924	1.05368	10.2	no	miss	sure	0.454545454545455
NaN	NaN	425.2611	perithr	-1	-1	0	no	cr	maybe	-1
438.6167	0.1	436.5183	perithr	2.0984	2.055038	10.4	no	miss	sure	0.363636363636364
449.4435	0.1	447.3813	perithr	2.0622	2.022453	10.6	yes	hit	sure	0.272727272727273
455.4208	0.1	452.6995	perithr	2.7213	2.681814	10.4	no	miss	maybe	0.272727272727273
466.366	0.1	463.892	perithr	2.474	2.433264	10.6	no	miss	sure	0.272727272727273
476.9356	0.1	474.3886	perithr	2.547	2.504833	10.8	yes	hit	sure	0.363636363636364
482.9904	0.1	481.5801	perithr	1.4103	1.371692	10.6	no	miss	sure	0.454545454545455
492.9903	0.1	492.019	perithr	0.9713	0.933339	10.8	no	miss	sure	0.545454545454546
NaN	NaN	501.8694	perithr	-1	-1	0	no	cr	sure	-1
509.743	0.1	508.7726	perithr	0.9704	0.930482	11	no	miss	sure	0.545454545454546
NaN	NaN	518.4197	perithr	-1	-1	0	no	cr	sure	-1
NaN	NaN	527.7712	perithr	-1	-1	0	no	cr	sure	-1
539.2004	0.1	537.3581	perithr	1.8423	1.799635	11.2	yes	hit	sure	0.545454545454546
546.6282	0.1	544.9571	perithr	1.6711	1.627467	11	yes	hit	sure	0.545454545454546
553.7853	0.1	551.7237	perithr	2.0616	2.020471	10.8	yes	hit	sure	0.545454545454546
NaN	NaN	557.3476	perithr	-1	-1	0	no	cr	sure	-1
567.9577	0.1	566.8117	perithr	1.146	1.101863	10.6	yes	hit	sure	0.636363636363636
572.9454	0.1	571.5805	perithr	1.3649	1.324205	10.4	yes	hit	sure	0.727272727272727
580.8379	0.1	578.4117	other	2.4262	2.384567	10.2	no	miss	maybe	0.818181818181818
