tstart	tend
64.2281105990783	64.9193548387097
98.6981566820276	99.8041474654378
114.412442396313	115.241935483871
186.255760368664	191.324884792627
195.380184331797	196.624423963134
228.652073732719	229.527649769585
282.661290322581	283.352534562212
388.928571428571	389.758064516129
402.384792626728	402.891705069124
408.60599078341	410.357142857143
462.292626728111	462.753456221198
