onset	duration	cue_onset	trial_type	stim_onset	stim_onset2	stim_amp	resp	sdt	conf	hitrate
6.9384	0.1	4.8867	perithr	2.0517	2.009589	12	no	miss	sure	0.454545454545455
NaN	NaN	11.7123	perithr	-1	-1	0	no	cr	sure	-1
19.0157	0.1	16.7726	perithr	2.2431	2.205115	12.24	no	miss	sure	0.363636363636364
23.7781	0.1	21.8289	perithr	1.9492	1.909073	12.48	yes	hit	sure	0.454545454545455
28.6856	0.1	26.7251	perithr	1.9605	1.917428	12.24	no	miss	sure	0.454545454545455
32.8505	0.1	31.5722	perithr	1.2783	1.239044	12.48	yes	hit	sure	0.545454545454546
NaN	NaN	36.19	perithr	-1	-1	0	no	cr	sure	-1
43.1754	0.1	41.1661	perithr	2.0093	1.96981	12.24	yes	hit	sure	0.636363636363636
47.9504	0.1	46.0609	perithr	1.8895	1.846449	12	no	miss	sure	0.636363636363636
53.2103	0.1	51.0904	perithr	2.1199	2.077733	12.24	yes	hit	sure	0.727272727272727
NaN	NaN	55.7437	perithr	-1	-1	0	no	cr	sure	-1
61.8601	0.1	60.9058	perithr	0.9543	0.911332	12	yes	hit	sure	0.727272727272727
67.9301	0.1	65.4535	other	2.4766	2.433619	11.76	yes	hit	sure	0.818181818181818
NaN	NaN	70.4531	perithr	-1	-1	0	no	cr	sure	-1
NaN	NaN	82.2544	perithr	-1	-1	0	no	cr	sure	-1
NaN	NaN	86.7444	perithr	-1	-1	0	no	cr	sure	-1
94.3871	0.1	91.9159	perithr	2.4712	2.432149	11.52	yes	hit	sure	0.727272727272727
98.0146	0.1	96.7719	perithr	1.2427	1.203828	11.28	no	miss	sure	0.636363636363636
103.9946	0.1	101.6049	perithr	2.3897	2.350071	11.52	yes	hit	sure	0.727272727272727
NaN	NaN	106.8681	perithr	-1	-1	0	no	cr	sure	-1
112.9319	0.1	111.4209	perithr	1.511	1.471498	11.28	yes	hit	sure	0.727272727272727
118.0869	0.1	116.0707	perithr	2.0162	1.976011	11.04	yes	hit	sure	0.727272727272727
121.7693	0.1	120.8841	perithr	0.8852	0.844441	10.8	no	miss	sure	0.727272727272727
126.6992	0.1	125.4916	perithr	1.2076	1.164236	11.04	no	miss	sure	0.727272727272727
132.5042	0.1	130.5719	other	1.9323	1.891884	11.28	yes	hit	sure	0.818181818181818
137.8191	0.1	135.3013	other	2.5178	2.477137	11.04	yes	hit	sure	0.818181818181818
141.6741	0.1	139.9079	perithr	1.7662	1.725865	10.8	yes	hit	sure	0.727272727272727
147.2815	0.1	144.5167	perithr	2.7648	2.725189	10.56	yes	hit	sure	0.636363636363636
152.4439	0.1	149.6772	perithr	2.7667	2.725339	10.32	yes	hit	sure	0.727272727272727
156.6164	0.1	154.8619	perithr	1.7545	1.713944	10.08	yes	hit	sure	0.727272727272727
161.0938	0.1	160.3086	perithr	0.7852	0.746897	9.84	yes	hit	sure	0.727272727272727
NaN	NaN	165.7086	perithr	-1	-1	0	no	cr	sure	-1
178.0537	0.1	176.2678	perithr	1.7859	1.741917	9.6	no	miss	sure	0.727272727272727
207.0182	0.1	204.9111	perithr	2.1071	2.067375	9.84	no	miss	sure	0.636363636363636
211.7756	0.1	209.7393	perithr	2.0363	1.995758	10.08	yes	hit	sure	0.636363636363636
NaN	NaN	218.8365	perithr	-1	-1	0	no	cr	sure	-1
227.7454	0.1	225.1584	perithr	2.587	2.54664	9.84	no	miss	sure	0.545454545454546
NaN	NaN	230.3383	perithr	-1	-1	0	no	cr	sure	-1
237.9228	0.1	235.1732	perithr	2.7496	2.709999	10.08	yes	hit	sure	0.454545454545455
242.6153	0.1	240.2921	perithr	2.3232	2.28455	9.84	yes	hit	sure	0.363636363636364
248.5776	0.1	246.0683	perithr	2.5093	2.470897	9.6	no	miss	sure	0.454545454545455
253.1676	0.1	251.3277	perithr	1.8399	1.801292	9.84	yes	hit	sure	0.545454545454546
257.4475	0.1	256.4198	perithr	1.0277	0.987182	9.6	no	miss	sure	0.545454545454546
264.2899	0.1	261.6449	perithr	2.645	2.602322	9.84	no	miss	sure	0.636363636363636
268.0899	0.1	266.34	perithr	1.7499	1.70863	10.08	no	miss	sure	0.636363636363636
273.7023	0.1	271.1314	perithr	2.5709	2.528624	10.32	yes	hit	sure	0.545454545454546
278.4973	0.1	276.5532	perithr	1.9441	1.905168	10.08	yes	hit	sure	0.636363636363636
282.1922	0.1	281.3482	perithr	0.844	0.808155	9.84	yes	hit	sure	0.636363636363636
288.8346	0.1	286.5728	perithr	2.2618	2.222351	9.6	yes	hit	sure	0.727272727272727
292.3446	0.1	291.5234	other	0.8212	0.780704	9.36	yes	hit	sure	0.818181818181818
304.9104	0.1	303.3852	other	1.5252	1.482781	12	no	miss	sure	0.909090909090909
311.1328	0.1	309.1797	other	1.9531	1.911423	12.24	yes	hit	sure	0.909090909090909
316.6953	0.1	314.176	other	2.5193	2.479991	12	yes	hit	sure	0.818181818181818
321.4876	0.1	319.4975	other	1.9901	1.951473	11.76	yes	hit	sure	0.818181818181818
326.9801	0.1	324.6176	other	2.3625	2.322904	11.52	yes	hit	sure	0.818181818181818
331.9226	0.1	330.1684	other	1.7542	1.714418	11.28	yes	hit	sure	0.818181818181818
337.13	0.1	335.568	other	1.562	1.522696	11.04	yes	hit	sure	0.909090909090909
NaN	NaN	340.7284	perithr	-1	-1	0	no	cr	sure	-1
348.1448	0.1	345.9905	other	2.1543	2.115931	10.8	no	miss	sure	0.909090909090909
352.5148	0.1	351.2706	other	1.2442	1.203628	11.04	yes	hit	sure	0.909090909090909
358.2947	0.1	356.3132	other	1.9815	1.941954	10.8	yes	hit	sure	0.909090909090909
363.4747	0.1	361.4068	other	2.0679	2.028105	10.56	yes	hit	sure	0.909090909090909
367.9271	0.1	366.8362	other	1.0909	1.048513	10.32	yes	hit	sure	0.818181818181818
374.5095	0.1	372.1602	other	2.3493	2.309689	10.08	yes	hit	sure	0.818181818181818
379.5694	0.1	377.2166	other	2.3528	2.31306	9.84	yes	hit	sure	0.909090909090909
NaN	NaN	382.2957	perithr	-1	-1	0	no	cr	sure	-1
388.3118	0.1	387.3271	other	0.9847	0.945038	9.6	yes	hit	sure	0.818181818181818
393.9242	0.1	392.5537	other	1.3705	1.33027	9.36	yes	hit	sure	0.818181818181818
399.5816	0.1	397.7368	other	1.8448	1.80831	9.12	no	miss	sure	0.818181818181818
403.9616	0.1	402.9924	perithr	0.9692	0.928832	9.36	yes	hit	sure	0.727272727272727
NaN	NaN	408.6898	perithr	-1	-1	0	no	cr	sure	-1
415.9464	0.1	413.6628	perithr	2.2836	2.243754	9.12	yes	hit	sure	0.636363636363636
419.6764	0.1	418.7202	perithr	0.9562	0.91842	8.88	no	miss	sure	0.545454545454546
425.6163	0.1	424.3537	perithr	1.2626	1.224825	9.12	yes	hit	sure	0.454545454545455
430.6137	0.1	429.241	perithr	1.3727	1.332709	8.88	yes	hit	sure	0.363636363636364
437.0036	0.1	434.9132	perithr	2.0904	2.052465	8.64	no	miss	sure	0.454545454545455
441.046	0.1	439.8486	perithr	1.1974	1.156618	8.88	no	miss	sure	0.454545454545455
446.3286	0.1	445.0707	perithr	1.2579	1.220173	9.12	no	miss	sure	0.454545454545455
NaN	NaN	449.8789	perithr	-1	-1	0	no	cr	sure	-1
457.4409	0.1	455.1849	perithr	2.256	2.215724	9.36	no	miss	sure	0.454545454545455
NaN	NaN	459.8435	perithr	-1	-1	0	no	cr	sure	-1
465.9907	0.1	464.7945	perithr	1.1962	1.156943	9.6	no	miss	sure	0.363636363636364
470.7606	0.1	469.7524	perithr	1.0082	0.972218	9.84	yes	hit	sure	0.272727272727273
477.1055	0.1	474.9317	perithr	2.1738	2.135665	9.6	yes	hit	sure	0.363636363636364
482.668	0.1	479.9454	perithr	2.7226	2.682987	9.36	yes	hit	sure	0.454545454545455
486.9155	0.1	485.0266	perithr	1.8889	1.84922	9.12	no	miss	sure	0.545454545454546
NaN	NaN	490.1048	perithr	-1	-1	0	no	cr	sure	-1
496.3678	0.1	495.4082	perithr	0.9596	0.919859	9.36	no	miss	sure	0.545454545454546
503.1827	0.1	500.9146	perithr	2.2681	2.225444	9.6	no	miss	sure	0.545454545454546
508.0077	0.1	506.481	perithr	1.5267	1.484753	9.84	yes	hit	sure	0.545454545454546
512.7202	0.1	511.7208	perithr	0.9994	0.955793	9.6	yes	hit	sure	0.545454545454546
518.6776	0.1	517.025	perithr	1.6526	1.614936	9.36	yes	hit	sure	0.545454545454546
524.8124	0.1	522.4869	perithr	2.3255	2.289106	9.12	no	miss	sure	0.636363636363636
NaN	NaN	527.3692	perithr	-1	-1	0	no	cr	sure	-1
NaN	NaN	532.9535	perithr	-1	-1	0	no	cr	sure	-1
539.7723	0.1	538.2549	perithr	1.5174	1.477033	9.36	no	miss	sure	0.636363636363636
NaN	NaN	543.6634	perithr	-1	-1	0	no	cr	sure	-1
550.6071	0.1	549.0086	perithr	1.5985	1.556064	9.6	yes	hit	sure	0.636363636363636
557.0045	0.1	554.2905	perithr	2.714	2.675054	9.36	yes	hit	sure	0.636363636363636
NaN	NaN	559.5511	perithr	-1	-1	0	no	cr	sure	-1
