onset	duration	cue_onset	trial_type	stim_onset	stim_onset2	stim_amp	resp	sdt	conf	hitrate
7.1704	0.1	5.1408	other	0.0397	1.989899	1.9	yes	hit	sure	1
NaN	NaN	10.5037	other	-1	-1	0	yes	fa	sure	-1
19.4904	0.1	17.6813	other	0.0379	1.771221	1.862	yes	hit	sure	1
24.4981	0.1	23.4332	other	0.036	1.028948	1.824	yes	hit	sure	1
NaN	NaN	30.1862	other	-1	-1	0	yes	fa	sure	-1
37.0632	0.1	36.1969	other	0.0366	0.829694	1.786	yes	hit	sure	1
45.2005	0.1	42.702	other	0.0365	2.462009	1.748	yes	hit	sure	1
50.748	0.1	49.801	other	0.0384	0.908567	1.71	yes	hit	maybe	1
62.5052	0.1	59.8449	other	0.0364	2.623858	1.672	yes	hit	sure	1
66.8829	0.1	66.0408	other	0.0358	0.80625	1.634	yes	hit	sure	0.909090909090909
75.2955	0.1	72.6488	other	0.0375	2.609248	1.596	yes	hit	sure	0.818181818181818
79.632	0.1	78.4414	other	0.0342	1.156401	1.558	yes	hit	sure	0.818181818181818
86.7723	0.1	85.8664	perithr	0.0355	0.870421	1.52	yes	hit	maybe	0.727272727272727
95.4753	0.1	93.7136	perithr	0.0369	1.724832	1.482	yes	hit	maybe	0.636363636363636
NaN	NaN	102.5807	perithr	-1	-1	0	yes	fa	maybe	-1
110.9774	0.1	109.3629	perithr	0.0368	1.57765	1.444	no	miss	maybe	0.545454545454546
122.0412	0.1	120.1846	perithr	0.0355	1.821085	1.482	no	miss	sure	0.454545454545455
NaN	NaN	127.1889	perithr	-1	-1	0	yes	fa	sure	-1
134.7011	0.1	133.6267	perithr	0.0354	1.039011	1.52	yes	hit	sure	0.454545454545455
141.6164	0.1	140.4179	perithr	0.0368	1.161703	1.482	no	miss	sure	0.454545454545455
150.5838	0.1	149.6969	perithr	0.0371	0.849821	1.52	no	miss	sure	0.454545454545455
158.5588	0.1	156.3845	perithr	0.0376	2.136672	1.558	no	miss	maybe	0.454545454545455
164.6338	0.1	163.4408	perithr	0.0363	1.156715	1.596	no	miss	maybe	0.545454545454546
172.594	0.1	171.5998	perithr	0.0364	0.957823	1.634	yes	hit	sure	0.636363636363636
179.7388	0.1	178.232	perithr	0.0359	1.470851	1.596	yes	hit	sure	0.545454545454546
187.2886	0.1	184.5385	perithr	0.0364	2.71368	1.558	yes	hit	sure	0.636363636363636
194.0033	0.1	191.6499	perithr	0.0364	2.316952	1.52	yes	hit	sure	0.636363636363636
200.2657	0.1	198.2017	perithr	0.0368	2.027154	1.482	yes	hit	maybe	0.636363636363636
208.411	0.1	206.1704	perithr	0.0382	2.202351	1.444	yes	hit	maybe	0.727272727272727
NaN	NaN	212.235	perithr	-1	-1	0	yes	fa	maybe	-1
221.9011	0.1	219.2503	perithr	0.0372	2.613641	1.406	no	miss	sure	0.636363636363636
226.611	0.1	225.2653	perithr	0.0366	1.309064	1.444	no	n/a	maybe	-1
NaN	NaN	256.4162	other	-1	-1	0	yes	fa	sure	-1
266.0052	0.1	264.8431	perithr	0.0366	1.125469	1.292	yes	hit	maybe	0.545454545454546
273.0756	0.1	272.1931	perithr	0.037	0.845511	1.254	no	miss	sure	0.545454545454546
278.938	0.1	277.8233	perithr	0.0365	1.078201	1.292	no	miss	sure	0.454545454545455
NaN	NaN	283.4413	other	-1	-1	0	yes	fa	sure	-1
291.3082	0.1	289.0512	perithr	0.0373	2.219725	1.33	yes	hit	sure	0.363636363636364
296.3228	0.1	294.5626	perithr	0.0359	1.724296	1.292	no	miss	maybe	0.363636363636364
