onset	duration	cue_onset	trial_type	stim_onset	stim_onset2	stim_amp	resp	sdt	conf	hitrate
7.790125	0.1	5.574625	other	2.2155	2.173161	10	yes	hit	maybe	0.818181818181818
13.865125	0.1	12.897375	other	0.96775	0.92915	9.8	no	miss	maybe	0.818181818181818
19.897625	0.1	18.33675	other	1.560875	1.519488	10	yes	hit	maybe	0.818181818181818
27.695125	0.1	25.4675	other	2.227625	2.189038	9.8	yes	hit	maybe	0.818181818181818
32.36025	0.1	31.562375	other	0.797875	0.759378	9.6	yes	hit	maybe	0.909090909090909
39.09775	0.1	37.109125	other	1.988625	1.951127	9.4	yes	hit	sure	0.909090909090909
NaN	NaN	42.45075	other	-1	-1	0	no	cr	sure	-1
50.82775	0.1	49.973	other	0.85475	0.818018	9.2	yes	hit	sure	0.909090909090909
57.39275	0.1	55.077375	other	2.315375	2.277182	9	yes	hit	sure	1
62.83775	0.1	61.11025	other	1.7275	1.688373	8.8	yes	hit	sure	1
68.04775	0.1	66.3615	other	1.68625	1.646392	8.6	yes	hit	maybe	1
74.770375	0.1	72.7565	other	2.013875	1.976286	8.4	yes	hit	sure	1
80.777875	0.1	78.640125	other	2.13775	2.09947	8.2	yes	hit	sure	0.909090909090909
86.627875	0.1	84.473375	other	2.1545	2.11403	8	yes	hit	maybe	0.909090909090909
91.652875	0.1	90.291875	other	1.361	1.321579	7.8	yes	hit	maybe	0.909090909090909
NaN	NaN	96.2615	perithr	-1	-1	0	no	cr	sure	-1
105.035375	0.1	103.036375	other	1.999	1.962447	7.6	yes	hit	maybe	0.818181818181818
NaN	NaN	109.150625	perithr	-1	-1	0	no	cr	maybe	-1
116.7305	0.1	115.471125	perithr	1.259375	1.219788	7.4	yes	hit	sure	0.727272727272727
122.4905	0.1	121.165875	perithr	1.324625	1.285906	7.2	no	miss	sure	0.636363636363636
129.1105	0.1	127.036375	perithr	2.074125	2.035739	7.4	yes	hit	maybe	0.545454545454546
134.443	0.1	132.733	perithr	1.71	1.670276	7.2	yes	hit	maybe	0.454545454545455
140.9805	0.1	139.68075	perithr	1.29975	1.258666	7	no	miss	sure	0.363636363636364
146.4855	0.1	144.997875	perithr	1.487625	1.44808	7.2	no	miss	sure	0.363636363636364
153.363125	0.1	152.19375	perithr	1.169375	1.130806	7.4	no	miss	sure	0.272727272727273
161.438125	0.1	159.29175	perithr	2.146375	2.104425	7.6	no	miss	sure	0.363636363636364
166.345625	0.1	164.725375	perithr	1.62025	1.580183	7.8	no	miss	sure	0.272727272727273
174.733125	0.1	172.1165	other	2.616625	2.579592	8	no	miss	sure	0.181818181818182
179.793125	0.1	178.767875	other	1.02525	0.984578	8.2	yes	hit	maybe	0.181818181818182
187.223125	0.1	185.11025	other	2.112875	2.072607	8	no	miss	sure	0.181818181818182
192.18325	0.1	190.979625	other	1.203625	1.16498	8.2	yes	hit	maybe	0.181818181818182
203.93075	0.1	202.051125	other	1.879625	1.841059	8	no	miss	sure	0.181818181818182
207.20325	0.1	206.414625	other	0.788625	0.749141	8.2	no	miss	sure	0.181818181818182
NaN	NaN	211.02275	other	-1	-1	0	no	cr	sure	-1
219.02825	0.1	217.0265	other	2.00175	1.961911	8.4	no	miss	sure	0.181818181818182
225.09325	0.1	222.474	other	2.61925	2.582335	8.6	no	miss	sure	0.0909090909090909
NaN	NaN	235.34925	other	-1	-1	0	no	cr	sure	-1
242.245875	0.1	240.5165	other	1.729375	1.692549	8.8	no	miss	sure	0.0909090909090909
247.233375	0.1	246.139125	other	1.09425	1.052582	9	no	miss	sure	0
NaN	NaN	254.308875	perithr	-1	-1	0	no	cr	sure	-1
NaN	NaN	259.24575	perithr	-1	-1	0	no	cr	sure	-1
NaN	NaN	266.9105	perithr	-1	-1	0	no	cr	sure	-1
273.9535	0.1	272.788125	other	1.165375	1.12632	9.2	no	miss	sure	0
280.1435	0.1	278.439125	other	1.704375	1.668739	9.4	no	miss	sure	0.0909090909090909
NaN	NaN	283.4155	other	-1	-1	0	no	cr	sure	-1
NaN	NaN	289.00125	other	-1	-1	0	no	cr	sure	-1
NaN	NaN	294.676875	other	-1	-1	0	no	cr	sure	-1
302.5235	0.1	300.257375	other	2.266125	2.224647	9.6	no	miss	sure	0.181818181818182
307.3985	0.1	305.34275	perithr	2.05575	2.019261	9.8	no	miss	sure	0.272727272727273
313.621125	0.1	311.98425	perithr	1.636875	1.598553	10	no	miss	sure	0.363636363636364
320.343625	0.1	319.202625	perithr	1.141	1.098736	10.2	no	miss	sure	0.454545454545455
327.791125	0.1	325.113125	perithr	2.678	2.636513	10.4	yes	hit	maybe	0.545454545454546
NaN	NaN	331.866	perithr	-1	-1	0	no	cr	sure	-1
339.973625	0.1	337.8945	perithr	2.079125	2.042444	10.2	yes	hit	maybe	0.636363636363636
345.311125	0.1	344.03975	perithr	1.271375	1.232359	10	yes	hit	sure	0.727272727272727
350.913625	0.1	348.975125	other	1.9385	1.899901	9.8	yes	hit	sure	0.818181818181818
356.27625	0.1	353.82525	other	2.451	2.411808	9.6	yes	hit	sure	0.909090909090909
360.51375	0.1	358.87975	other	1.634	1.595757	9.4	yes	hit	sure	1
366.03125	0.1	363.921	other	2.11025	2.07176	9.2	yes	hit	sure	0.909090909090909
371.21375	0.1	368.88275	other	2.331	2.288924	9	yes	hit	sure	0.909090909090909
376.76125	0.1	374.807875	other	1.953375	1.910368	8.8	yes	hit	sure	0.818181818181818
383.00625	0.1	380.537	other	2.46925	2.431103	8.6	yes	hit	sure	0.818181818181818
388.03625	0.1	386.329	other	1.70725	1.665962	8.4	yes	hit	maybe	0.818181818181818
400.028875	0.1	398.559625	other	1.46925	1.430472	8.2	no	miss	sure	0.818181818181818
NaN	NaN	405.0665	perithr	-1	-1	0	no	cr	sure	-1
413.211375	0.1	410.882875	other	2.3285	2.287124	8.4	yes	hit	maybe	0.818181818181818
418.373875	0.1	416.94175	perithr	1.432125	1.392462	8.2	no	miss	sure	0.727272727272727
NaN	NaN	423.40175	perithr	-1	-1	0	no	cr	sure	-1
430.893875	0.1	428.537375	perithr	2.3565	2.316675	8.4	yes	hit	sure	0.727272727272727
436.154	0.1	433.805	perithr	2.349	2.307601	8.2	yes	hit	sure	0.636363636363636
