onset	duration	cue_onset	trial_type	stim_onset	stim_onset2	stim_amp	resp	sdt	conf	hitrate
6.2038	0.1	5.2357	other	0.9681	0.926735	2.55	no	miss	sure	0
13.0937	0.1	11.4097	other	1.684	1.642806	2.6	no	miss	sure	0
NaN	NaN	18.1639	other	-1	-1	0	no	cr	sure	-1
26.3614	0.1	24.847	other	1.5144	1.475079	2.65	no	n/a	maybe	-1
36.1674	0.1	33.8559	other	2.3115	2.272213	3.05	no	n/a	maybe	-1
NaN	NaN	58.081	other	-1	-1	0	no	cr	sure	-1
NaN	NaN	64.3278	other	-1	-1	0	no	cr	sure	-1
72.9719	0.1	70.7441	other	2.2278	2.188563	3.65	no	miss	sure	0.0909090909090909
79.7743	0.1	77.702	other	2.0723	2.036413	3.7	no	n/a	maybe	-1
100.5743	0.1	97.9211	other	2.6532	2.612191	3.75	no	miss	sure	0.181818181818182
NaN	NaN	120.2874	other	-1	-1	0	no	cr	sure	-1
128.1516	0.1	126.4661	other	1.6855	1.64687	3.8	no	bad-miss	sure	-1
133.8617	0.1	132.0324	perithr	1.8293	1.790698	3.85	no	miss	sure	0.272727272727273
139.5718	0.1	137.5591	perithr	2.0127	1.972517	3.9	no	miss	sure	0.363636363636364
145.9267	0.1	143.775	perithr	2.1517	1.9899	7	no	miss	sure	0.454545454545455
166.4452	0.1	164.4123	other	2.0329	0	7	no	n/a	sure	-1
189.1625	0.1	187.3506	perithr	1.8119	1.771251	7.14	yes	hit	sure	0.545454545454546
198.0301	0.1	196.9589	perithr	1.0712	1.030001	7	yes	hit	sure	0.636363636363636
NaN	NaN	202.7938	other	-1	-1	0	no	cr	sure	-1
210.0224	0.1	209.1517	perithr	0.8707	0.831147	6.86	yes	hit	sure	0.727272727272727
217.6474	0.1	215.1451	perithr	2.5023	2.462841	6.72	yes	hit	sure	0.727272727272727
221.9499	0.1	220.999	perithr	0.9509	0.910242	6.58	yes	hit	sure	0.727272727272727
229.1399	0.1	226.4784	perithr	2.6615	2.621659	6.44	yes	hit	sure	0.727272727272727
233.0924	0.1	232.2477	perithr	0.8447	0.806388	6.3	yes	hit	sure	0.636363636363636
240.2623	0.1	237.615	other	2.6473	2.606766	6.16	no	n/a	maybe	-1
253.8991	0.1	252.7009	other	1.1982	1.157749	5.46	yes	hit 	sure	-1
259.3392	0.1	258.4267	perithr	0.9125	0.871943	5.32	yes	hit	sure	0.636363636363636
267.6667	0.1	265.9023	other	1.7644	1.725322	5.18	no	n/a	maybe	-1
278.5165	0.1	276.7971	perithr	1.7194	1.678472	3.5	no	miss	sure	0.636363636363636
NaN	NaN	283.5127	other	-1	-1	0	no	cr	sure	-1
292.064	0.1	290.4471	perithr	1.6169	1.578677	3.64	no	miss	sure	0.545454545454546
299.0414	0.1	297.1776	perithr	1.8638	1.821148	3.78	no	miss	sure	0.454545454545455
NaN	NaN	303.3113	other	-1	-1	0	no	cr	sure	-1
310.1838	0.1	309.1044	perithr	1.0794	1.037978	3.92	no	miss	maybe	0.363636363636364
317.4689	0.1	316.2669	perithr	1.202	1.161449	4.06	yes	hit	sure	0.272727272727273
322.7362	0.1	321.8515	other	0.8847	0.849275	3.92	yes	hit	sure	0.181818181818182
329.6914	0.1	327.52	other	2.1714	2.134199	3.78	no	miss	sure	0.181818181818182
334.7389	0.1	333.5414	perithr	1.1975	1.157523	3.92	no	miss	sure	0.272727272727273
340.1188	0.1	339.1219	perithr	0.9969	0.957292	4.06	no	miss	sure	0.363636363636364
