tstart	tend
146.762195121951	147.323170731707
227.542682926829	227.884146341463
228.957317073171	229.225609756098
234.713414634146	235.420731707317
240.859756097561	241.884146341463
247.835365853659	248.932926829268
253.810975609756	254.274390243902
260.006097560976	260.34756097561
265.932926829268	266.518292682927
271.469512195122	271.786585365854
276.371951219512	276.737804878049
282.176829268293	283.493902439024
288.591463414634	288.932926829268
294.15243902439	294.469512195122
300.859756097561	301.079268292683
305.908536585366	307.006097560976
312.030487804878	312.396341463415
317.932926829268	318.981707317073
324.518292682927	326.103658536585
332.128048780488	332.664634146341
338.34756097561	338.737804878049
348.884146341463	349.34756097561
354.469512195122	354.859756097561
360.591463414634	360.762195121951
366.05487804878	366.396341463415
371.786585365854	372.030487804878
376.908536585366	377.176829268293
382.05487804878	383.079268292683
388.810975609756	389.323170731707
394.103658536585	394.640243902439
404.835365853659	405.201219512195
410.810975609756	411.079268292683
415.689024390244	416.05487804878
420.274390243902	420.664634146341
425.274390243902	425.786585365854
431.15243902439	431.34756097561
436.103658536585	436.396341463415
441.225609756098	441.542682926829
446.640243902439	447.079268292683
457.030487804878	457.34756097561
462.640243902439	463.05487804878
469.298780487805	469.810975609756
474.493902439024	474.835365853659
479.591463414634	479.835365853659
486.664634146341	487.176829268293
