tstart	tend
24.7134146341463	24.859756097561
33.2987804878049	33.4207317073171
80.2743902439024	80.6158536585366
84.2743902439024	84.6890243902439
87.640243902439	88.1524390243902
92.1524390243902	92.469512195122
95.3231707317073	95.5670731707317
102.810975609756	103.103658536585
112.591463414634	112.932926829268
126.05487804878	126.493902439024
128.396341463415	128.835365853659
132.493902439024	133.128048780488
136.591463414634	137.323170731707
139.103658536585	139.908536585366
144.567073170732	144.762195121951
148.762195121951	149.079268292683
152.713414634146	153.323170731707
156.371951219512	156.884146341463
163.615853658537	164.323170731707
169.859756097561	170.420731707317
177.689024390244	178.25
181.664634146341	182.176829268293
188.493902439024	189.103658536585
202.103658536585	202.615853658537
208.030487804878	209.006097560976
211.859756097561	212.128048780488
214.713414634146	215.006097560976
221.201219512195	222.298780487805
251.615853658537	252.05487804878
257.835365853659	258.34756097561
267.420731707317	268.079268292683
272.420731707317	273.05487804878
276.932926829268	277.371951219512
308.176829268293	308.713414634146
323.34756097561	323.810975609756
329.640243902439	330.05487804878
336.908536585366	338.225609756098
364.518292682927	364.932926829268
371.908536585366	372.396341463415
377.981707317073	378.567073170732
384.591463414634	385.006097560976
390.835365853659	391.371951219512
413.615853658537	414.103658536585
423.15243902439	423.957317073171
427.128048780488	427.689024390244
430.493902439024	431.030487804878
436.05487804878	436.689024390244
440.932926829268	441.323170731707
444.34756097561	444.884146341463
448.05487804878	448.44512195122
452.25	452.835365853659
453.835365853659	454.15243902439
455.493902439024	456.030487804878
460.615853658537	461.103658536585
464.201219512195	464.737804878049
468.542682926829	469.030487804878
