-a) int t[3][4];
-b) 3
-c) 4
-d) 3*4 = 12
-e) int t [1][0]; t[1][1]; t[1][2];
-f)  int t[0][2]; t[1][2]; t[2] [2];
-g) int t[0][1] = { 0 };
-h) int t[3][4] = { { 0 },{ 0, },{ 0, } };
-i)
for (int i = 0; i < 3; i++)  {
    for (int j = 0; j < 4; j++)
    t [i][j] = 0;
}

-j)
for (int i = 0; i < 3; i) {
    for int j = 0; j < 4; j)
    cin >>  t[i][j] ;
}

-k)
 min = t[0][0];
 for (int i = 0; i < 3; i++)  {
    for (int j = 0; j < 4; j++) {
        if (min > t[i][j]){
            min = t[i][j];
        }
    }
 }

-l)
for (int i = 0; i < 4; i++) {
    cout <<   t[0][i] ;
}
-m)
 int total = 0;
 for( int i = 0; i < 3; i++ ) {
       total +=  t[i][3] ;
 }

-n)
std::cout << "\t" << "0\t" << "1\t" << "2\t" << "3\n" << std::endl;
for (int i = 0; i < 3; i++) {
    std::cout << i << "\t";
    for (int j = 0; j < 4; j++)
    std::cout << t[i][j] << "\t";
    std::cout <<"\n"<< std::endl;
}
