{
  "CN": "system:kube-proxy",
  "key": {
    "algo": "rsa",
    "size": 2048
  },
  "names": [
    {
      "C": "US",
      "L": "Marina del Rey",
      "ST": "CA",
      "O": "system:node-proxier",
      "OU": "k8s"
    }
  ]
}
