{
  "CN": "mergetb",
  "key": {
    "algo": "rsa",
    "size": 2048
  },
  "names": [
    {
      "C": "US",
      "L": "Marina del Rey",
      "ST": "CA",
      "O": "mergetb",
      "OU": "login"
    }
  ]
}
