{
  "signing": {
    "default": {
      "expiry": "{{expiry}}h"
    },
    "profiles": {
      "mergetb": {
        "usages": ["signing", "key encipherment", "server auth", "client auth"],
        "expiry": "{{expiry}}h"
      }
    }
  }
}
