<?xml version="1.0" encoding="UTF-8" standalone="no"?>
<svg
   xmlns:dc="http://purl.org/dc/elements/1.1/"
   xmlns:cc="http://creativecommons.org/ns#"
   xmlns:rdf="http://www.w3.org/1999/02/22-rdf-syntax-ns#"
   xmlns:svg="http://www.w3.org/2000/svg"
   xmlns="http://www.w3.org/2000/svg"
   xmlns:sodipodi="http://sodipodi.sourceforge.net/DTD/sodipodi-0.dtd"
   xmlns:inkscape="http://www.inkscape.org/namespaces/inkscape"
   viewBox="0 0 300 70.275773"
   version="1.1"
   id="svg3801"
   sodipodi:docname="openCN_logo_resized_1.svg"
   inkscape:version="0.92.4 (5da689c313, 2019-01-14)"
   width="300"
   height="70.275772">
  <metadata
     id="metadata3805">
    <rdf:RDF>
      <cc:Work
         rdf:about="">
        <dc:format>image/svg+xml</dc:format>
        <dc:type
           rdf:resource="http://purl.org/dc/dcmitype/StillImage" />
        <dc:title>Fichier 4</dc:title>
      </cc:Work>
    </rdf:RDF>
  </metadata>
  <sodipodi:namedview
     pagecolor="#ffffff"
     bordercolor="#666666"
     borderopacity="1"
     objecttolerance="10"
     gridtolerance="10"
     guidetolerance="10"
     inkscape:pageopacity="0"
     inkscape:pageshadow="2"
     inkscape:window-width="3840"
     inkscape:window-height="1961"
     id="namedview3803"
     showgrid="false"
     inkscape:zoom="2.8284271"
     inkscape:cx="269.69583"
     inkscape:cy="156.53474"
     inkscape:window-x="0"
     inkscape:window-y="57"
     inkscape:window-maximized="1"
     inkscape:current-layer="svg3801" />
  <defs
     id="defs3781">
    <style
       id="style3779">.cls-1{fill:#899a9c;}</style>
  </defs>
  <title
     id="title3783">Fichier 4</title>
  <g
     id="Calque_2"
     data-name="Calque 2"
     transform="matrix(0.4540295,0,0,0.4540295,8.8117081e-6,0.00106348)"
     style="display:inline"
     inkscape:label="Calque">
    <g
       id="Calque_1-2"
       data-name="Calque 1">
      <path
         class="cls-1"
         d="m 546.51,12.5 c -32.17,13.85 -43,9.65 -59.76,-1.7 -39.37,-26.66 -80.62,4.42 -80.62,4.42 -23.24,-1.15 -38.52,6.32 -38.52,6.32 30.46,3.33 80.81,32 92.22,37.86 1.3,0.67 -8.1,-8.2 -20.68,-14.59 0,0 15.87,-22.65 57.94,17.52 l 0.17,0.17 c 5.47,0 10.94,0 16.4,-0.15 3.56,-0.06 48.57,-52.65 123.64,-43.65 0,0 -54.66,16.29 -76.43,36.84 45.9,-32 99.88,-31.9 99.88,-31.9 C 638.1,-1.32 568.69,3 546.51,12.5 Z m -111.76,3.27 c 0,0 6.82,-3.36 11.86,-3.36 5.04,0 5.71,3.37 5.71,3.37 0,0 -7.48,6.22 -17.57,-0.01 z"
         id="path3785"
         inkscape:connector-curvature="0"
         style="fill:#899a9c" />
      <path
         class="cls-1"
         d="M 3.76,130.68 A 42.07,42.07 0 0 1 2.34,99.46 38.88,38.88 0 0 1 9.34,87.09 39.37,39.37 0 0 1 22.45,76.55 40.57,40.57 0 0 1 38.29,72.39 h 0.23 a 2,2 0 0 1 1.54,0.69 3,3 0 0 1 0.74,1.71 v 9.91 c 0,1.44 -0.8,2.24 -2.4,2.39 a 26.1,26.1 0 0 0 -9.8,2.91 24,24 0 0 0 -7.86,6.55 26.51,26.51 0 0 0 -3.76,28 25.47,25.47 0 0 0 6.84,9.06 26.2,26.2 0 0 0 27.8,3.76 24,24 0 0 0 8.89,-6.95 25.5,25.5 0 0 0 4.62,-8 26.94,26.94 0 0 0 1.54,-8.94 26.31,26.31 0 0 0 -2.85,-12.08 4.93,4.93 0 0 1 -0.57,-2.28 3.34,3.34 0 0 1 1.36,-2.62 q 0.92,-0.57 3.54,-2.4 c 1.74,-1.21 2.85,-2 3.3,-2.27 a 3.27,3.27 0 0 1 1.71,-0.57 2.94,2.94 0 0 1 2.74,1.71 40.92,40.92 0 0 1 5.47,20.62 41.52,41.52 0 0 1 -2.4,14 39.82,39.82 0 0 1 -7.06,12.37 36.77,36.77 0 0 1 -14,11 41.67,41.67 0 0 1 -17.49,3.82 40.39,40.39 0 0 1 -13.91,-2.45 36.65,36.65 0 0 1 -12,-7.12 40.72,40.72 0 0 1 -10.75,-14.53 z"
         id="path3787"
         inkscape:connector-curvature="0"
         style="fill:#899a9c" />
      <path
         class="cls-1"
         d="m 97.26,152.79 a 2,2 0 0 1 -0.63,-1.42 V 75.81 a 1.9,1.9 0 0 1 0.63,-1.48 2.06,2.06 0 0 1 1.43,-0.57 h 26.55 a 25.19,25.19 0 1 1 0,50.37 h -11.4 a 3.72,3.72 0 0 0 -2.11,0.51 2,2 0 0 0 -0.74,1.77 v 25 a 2.06,2.06 0 0 1 -0.57,1.42 1.9,1.9 0 0 1 -1.48,0.63 H 98.69 a 2,2 0 0 1 -1.43,-0.67 z m 28,-43.25 a 10.29,10.29 0 0 0 7.46,-3.07 10.16,10.16 0 0 0 3.12,-7.47 10,10 0 0 0 -3.14,-7.41 10.3,10.3 0 0 0 -7.46,-3.08 h -11.51 c -1.83,0 -2.74,0.76 -2.74,2.28 v 18.8 z"
         id="path3789"
         inkscape:connector-curvature="0"
         style="fill:#899a9c" />
      <path
         class="cls-1"
         d="m 168,152.45 a 2,2 0 0 1 -0.63,-1.43 V 75.93 a 1.93,1.93 0 0 1 0.63,-1.49 2.1,2.1 0 0 1 1.42,-0.57 h 51.06 a 2,2 0 0 1 2.05,2.06 v 9.57 a 2,2 0 0 1 -0.57,1.42 1.91,1.91 0 0 1 -1.48,0.63 H 183.7 a 2.08,2.08 0 0 0 -1.43,0.57 1.89,1.89 0 0 0 -0.62,1.48 v 17.09 a 1.85,1.85 0 0 0 0.45,1.43 3.73,3.73 0 0 0 2.17,0.4 h 28.49 a 2,2 0 0 1 1.36,0.51 1.68,1.68 0 0 1 0.57,1.31 V 120 a 1.68,1.68 0 0 1 -0.57,1.31 2,2 0 0 1 -1.36,0.51 h -28.61 a 2.15,2.15 0 0 0 -2,0.85 3.44,3.44 0 0 0 -0.51,1.77 v 12.08 a 3,3 0 0 0 0.62,1.94 3.19,3.19 0 0 0 2.57,0.8 h 36.47 a 2,2 0 0 1 1.43,0.62 2.12,2.12 0 0 1 0.62,1.54 V 151 a 2.1,2.1 0 0 1 -0.56,1.43 1.93,1.93 0 0 1 -1.49,0.63 H 169.45 A 2,2 0 0 1 168,152.45 Z"
         id="path3791"
         inkscape:connector-curvature="0"
         style="fill:#899a9c" />
      <path
         class="cls-1"
         d="m 241.19,152.73 a 1.43,1.43 0 0 1 -0.52,-1.14 V 75.36 a 1.43,1.43 0 0 1 0.52,-1.14 1.71,1.71 0 0 1 1.19,-0.46 H 254 a 1.39,1.39 0 0 1 1.25,0.8 l 27,45.7 c 0.83,1.52 1.52,2.27 2.05,2.27 0.53,0 0.91,-0.83 0.91,-2.5 L 285,75.36 a 1.43,1.43 0 0 1 0.52,-1.14 1.71,1.71 0 0 1 1.19,-0.46 h 12 a 1.71,1.71 0 0 1 1.19,0.46 1.43,1.43 0 0 1 0.52,1.14 v 76.23 a 1.43,1.43 0 0 1 -0.52,1.14 1.71,1.71 0 0 1 -1.19,0.46 h -8.09 A 8.07,8.07 0 0 1 287.77,152.85 4.48,4.48 0 0 1 286,151 l -28.72,-45.69 c -0.45,-0.69 -0.87,-1 -1.25,-1 -0.61,0 -0.91,0.53 -0.91,1.6 l 0.22,45.69 a 1.45,1.45 0 0 1 -0.51,1.14 1.58,1.58 0 0 1 -1.08,0.46 h -11.4 a 1.71,1.71 0 0 1 -1.16,-0.47 z"
         id="path3793"
         inkscape:connector-curvature="0"
         style="fill:#899a9c" />
      <path
         class="cls-1"
         d="m 385.06,149 a 41.34,41.34 0 0 1 -14.65,-55.89 40.81,40.81 0 0 1 14.65,-14.93 38.47,38.47 0 0 1 20.17,-5.53 39,39 0 0 1 16.46,3.53 40.69,40.69 0 0 1 13.31,9.66 1.55,1.55 0 0 1 0.46,1.14 1.51,1.51 0 0 1 -0.57,1.25 l -8.21,7.07 a 1.74,1.74 0 0 1 -1.25,0.57 1.39,1.39 0 0 1 -1.14,-0.57 25.8,25.8 0 0 0 -8.61,-6.21 25.2,25.2 0 0 0 -10.42,-2.22 24.85,24.85 0 0 0 -13.05,3.59 26.92,26.92 0 0 0 0,46.15 25.53,25.53 0 0 0 23,1.59 26.31,26.31 0 0 0 8.32,-5.64 3.26,3.26 0 0 1 2.16,-0.91 2.16,2.16 0 0 1 1.6,0.57 l 2.17,1.82 4.55,4.11 a 2.5,2.5 0 0 1 1.14,2.16 1.87,1.87 0 0 1 -0.57,1.37 39.63,39.63 0 0 1 -29.28,12.76 38.79,38.79 0 0 1 -20.24,-5.44 z"
         id="path3795"
         inkscape:connector-curvature="0"
         style="fill:#899a9c" />
      <path
         class="cls-1"
         d="m 499.47,153.19 -0.91,-1.14 Q 494.1,145.1 484,129.49 473.9,113.88 468.79,105.67 c -0.46,-0.53 -0.77,-0.8 -0.92,-0.8 -0.15,0 -0.24,0.15 -0.28,0.46 a 5.67,5.67 0 0 0 -0.06,0.68 l 0.23,13.45 a 2,2 0 0 1 -0.57,1.42 1.9,1.9 0 0 1 -1.48,0.63 h -11.03 a 2.18,2.18 0 0 1 -1.53,-0.57 1.9,1.9 0 0 1 -0.63,-1.48 V 75.93 a 2.09,2.09 0 0 1 0.63,-1.54 2.07,2.07 0 0 1 1.53,-0.63 h 11.17 a 1.75,1.75 0 0 1 1.37,0.68 l 27.58,45.93 c 0.68,1.29 1.25,1.94 1.71,1.94 0.46,0 0.57,-0.65 0.57,-1.94 L 497,75.93 a 2.09,2.09 0 0 1 0.63,-1.54 2,2 0 0 1 1.42,-0.63 h 12.08 a 2.15,2.15 0 0 1 2.17,2.17 v 75.21 a 1.9,1.9 0 0 1 -0.63,1.48 2.21,2.21 0 0 1 -1.54,0.57 z"
         id="path3797"
         inkscape:connector-curvature="0"
         style="fill:#899a9c" />
    </g>
  </g>
</svg>
