(ISO 6983 code of anchor)
G10 L2 P1 X0 Y-18
G17 G21 G40 G49 		(Plan XY, mode mm, annulation de la compensation de rayon, et de longueur)
G64 P2.0 				(Mode tajectoire continue avec tolérance 0.5 [mm])
(G61.1)

(M61 Q1)
F9000
S5000

G00 X0 Y0 Z0
M3

o103 repeat [1]
    G02 X-13 Y13 I3.25 J16.25
    G01 X-14.95 Y11.05
    G01 Y18.2
	S25000
    G01 X-9.1 Y16.9
    G01 X-11.05 Y15.61
    G03 X-1.95 Y5.85 I11.702 J1.788
    G01 Y22.75
    G01 X-8.45
    G01 Y26
    G01 X-1.95
    G01 Y29.25
    G02 X1.95 Y29.25 I1.95 J3.25
    G01 Y26
	S15000
    G01 X8.45
    G01 Y22.75
    G01 X1.95
    G01 Y5.85
    G03 X11.05 Y15.61 I-2.602 J11.548
    G01 X9.1 Y16.9
	S7000
    G01 X14.95 Y18.2
    G01 Y11.05
    G01 X13 Y13
    G02 X0 Y0 I-16.25 J3.25
o103 endrepeat

G10 L2 P0 X0 Y0
G17 G21 G40 G49
G00 X0 Y0 Z0

M2

