pomucka,kraj_nuts_kod,mnozstvi
Brýle,CZ010,17770
Brýle,CZ020,3175
Brýle,CZ031,3303
Brýle,CZ032,3094
Brýle,CZ041,1810
Brýle,CZ042,4113
Brýle,CZ051,1995
Brýle,CZ052,3935
Brýle,CZ053,2805
Brýle,CZ063,11920
Brýle,CZ064,5320
Brýle,CZ071,3692
Brýle,CZ072,3170
Brýle,CZ080,6573
"Dezinfekce (l)",CZ010,16675
"Dezinfekce (l)",CZ020,1525
"Dezinfekce (l)",CZ031,1590
"Dezinfekce (l)",CZ032,8970
"Dezinfekce (l)",CZ041,1355
"Dezinfekce (l)",CZ042,2920
"Dezinfekce (l)",CZ051,1205
"Dezinfekce (l)",CZ052,2650
"Dezinfekce (l)",CZ053,1130
"Dezinfekce (l)",CZ063,2060
"Dezinfekce (l)",CZ064,9625
"Dezinfekce (l)",CZ071,3730
"Dezinfekce (l)",CZ072,1950
"Dezinfekce (l)",CZ080,5000
Roušky,CZ010,11731497
Roušky,CZ020,2388166
Roušky,CZ031,1367473
Roušky,CZ032,4326061
Roušky,CZ041,820855
Roušky,CZ042,1679016
Roušky,CZ051,809900
Roušky,CZ052,1915835
Roušky,CZ053,1991219
Roušky,CZ063,1383029
Roušky,CZ064,4813612
Roušky,CZ071,2026396
Roušky,CZ072,1084180
Roušky,CZ080,2859478
Respirátory,CZ010,3974564
Respirátory,CZ020,533075
Respirátory,CZ031,340924
Respirátory,CZ032,925897
Respirátory,CZ041,318162
Respirátory,CZ042,448796
Respirátory,CZ051,210290
Respirátory,CZ052,733025
Respirátory,CZ053,432980
Respirátory,CZ063,345317
Respirátory,CZ064,1098399
Respirátory,CZ071,389504
Respirátory,CZ072,310870
Respirátory,CZ080,734201
"Odběrové sady",CZ010,301390
"Odběrové sady",CZ020,36720
"Odběrové sady",CZ031,5650
"Odběrové sady",CZ032,58780
"Odběrové sady",CZ041,28890
"Odběrové sady",CZ042,26918
"Odběrové sady",CZ051,22100
"Odběrové sady",CZ052,38130
"Odběrové sady",CZ053,20300
"Odběrové sady",CZ063,10170
"Odběrové sady",CZ064,152675
"Odběrové sady",CZ071,21600
"Odběrové sady",CZ072,12870
"Odběrové sady",CZ080,78370
Rukavice,CZ010,2998304
Rukavice,CZ020,699522
Rukavice,CZ031,473028
Rukavice,CZ032,1262461
Rukavice,CZ041,247204
Rukavice,CZ042,617183
Rukavice,CZ051,266269
Rukavice,CZ052,722324
Rukavice,CZ053,426804
Rukavice,CZ063,324007
Rukavice,CZ064,917734
Rukavice,CZ071,522558
Rukavice,CZ072,445363
Rukavice,CZ080,850548
Rychlotesty,CZ010,136327
Rychlotesty,CZ020,50569
Rychlotesty,CZ031,34343
Rychlotesty,CZ032,36052
Rychlotesty,CZ041,45024
Rychlotesty,CZ042,38121
Rychlotesty,CZ051,31810
Rychlotesty,CZ052,32969
Rychlotesty,CZ053,32638
Rychlotesty,CZ063,31893
Rychlotesty,CZ064,61684
Rychlotesty,CZ071,98736
Rychlotesty,CZ072,31928
Rychlotesty,CZ080,68582
Štíty,CZ010,14865
Štíty,CZ020,2347
Štíty,CZ031,2416
Štíty,CZ032,4177
Štíty,CZ041,3015
Štíty,CZ042,4089
Štíty,CZ051,2125
Štíty,CZ052,2155
Štíty,CZ053,4890
Štíty,CZ063,2805
Štíty,CZ064,10065
Štíty,CZ071,3624
Štíty,CZ072,3880
Štíty,CZ080,3928
"Ochranné oděvy",CZ010,548225
"Ochranné oděvy",CZ020,27118
"Ochranné oděvy",CZ031,31799
"Ochranné oděvy",CZ032,293275
"Ochranné oděvy",CZ041,43849
"Ochranné oděvy",CZ042,59064
"Ochranné oděvy",CZ051,17840
"Ochranné oděvy",CZ052,78249
"Ochranné oděvy",CZ053,66743
"Ochranné oděvy",CZ063,68960
"Ochranné oděvy",CZ064,209086
"Ochranné oděvy",CZ071,18485
"Ochranné oděvy",CZ072,51289
"Ochranné oděvy",CZ080,131001
"Návleky na obuv",CZ010,143530
"Návleky na obuv",CZ020,150
"Návleky na obuv",CZ031,510
"Návleky na obuv",CZ032,52280
"Návleky na obuv",CZ041,1600
"Návleky na obuv",CZ042,10620
"Návleky na obuv",CZ051,2050
"Návleky na obuv",CZ052,1100
"Návleky na obuv",CZ053,15780
"Návleky na obuv",CZ063,11000
"Návleky na obuv",CZ064,43497
"Návleky na obuv",CZ071,2150
"Návleky na obuv",CZ072,9550
"Návleky na obuv",CZ080,17232
Polomasky,CZ010,6026
Polomasky,CZ020,0
Polomasky,CZ031,5
Polomasky,CZ032,879
Polomasky,CZ041,0
Polomasky,CZ042,0
Polomasky,CZ051,0
Polomasky,CZ052,800
Polomasky,CZ053,0
Polomasky,CZ063,0
Polomasky,CZ064,2041
Polomasky,CZ071,850
Polomasky,CZ072,0
Polomasky,CZ080,964
"Filtry k polomaskám",CZ010,19196
"Filtry k polomaskám",CZ020,0
"Filtry k polomaskám",CZ031,13
"Filtry k polomaskám",CZ032,2839
"Filtry k polomaskám",CZ041,0
"Filtry k polomaskám",CZ042,0
"Filtry k polomaskám",CZ051,0
"Filtry k polomaskám",CZ052,2664
"Filtry k polomaskám",CZ053,0
"Filtry k polomaskám",CZ063,0
"Filtry k polomaskám",CZ064,6293
"Filtry k polomaskám",CZ071,2956
"Filtry k polomaskám",CZ072,0
"Filtry k polomaskám",CZ080,3268
Teploměry,CZ010,592
Teploměry,CZ020,60
Teploměry,CZ031,70
Teploměry,CZ032,145
Teploměry,CZ041,60
Teploměry,CZ042,93
Teploměry,CZ051,40
Teploměry,CZ052,105
Teploměry,CZ053,60
Teploměry,CZ063,100
Teploměry,CZ064,241
Teploměry,CZ071,152
Teploměry,CZ072,75
Teploměry,CZ080,172
Termokamery,CZ010,74
Termokamery,CZ020,31
Termokamery,CZ031,25
Termokamery,CZ032,32
Termokamery,CZ041,22
Termokamery,CZ042,31
Termokamery,CZ051,21
Termokamery,CZ052,23
Termokamery,CZ053,22
Termokamery,CZ063,39
Termokamery,CZ064,41
Termokamery,CZ071,32
Termokamery,CZ072,29
Termokamery,CZ080,36
"Plicní ventilátory",CZ010,63
"Plicní ventilátory",CZ020,2
"Plicní ventilátory",CZ031,2
"Plicní ventilátory",CZ032,8
"Plicní ventilátory",CZ041,2
"Plicní ventilátory",CZ042,2
"Plicní ventilátory",CZ051,2
"Plicní ventilátory",CZ052,2
"Plicní ventilátory",CZ053,2
"Plicní ventilátory",CZ063,2
"Plicní ventilátory",CZ064,22
"Plicní ventilátory",CZ071,9
"Plicní ventilátory",CZ072,2
"Plicní ventilátory",CZ080,10
"Příslušenství k plicním ventilátorům",CZ010,22
"Příslušenství k plicním ventilátorům",CZ020,5
"Příslušenství k plicním ventilátorům",CZ031,5
"Příslušenství k plicním ventilátorům",CZ032,11
"Příslušenství k plicním ventilátorům",CZ041,5
"Příslušenství k plicním ventilátorům",CZ042,5
"Příslušenství k plicním ventilátorům",CZ051,5
"Příslušenství k plicním ventilátorům",CZ052,5
"Příslušenství k plicním ventilátorům",CZ053,5
"Příslušenství k plicním ventilátorům",CZ063,5
"Příslušenství k plicním ventilátorům",CZ064,5
"Příslušenství k plicním ventilátorům",CZ071,8
"Příslušenství k plicním ventilátorům",CZ072,5
"Příslušenství k plicním ventilátorům",CZ080,5
Ostatní,CZ010,8676
Ostatní,CZ020,0
Ostatní,CZ031,0
Ostatní,CZ032,0
Ostatní,CZ041,0
Ostatní,CZ042,0
Ostatní,CZ051,0
Ostatní,CZ052,0
Ostatní,CZ053,0
Ostatní,CZ063,0
Ostatní,CZ064,0
Ostatní,CZ071,0
Ostatní,CZ072,0
Ostatní,CZ080,0
