datum,pacient_prvni_zaznam,kum_pacient_prvni_zaznam,pocet_hosp,stav_bez_priznaku,stav_lehky,stav_stredni,stav_tezky,jip,kyslik,hfno,upv,ecmo,tezky_upv_ecmo,umrti,kum_umrti
2020-03-01,,,,,,,,,,,,,,,
2020-03-02,,,,,,,,,,,,,,,
2020-03-03,,,,,,,,,,,,,,,
2020-03-04,,,,,,,,,,,,,,,
2020-03-05,,,,,,,,,,,,,,,
2020-03-06,,,,,,,,,,,,,,,
2020-03-07,,,,,,,,,,,,,,,
2020-03-08,,,,,,,,,,,,,,,
2020-03-09,,,,,,,,,,,,,,,
2020-03-10,,,,,,,,,,,,,,,
2020-03-11,2,2,2,0,2,0,0,,0,0,0,0,,,
2020-03-12,1,3,3,0,2,1,0,,0,0,0,0,,,
2020-03-13,2,5,4,0,3,1,0,,0,0,0,0,,,
2020-03-14,1,6,4,1,3,0,0,,1,0,0,0,,,
2020-03-15,2,8,6,1,5,0,0,,1,0,0,0,,,
2020-03-16,14,22,19,3,8,6,2,3,4,0,2,1,2,,
2020-03-17,31,53,49,7,24,13,5,7,8,0,4,1,5,,
2020-03-18,5,58,50,7,25,12,6,9,10,0,4,1,6,,
2020-03-19,8,66,55,8,29,12,6,10,9,0,4,1,6,,
2020-03-20,14,80,66,9,32,10,15,16,14,0,8,1,15,,
2020-03-21,18,98,79,5,41,19,14,18,23,0,11,1,14,,
2020-03-22,22,120,97,6,49,26,16,27,27,0,16,1,18,1,1
2020-03-23,26,146,117,7,54,34,22,31,31,0,19,1,22,,1
2020-03-24,25,171,135,8,54,47,26,41,43,0,23,1,26,2,3
2020-03-25,47,218,175,8,55,77,35,54,61,0,26,1,36,5,8
2020-03-26,49,267,205,5,72,91,37,51,63,0,30,1,38,,8
2020-03-27,40,307,237,5,68,117,47,59,84,0,33,1,48,2,10
2020-03-28,45,352,271,10,85,120,56,63,98,0,37,1,57,4,14
2020-03-29,28,380,282,11,103,115,53,61,98,0,37,2,53,5,19
2020-03-30,24,404,294,8,101,119,66,73,107,0,47,3,66,4,23
2020-03-31,44,448,322,8,107,135,72,82,110,0,55,3,72,6,29
2020-04-01,45,493,345,12,121,138,74,88,104,0,59,4,74,7,36
2020-04-02,39,532,351,15,125,135,76,87,102,0,65,2,76,5,41
2020-04-03,41,573,375,24,118,147,86,94,126,0,65,2,86,7,48
2020-04-04,29,602,365,20,104,157,84,90,131,0,62,2,84,8,56
2020-04-05,25,627,371,19,112,158,82,91,138,0,62,2,82,8,64
2020-04-06,38,665,395,24,121,163,87,96,133,0,65,2,88,8,72
2020-04-07,42,707,413,34,117,162,100,102,137,0,64,2,100,8,80
2020-04-08,33,740,423,41,122,166,94,96,137,0,61,3,94,12,92
2020-04-09,36,776,417,47,115,159,96,94,136,0,64,3,96,9,101
2020-04-10,26,802,406,40,114,163,89,90,135,0,62,3,89,6,107
2020-04-11,24,826,406,44,114,161,87,94,124,0,62,3,87,5,112
2020-04-12,16,842,402,39,108,155,100,99,142,0,63,3,100,6,118
2020-04-13,13,855,395,44,107,151,93,93,123,0,61,3,93,10,128
2020-04-14,10,865,385,44,110,148,83,83,111,0,59,5,83,6,134
2020-04-15,20,885,370,42,109,143,76,79,108,0,57,4,77,,134
2020-04-16,23,908,362,50,91,138,83,87,108,0,57,3,83,2,136
2020-04-17,25,933,355,43,95,137,80,86,109,0,56,3,81,7,143
2020-04-18,15,948,338,42,97,125,74,81,103,0,51,3,75,2,145
2020-04-19,23,971,345,41,97,128,79,84,106,0,52,3,81,7,152
2020-04-20,25,996,348,52,104,116,76,86,89,0,54,3,78,5,157
2020-04-21,40,1036,365,65,110,112,78,82,84,0,48,4,79,5,162
2020-04-22,16,1052,342,73,88,107,74,78,83,0,47,4,75,1,163
2020-04-23,27,1079,335,70,92,95,78,75,82,0,45,4,78,4,167
2020-04-24,20,1099,329,76,81,97,75,73,81,0,47,4,75,5,172
2020-04-25,11,1110,314,73,73,97,71,69,74,0,43,4,71,4,176
2020-04-26,10,1120,309,71,78,88,72,67,71,0,45,4,72,1,177
2020-04-27,14,1134,309,76,74,91,68,68,74,0,45,3,68,1,178
2020-04-28,12,1146,305,73,81,83,68,61,66,0,42,3,68,4,182
2020-04-29,4,1150,286,63,83,78,62,60,65,0,42,2,64,5,187
2020-04-30,19,1169,273,64,76,75,58,52,66,0,39,2,60,6,193
2020-05-01,8,1177,244,48,70,73,53,46,64,0,35,1,55,6,199
2020-05-02,11,1188,233,52,62,70,49,47,58,0,32,1,50,1,200
2020-05-03,6,1194,232,62,62,59,49,45,53,0,31,1,50,1,201
2020-05-04,11,1205,236,67,56,59,54,47,47,0,32,1,55,4,205
2020-05-05,12,1217,223,61,60,56,46,37,43,0,29,1,47,3,208
2020-05-06,4,1221,209,53,58,55,43,35,41,0,28,1,44,2,210
2020-05-07,10,1231,191,48,56,46,41,36,39,0,24,0,41,4,214
2020-05-08,9,1240,185,44,55,43,43,40,41,0,27,0,44,5,219
2020-05-09,6,1246,173,41,52,41,39,34,39,0,25,0,39,3,222
2020-05-10,4,1250,167,35,53,40,39,34,38,0,24,0,39,2,224
2020-05-11,5,1255,167,37,51,37,42,35,38,0,27,0,42,1,225
2020-05-12,5,1260,157,35,47,35,40,32,40,0,25,0,40,2,227
2020-05-13,7,1267,147,30,46,33,38,29,34,0,19,0,39,3,230
2020-05-14,5,1272,128,30,37,27,34,29,26,0,19,0,35,2,232
2020-05-15,3,1275,118,30,35,19,34,29,25,0,18,0,35,2,234
2020-05-16,3,1278,112,27,33,19,33,28,20,0,16,0,34,1,235
2020-05-17,1,1279,110,24,30,22,34,28,24,0,17,0,35,2,237
2020-05-18,9,1288,115,22,37,24,32,29,25,0,18,0,33,3,240
2020-05-19,4,1292,109,23,33,22,31,26,24,0,18,0,32,2,242
2020-05-20,5,1297,101,23,26,21,31,25,23,0,19,0,32,2,244
2020-05-21,7,1304,101,16,35,21,29,23,24,0,17,0,30,2,246
2020-05-22,6,1310,98,19,32,23,24,17,16,0,14,0,25,2,248
2020-05-23,4,1314,93,15,32,24,22,18,16,0,14,0,23,1,249
2020-05-24,5,1319,94,16,32,25,21,19,15,0,14,0,22,1,250
2020-05-25,3,1322,91,15,31,26,19,18,14,0,12,0,20,1,251
2020-05-26,8,1330,92,19,27,31,15,16,15,0,10,0,16,,251
2020-05-27,4,1334,86,15,27,29,15,16,17,0,10,0,17,,251
2020-05-28,4,1338,74,12,21,26,15,13,12,0,8,0,15,1,252
2020-05-29,3,1341,71,11,20,25,15,12,14,0,9,0,15,,252
2020-05-30,8,1349,72,19,18,23,12,12,12,0,7,0,12,,252
2020-05-31,2,1351,70,20,18,20,12,11,13,0,7,0,12,,252
2020-06-01,4,1355,73,20,22,18,13,11,12,0,6,0,13,1,253
2020-06-02,5,1360,75,21,23,20,11,9,11,0,6,0,11,1,254
2020-06-03,,1360,65,18,22,15,10,8,11,0,6,0,10,1,255
2020-06-04,4,1364,60,20,13,18,9,8,9,0,6,0,9,3,258
2020-06-05,9,1373,60,19,19,13,9,6,12,0,5,0,9,,258
2020-06-06,4,1377,59,17,21,13,8,8,12,0,5,0,9,,258
2020-06-07,4,1381,61,18,21,12,10,9,12,0,6,0,10,1,259
2020-06-08,1,1382,60,15,22,14,9,9,10,0,5,0,9,,259
2020-06-09,4,1386,63,13,22,19,9,11,12,0,5,0,9,1,260
2020-06-10,6,1392,66,15,25,15,11,12,13,0,5,0,11,1,261
2020-06-11,4,1396,65,17,20,16,12,10,15,0,4,0,12,1,262
2020-06-12,6,1402,69,16,24,18,11,11,17,0,5,0,11,,262
2020-06-13,4,1406,67,15,20,20,12,10,17,0,5,0,12,,262
2020-06-14,5,1411,68,17,21,20,10,11,15,0,5,0,10,1,263
2020-06-15,11,1422,77,24,24,20,9,8,16,0,3,0,9,1,264
2020-06-16,6,1428,78,22,28,20,8,4,14,0,2,0,8,1,265
2020-06-17,7,1435,84,26,28,23,7,6,13,0,3,0,8,1,266
2020-06-18,7,1442,83,27,24,22,10,8,11,0,4,0,10,1,267
2020-06-19,7,1449,82,27,23,24,8,7,9,0,5,0,8,,267
2020-06-20,6,1455,80,28,21,22,9,7,10,0,5,0,9,,267
2020-06-21,2,1457,74,21,19,25,9,9,10,0,6,0,9,1,268
2020-06-22,3,1460,75,21,20,25,9,9,9,0,6,0,9,1,269
2020-06-23,6,1466,77,21,19,28,9,6,14,0,4,0,9,,269
2020-06-24,7,1473,78,16,21,28,13,7,10,0,5,0,13,4,273
2020-06-25,1,1474,67,12,18,25,12,9,14,0,5,0,12,,273
2020-06-26,5,1479,64,12,15,26,11,8,18,0,4,0,11,1,274
2020-06-27,4,1483,61,10,13,27,11,9,23,0,2,0,11,,274
2020-06-28,7,1490,66,11,14,28,13,10,24,0,4,0,14,,274
2020-06-29,5,1495,69,13,13,32,11,10,26,0,4,0,11,,274
2020-06-30,4,1499,71,15,12,33,11,8,27,0,4,0,11,1,275
2020-07-01,10,1509,75,15,18,32,10,10,28,0,4,0,10,,275
2020-07-02,4,1513,72,11,22,28,11,10,28,0,3,0,11,1,276
2020-07-03,7,1520,71,13,22,25,11,11,28,0,3,0,11,,276
2020-07-04,3,1523,70,15,20,22,13,11,29,0,4,0,13,2,278
2020-07-05,9,1532,73,14,24,22,13,13,24,0,6,1,13,2,280
2020-07-06,2,1534,69,11,25,23,10,11,22,0,5,1,10,1,281
2020-07-07,10,1544,77,14,28,24,11,13,24,0,7,1,11,,281
2020-07-08,10,1554,85,17,29,29,10,14,30,0,6,1,10,,281
2020-07-09,5,1559,73,10,25,23,15,15,25,0,8,1,15,1,282
2020-07-10,5,1564,69,12,18,24,15,15,27,0,9,1,15,,282
2020-07-11,3,1567,64,11,18,21,14,13,26,0,10,0,14,,282
2020-07-12,3,1570,65,8,20,22,15,14,28,0,11,0,15,,282
2020-07-13,8,1578,71,7,23,22,19,14,32,0,11,1,19,1,283
2020-07-14,2,1580,71,7,25,22,17,13,34,0,11,1,17,1,284
2020-07-15,13,1593,80,13,28,22,17,12,31,0,11,1,17,,284
2020-07-16,5,1598,76,15,20,20,21,14,34,0,12,2,21,,284
2020-07-17,6,1604,74,11,22,21,20,13,34,0,11,2,20,2,286
2020-07-18,8,1612,74,14,23,18,19,12,33,0,11,1,19,,286
2020-07-19,4,1616,74,11,24,20,19,14,34,0,12,2,19,1,287
2020-07-20,3,1619,71,12,25,16,18,14,30,0,11,2,18,,287
2020-07-21,10,1629,78,16,22,18,22,13,30,0,10,2,22,1,288
2020-07-22,17,1646,92,26,27,18,21,12,30,0,10,2,21,2,290
2020-07-23,10,1656,91,22,25,24,20,14,34,0,10,2,20,1,291
2020-07-24,9,1665,94,22,26,30,16,15,25,0,10,2,16,1,292
2020-07-25,9,1674,92,20,30,27,15,14,25,0,9,1,15,1,293
2020-07-26,5,1679,91,20,31,26,14,14,27,0,9,1,14,,293
2020-07-27,22,1701,109,29,37,26,17,16,30,0,11,1,17,1,294
2020-07-28,11,1712,114,30,36,31,17,16,30,0,12,1,18,,294
2020-07-29,15,1727,116,27,36,35,18,18,33,0,13,1,19,,294
2020-07-30,12,1739,117,22,35,40,20,18,35,0,14,1,20,2,296
2020-07-31,12,1751,114,25,30,40,19,17,32,0,11,1,19,2,298
2020-08-01,8,1759,116,26,35,36,19,15,30,0,10,1,19,1,299
2020-08-02,3,1762,109,23,34,34,18,15,27,0,12,1,19,1,300
2020-08-03,10,1772,113,25,33,39,16,14,35,0,10,1,16,2,302
2020-08-04,14,1786,115,20,45,37,13,14,35,0,9,1,13,,302
2020-08-05,9,1795,110,20,45,30,15,15,24,0,8,1,15,1,303
2020-08-06,4,1799,105,19,44,28,14,15,22,0,10,1,14,1,304
2020-08-07,14,1813,106,16,45,29,16,17,22,0,10,1,16,,304
2020-08-08,9,1822,104,17,41,30,16,12,21,0,8,1,16,,304
2020-08-09,13,1835,107,15,48,27,17,20,27,0,11,1,17,,304
2020-08-10,12,1847,113,21,42,27,23,22,29,0,14,1,23,,304
2020-08-11,8,1855,110,17,39,31,23,21,31,0,14,1,23,2,306
2020-08-12,13,1868,101,9,36,34,22,22,29,0,15,1,22,,306
2020-08-13,13,1881,106,10,35,38,23,23,30,0,16,1,23,1,307
2020-08-14,19,1900,113,7,45,37,24,22,33,0,16,1,24,2,309
2020-08-15,12,1912,103,6,43,28,26,21,34,0,15,1,26,1,310
2020-08-16,11,1923,101,6,40,31,24,21,32,0,17,1,25,2,312
2020-08-17,16,1939,113,10,50,27,26,22,24,0,18,1,27,3,315
2020-08-18,6,1945,103,8,43,27,25,25,27,0,18,1,26,,315
2020-08-19,14,1959,108,7,46,31,24,27,26,0,20,1,25,3,318
2020-08-20,22,1981,116,8,49,35,24,26,33,0,20,1,24,3,321
2020-08-21,22,2003,119,11,46,38,24,24,34,0,18,1,24,2,323
2020-08-22,14,2017,124,8,54,36,26,26,36,0,19,1,26,,323
2020-08-23,10,2027,128,10,53,41,24,29,46,0,19,1,24,2,325
2020-08-24,9,2036,129,10,48,39,32,33,47,0,21,1,32,1,326
2020-08-25,16,2052,131,13,53,33,32,29,41,0,19,1,32,2,328
2020-08-26,15,2067,136,9,62,33,32,31,41,0,20,0,33,1,329
2020-08-27,21,2088,147,12,52,51,32,34,49,0,22,0,33,,329
2020-08-28,23,2111,156,9,53,57,37,37,62,0,22,0,37,,329
2020-08-29,15,2126,155,11,50,58,36,37,58,0,25,0,36,3,332
2020-08-30,15,2141,154,7,57,54,36,39,58,0,25,0,36,1,333
2020-08-31,22,2163,171,8,67,60,36,40,57,0,26,0,36,1,334
2020-09-01,20,2183,178,10,70,57,41,45,60,0,27,0,41,1,335
2020-09-02,19,2202,180,15,66,57,42,49,53,0,29,0,42,,335
2020-09-03,36,2238,195,20,74,57,44,46,55,0,32,0,44,4,339
2020-09-04,34,2272,207,16,82,60,49,51,56,0,34,1,50,2,341
2020-09-05,33,2305,209,12,78,67,52,49,67,0,34,0,52,4,345
2020-09-06,20,2325,220,12,81,71,56,52,74,0,36,0,56,3,348
2020-09-07,45,2370,256,16,97,78,65,53,85,0,40,0,66,1,349
2020-09-08,27,2397,253,20,84,92,57,50,86,0,37,1,57,4,353
2020-09-09,47,2444,266,18,85,102,61,55,102,0,40,1,62,3,356
2020-09-10,35,2479,272,15,86,104,67,58,103,0,42,1,67,3,359
2020-09-11,57,2536,310,14,114,116,66,62,123,0,44,1,67,3,362
2020-09-12,31,2567,283,14,96,110,63,57,118,0,42,1,64,4,366
2020-09-13,46,2613,305,12,108,120,65,63,131,0,45,1,66,3,369
2020-09-14,52,2665,339,20,124,120,75,70,135,0,42,1,75,4,373
2020-09-15,78,2743,369,21,152,122,74,70,145,0,42,1,74,6,379
2020-09-16,73,2816,399,24,161,134,80,74,166,0,43,2,80,7,386
2020-09-17,135,2951,495,32,205,167,91,81,193,0,50,4,91,5,391
2020-09-18,86,3037,525,41,195,193,96,98,206,0,58,4,97,11,402
2020-09-19,74,3111,508,30,188,197,93,112,221,0,57,3,94,6,408
2020-09-20,59,3170,532,23,200,203,106,122,233,0,59,3,107,5,413
2020-09-21,105,3275,613,32,237,231,113,144,268,0,71,3,114,14,427
2020-09-22,105,3380,637,42,238,237,120,137,270,0,75,2,123,10,437
2020-09-23,138,3518,710,52,258,265,135,147,307,0,80,2,139,19,456
2020-09-24,143,3661,768,52,270,291,155,157,347,0,93,4,157,9,465
2020-09-25,135,3796,825,48,296,317,164,158,382,0,96,3,167,8,473
2020-09-26,106,3902,797,33,254,326,184,163,401,0,98,3,187,14,487
2020-09-27,117,4019,823,33,268,334,188,178,412,0,107,3,193,15,502
2020-09-28,100,4119,845,34,290,324,197,191,443,0,101,2,198,9,511
2020-09-29,188,4307,998,64,350,380,204,197,469,0,109,1,206,18,529
2020-09-30,193,4500,1062,78,365,423,196,196,500,0,111,2,197,10,539
2020-10-01,200,4700,1164,70,413,449,232,219,535,0,126,3,233,19,558
2020-10-02,211,4911,1241,64,439,494,244,225,571,0,127,3,245,18,576
2020-10-03,148,5059,1209,44,418,484,263,254,600,0,127,2,264,11,587
2020-10-04,165,5224,1281,50,421,545,265,268,626,1,130,2,266,25,612
2020-10-05,296,5520,1488,90,470,614,314,282,692,2,146,3,321,24,636
2020-10-06,296,5816,1634,117,525,661,331,316,736,2,156,4,336,29,665
2020-10-07,330,6146,1786,162,539,721,364,346,818,11,173,4,369,42,707
2020-10-08,358,6504,1957,185,607,761,404,358,898,24,175,4,407,22,729
2020-10-09,362,6866,2149,207,631,898,413,389,965,56,192,5,419,53,782
2020-10-10,277,7143,2168,216,592,923,437,420,1024,63,206,4,442,41,823
2020-10-11,254,7397,2220,201,632,977,410,411,1093,60,193,3,414,35,858
2020-10-12,499,7896,2579,274,805,1032,468,435,1178,66,217,2,475,58,916
2020-10-13,454,8350,2692,312,822,1063,495,452,1195,72,234,4,501,47,963
2020-10-14,534,8884,2990,327,930,1212,521,478,1322,73,245,5,523,54,1017
2020-10-15,501,9385,3207,346,915,1406,540,514,1502,79,269,7,543,48,1065
2020-10-16,582,9967,3452,355,1037,1487,573,555,1604,85,290,9,578,63,1128
2020-10-17,503,10470,3552,321,1073,1603,555,573,1672,88,302,10,559,71,1199
2020-10-18,483,10953,3713,274,1188,1689,562,598,1775,94,312,12,566,59,1258
2020-10-19,697,11650,4154,340,1345,1856,613,622,1897,89,329,14,619,93,1351
2020-10-20,748,12398,4450,376,1443,1991,640,642,2035,104,344,14,642,88,1439
2020-10-21,923,13321,4868,452,1600,2114,702,704,2185,119,362,14,709,113,1552
2020-10-22,840,14161,5108,498,1670,2221,719,751,2326,120,382,13,729,104,1656
2020-10-23,912,15073,5456,582,1793,2336,745,762,2387,125,379,16,752,114,1770
2020-10-24,701,15774,5373,527,1694,2391,761,760,2503,147,377,12,770,119,1889
2020-10-25,714,16488,5684,570,1798,2506,810,802,2640,145,387,6,814,125,2014
2020-10-26,1086,17574,6201,621,1974,2728,878,884,2844,152,433,5,883,142,2156
2020-10-27,1026,18600,6533,708,2054,2835,936,876,2978,153,457,5,941,162,2318
2020-10-28,823,19423,6573,686,1998,2885,1004,888,3039,178,468,6,1013,145,2463
2020-10-29,1027,20450,7273,865,2277,3095,1036,995,3255,190,523,8,1048,176,2639
2020-10-30,1175,21625,7657,880,2488,3208,1081,1030,3306,192,535,7,1093,195,2834
2020-10-31,694,22319,7333,822,2287,3108,1116,1069,3369,204,561,7,1125,166,3000
2020-11-01,622,22941,7462,809,2271,3240,1142,1118,3452,208,577,7,1144,187,3187
2020-11-02,1050,23991,8037,930,2586,3333,1188,1154,3569,224,605,7,1194,193,3380
2020-11-03,1035,25026,8136,926,2642,3361,1207,1180,3593,226,627,9,1213,232,3612
2020-11-04,967,25993,8213,967,2739,3361,1146,1166,3568,226,605,8,1153,197,3809
2020-11-05,859,26852,8224,959,2782,3331,1152,1176,3495,236,596,9,1158,170,3979
2020-11-06,904,27756,8143,912,2787,3277,1167,1212,3437,275,603,12,1172,180,4159
2020-11-07,542,28298,7509,797,2432,3157,1123,1157,3363,271,584,12,1127,179,4338
2020-11-08,502,28800,7486,755,2394,3208,1129,1167,3367,282,583,13,1134,171,4509
2020-11-09,847,29647,7783,890,2605,3159,1129,1181,3305,283,609,19,1138,152,4661
2020-11-10,838,30485,7596,907,2515,3090,1084,1169,3208,300,604,19,1090,191,4852
2020-11-11,717,31202,7365,918,2434,2975,1038,1110,2975,292,582,18,1049,163,5015
2020-11-12,686,31888,7203,942,2327,2870,1064,1105,2897,321,557,17,1078,153,5168
2020-11-13,793,32681,7118,950,2336,2786,1046,1101,2755,330,545,16,1060,158,5326
2020-11-14,443,33124,6574,836,2096,2617,1025,1068,2634,332,526,15,1036,161,5487
2020-11-15,355,33479,6421,788,2059,2562,1012,1045,2560,315,517,15,1020,130,5617
2020-11-16,676,34155,6655,891,2251,2550,963,1040,2566,291,503,15,972,142,5759
2020-11-17,423,34578,6188,788,2024,2478,898,996,2489,285,470,14,911,114,5873
2020-11-18,688,35266,6568,936,2278,2462,892,1007,2450,285,473,16,904,135,6008
2020-11-19,564,35830,6328,837,2228,2376,887,974,2371,284,465,18,896,112,6120
2020-11-20,502,36332,6085,831,2115,2311,828,960,2273,279,445,20,836,101,6221
2020-11-21,327,36659,5426,672,1736,2197,821,944,2152,279,449,23,829,118,6339
2020-11-22,274,36933,5372,638,1758,2161,815,958,2136,275,446,23,824,100,6439
2020-11-23,555,37488,5725,833,1908,2159,825,950,2163,274,437,21,832,112,6551
2020-11-24,593,38081,5550,814,1856,2085,795,881,2103,278,407,22,804,110,6661
2020-11-25,477,38558,5327,767,1770,2039,751,856,2027,266,390,19,762,105,6766
2020-11-26,450,39008,5172,752,1735,1937,748,843,1935,260,395,18,757,114,6880
2020-11-27,414,39422,4960,741,1645,1864,710,800,1812,240,369,17,716,119,6999
2020-11-28,269,39691,4479,565,1436,1821,657,780,1508,232,359,12,661,98,7097
2020-11-29,289,39980,4545,617,1441,1844,643,765,1547,238,342,12,646,78,7175
2020-11-30,507,40487,4838,695,1630,1842,671,791,1541,240,350,11,673,110,7285
2020-12-01,450,40937,4662,672,1561,1833,596,733,1531,219,322,10,599,95,7380
2020-12-02,445,41382,4558,659,1547,1756,596,717,1471,227,309,11,599,99,7479
2020-12-03,499,41881,4535,606,1544,1798,587,718,1465,237,295,11,590,90,7569
2020-12-04,498,42379,4474,665,1449,1778,582,715,1496,227,294,11,586,80,7649
2020-12-05,280,42659,4109,560,1246,1734,569,692,1482,212,301,11,571,104,7753
2020-12-06,301,42960,4157,543,1294,1759,561,680,1508,219,298,12,564,80,7833
2020-12-07,516,43476,4509,648,1452,1842,567,714,1556,226,293,11,570,85,7918
2020-12-08,468,43944,4406,630,1392,1825,559,702,1528,223,290,8,562,80,7998
2020-12-09,546,44490,4461,602,1455,1863,541,687,1571,217,281,10,544,73,8071
2020-12-10,499,44989,4561,605,1532,1861,563,712,1590,215,300,7,566,99,8170
2020-12-11,454,45443,4536,597,1517,1839,583,702,1562,214,313,9,584,99,8269
2020-12-12,372,45815,4315,514,1372,1863,566,696,1604,227,307,6,570,86,8355
2020-12-13,340,46155,4414,503,1410,1922,579,710,1642,221,305,7,582,97,8452
2020-12-14,546,46701,4775,680,1523,1964,608,728,1681,246,315,9,611,113,8565
2020-12-15,573,47274,4747,660,1484,2006,597,725,1705,234,311,9,599,99,8664
2020-12-16,489,47763,4715,638,1465,2009,603,735,1690,241,313,9,604,101,8765
2020-12-17,528,48291,4779,702,1507,1970,600,725,1652,251,304,9,601,96,8861
2020-12-18,528,48819,4782,690,1519,1971,602,729,1653,254,314,9,603,93,8954
2020-12-19,334,49153,4483,583,1381,1919,600,746,1645,266,309,10,601,102,9056
2020-12-20,375,49528,4579,550,1438,1974,617,755,1680,272,304,11,618,86,9142
2020-12-21,557,50085,4959,688,1641,2000,630,765,1680,275,309,10,631,90,9232
2020-12-22,634,50719,4937,613,1632,2053,639,770,1715,271,322,8,640,92,9324
2020-12-23,641,51360,4973,625,1577,2101,670,780,1737,277,335,10,672,104,9428
2020-12-24,370,51730,4310,449,1284,1930,647,749,1647,279,322,10,648,99,9527
2020-12-25,471,52201,4386,446,1275,2006,659,769,1751,282,332,8,659,88,9615
2020-12-26,528,52729,4651,436,1378,2135,702,806,1864,300,351,10,702,116,9731
2020-12-27,560,53289,4966,458,1481,2294,733,846,1990,307,369,12,733,100,9831
2020-12-28,873,54162,5726,581,1700,2660,785,906,2299,330,391,14,786,120,9951
2020-12-29,931,55093,5977,588,1796,2744,849,941,2359,371,412,15,850,123,10074
2020-12-30,810,55903,6142,574,1832,2871,865,956,2482,369,426,18,866,140,10214
2020-12-31,769,56672,6163,563,1817,2901,882,974,2503,384,435,18,883,115,10329
2021-01-01,580,57252,5669,436,1501,2837,895,951,2502,403,435,15,896,143,10472
2021-01-02,691,57943,5973,428,1622,3022,901,962,2688,394,456,16,902,134,10606
2021-01-03,652,58595,6286,448,1737,3162,939,1008,2804,402,475,18,940,125,10731
2021-01-04,998,59593,7224,631,2113,3480,1000,1093,3027,426,512,20,1000,133,10864
2021-01-05,1010,60603,7412,660,2208,3495,1049,1114,3057,454,535,19,1049,158,11022
2021-01-06,908,61511,7404,575,2205,3534,1090,1153,3088,474,555,20,1091,144,11166
2021-01-07,925,62436,7562,642,2210,3581,1129,1150,3085,488,564,22,1130,174,11340
2021-01-08,806,63242,7351,641,2172,3411,1127,1143,2943,535,534,21,1128,181,11521
2021-01-09,586,63828,6774,492,1831,3356,1095,1150,2975,517,530,20,1095,153,11674
2021-01-10,545,64373,6881,491,1907,3361,1122,1177,2985,522,549,20,1122,160,11834
2021-01-11,858,65231,7427,689,2128,3439,1171,1190,2987,544,566,20,1171,150,11984
2021-01-12,856,66087,7484,721,2072,3532,1159,1179,3058,520,565,17,1159,160,12144
2021-01-13,695,66782,7313,683,2084,3398,1148,1175,2976,512,571,13,1149,153,12297
2021-01-14,666,67448,7237,699,2013,3373,1152,1186,2933,495,589,14,1152,169,12466
2021-01-15,717,68165,7153,736,1982,3284,1151,1177,2879,487,601,15,1151,157,12623
2021-01-16,451,68616,6533,582,1687,3121,1143,1168,2765,494,591,16,1143,135,12758
2021-01-17,406,69022,6506,590,1717,3072,1127,1139,2751,486,597,14,1127,140,12898
2021-01-18,702,69724,6969,766,1959,3111,1133,1163,2706,486,594,15,1133,144,13042
2021-01-19,703,70427,6701,709,1895,2989,1108,1144,2643,484,584,15,1109,138,13180
2021-01-20,678,71105,6538,619,1833,2986,1100,1119,2600,491,565,16,1100,139,13319
2021-01-21,580,71685,6408,627,1752,2955,1074,1112,2593,486,558,19,1075,137,13456
2021-01-22,610,72295,6391,604,1760,2928,1099,1114,2561,489,541,17,1099,124,13580
2021-01-23,453,72748,5876,453,1523,2826,1074,1094,2527,483,536,19,1074,128,13708
2021-01-24,382,73130,5913,441,1555,2853,1064,1059,2528,463,539,18,1064,130,13838
2021-01-25,660,73790,6338,603,1817,2875,1043,1084,2550,467,541,17,1043,126,13964
2021-01-26,644,74434,6306,575,1770,2919,1042,1047,2532,444,548,15,1042,134,14098
2021-01-27,586,75020,6159,576,1742,2833,1008,1039,2427,424,549,17,1008,145,14243
2021-01-28,558,75578,6042,570,1708,2760,1004,1018,2370,423,543,16,1004,119,14362
2021-01-29,616,76194,5978,570,1708,2721,979,1020,2352,425,515,16,979,145,14507
2021-01-30,425,76619,5517,422,1424,2711,960,1022,2387,392,521,16,960,106,14613
2021-01-31,386,77005,5561,417,1457,2718,969,1040,2383,400,528,17,969,105,14718
2021-02-01,741,77746,6100,550,1690,2838,1022,1078,2467,427,545,19,1022,116,14834
2021-02-02,637,78383,5988,485,1697,2773,1033,1090,2402,457,531,17,1033,124,14958
2021-02-03,617,79000,5960,483,1672,2789,1016,1076,2425,452,530,16,1016,124,15082
2021-02-04,642,79642,5999,495,1677,2796,1031,1102,2405,448,547,17,1031,118,15200
2021-02-05,591,80233,5984,504,1689,2748,1043,1087,2376,462,540,17,1043,110,15310
2021-02-06,476,80709,5651,406,1503,2699,1043,1070,2355,461,526,17,1043,119,15429
2021-02-07,434,81143,5791,448,1526,2764,1053,1098,2418,455,545,14,1053,113,15542
2021-02-08,689,81832,6230,568,1725,2848,1089,1107,2478,481,539,15,1089,125,15667
2021-02-09,657,82489,6154,581,1621,2859,1093,1094,2499,510,526,12,1093,119,15786
2021-02-10,637,83126,6083,545,1668,2775,1095,1111,2432,516,524,13,1095,119,15905
2021-02-11,632,83758,6062,544,1603,2804,1111,1117,2465,516,546,16,1111,120,16025
2021-02-12,615,84373,5995,536,1592,2762,1105,1116,2411,503,558,15,1105,130,16155
2021-02-13,477,84850,5680,390,1362,2824,1104,1108,2481,518,563,16,1104,100,16255
2021-02-14,537,85387,5891,388,1394,2961,1148,1148,2599,542,581,14,1148,128,16383
2021-02-15,726,86113,6388,505,1626,3059,1198,1174,2634,594,571,16,1198,109,16492
2021-02-16,764,86877,6421,514,1609,3066,1232,1217,2670,595,596,17,1232,136,16628
2021-02-17,800,87677,6500,458,1625,3141,1276,1245,2733,619,609,17,1276,120,16748
2021-02-18,732,88409,6611,435,1688,3198,1290,1270,2777,620,618,18,1290,160,16908
2021-02-19,780,89189,6615,437,1734,3143,1301,1273,2696,625,636,16,1301,166,17074
2021-02-20,561,89750,6214,351,1468,3099,1296,1270,2705,601,656,16,1296,156,17230
2021-02-21,595,90345,6419,393,1492,3221,1313,1286,2824,615,664,17,1313,133,17363
2021-02-22,921,91266,7114,500,1756,3462,1396,1364,3019,678,681,21,1396,146,17509
2021-02-23,853,92119,7148,479,1760,3475,1434,1391,3040,717,693,24,1434,135,17644
2021-02-24,846,92965,7238,445,1829,3500,1464,1410,3049,735,680,25,1464,133,17777
2021-02-25,921,93886,7463,438,1889,3577,1559,1464,3059,780,728,27,1559,162,17939
2021-02-26,908,94794,7569,465,1918,3654,1532,1440,3144,758,721,26,1532,181,18120
2021-02-27,716,95510,7259,360,1583,3768,1548,1471,3252,775,716,24,1548,167,18287
2021-02-28,650,96160,7525,365,1670,3909,1581,1508,3389,781,742,17,1582,164,18451
2021-03-01,1156,97316,8340,495,2024,4155,1666,1588,3598,828,782,19,1667,188,18639
2021-03-02,1050,98366,8524,514,2062,4227,1721,1598,3643,854,800,17,1721,182,18821
2021-03-03,866,99232,8476,507,2044,4179,1746,1628,3620,865,808,17,1746,185,19006
2021-03-04,924,100156,8482,502,1928,4273,1779,1657,3703,871,831,20,1779,202,19208
2021-03-05,906,101062,8544,500,1961,4309,1774,1674,3733,864,845,22,1774,174,19382
2021-03-06,747,101809,8191,383,1677,4360,1771,1676,3815,863,855,23,1771,189,19571
2021-03-07,713,102522,8416,359,1802,4434,1821,1681,3904,891,875,24,1821,180,19751
2021-03-08,1044,103566,9091,508,2148,4532,1903,1777,3956,918,923,32,1903,214,19965
2021-03-09,980,104546,9056,473,2078,4571,1934,1804,3970,969,912,27,1934,211,20176
2021-03-10,1031,105577,9076,460,2077,4558,1981,1832,3980,1003,919,32,1981,209,20385
2021-03-11,932,106509,9044,463,2062,4526,1993,1822,3952,1015,919,35,1993,212,20597
2021-03-12,973,107482,9012,471,2111,4430,2000,1833,3884,1010,929,32,2000,201,20798
2021-03-13,745,108227,8609,367,1777,4490,1975,1783,3995,1004,913,33,1975,160,20958
2021-03-14,656,108883,8823,380,1840,4573,2030,1829,4061,1031,939,31,2030,211,21169
2021-03-15,1035,109918,9551,534,2191,4772,2054,1886,4207,1055,944,30,2054,216,21385
2021-03-16,924,110842,9412,486,2171,4689,2066,1896,4119,1050,930,36,2066,203,21588
2021-03-17,875,111717,9242,505,2087,4612,2038,1861,4042,1056,926,35,2038,177,21765
2021-03-18,811,112528,9039,464,2067,4491,2017,1859,4017,1028,951,33,2017,199,21964
2021-03-19,808,113336,8845,471,2021,4358,1995,1819,3814,1011,945,34,1996,156,22120
2021-03-20,562,113898,8280,368,1734,4208,1970,1781,3740,998,938,28,1970,161,22281
2021-03-21,564,114462,8387,346,1791,4285,1965,1805,3816,987,934,29,1965,174,22455
2021-03-22,937,115399,9037,514,2154,4383,1986,1824,3836,961,974,27,1986,194,22649
2021-03-23,765,116164,8690,485,2057,4236,1912,1775,3702,918,932,25,1912,179,22828
2021-03-24,745,116909,8366,414,1998,4067,1887,1743,3558,902,924,21,1887,170,22998
2021-03-25,729,117638,8206,411,1938,3982,1875,1742,3488,929,911,25,1875,144,23142
2021-03-26,711,118349,8083,433,1966,3848,1836,1677,3352,873,911,28,1837,137,23279
2021-03-27,564,118913,7559,327,1593,3834,1805,1644,3377,879,878,28,1806,166,23445
2021-03-28,495,119408,7611,303,1676,3868,1764,1655,3407,876,862,26,1765,107,23552
2021-03-29,791,120199,8156,468,2032,3885,1771,1665,3379,871,863,28,1771,166,23718
2021-03-30,658,120857,7878,436,1909,3810,1723,1613,3300,856,837,28,1723,158,23876
2021-03-31,655,121512,7556,458,1826,3657,1615,1553,3168,775,810,25,1615,145,24021
2021-04-01,619,122131,7243,436,1789,3465,1553,1505,3017,741,785,24,1553,138,24159
2021-04-02,507,122638,6413,331,1436,3207,1439,1422,2829,668,759,28,1441,97,24256
2021-04-03,475,123113,6256,279,1402,3152,1423,1397,2787,677,721,28,1425,113,24369
2021-04-04,444,123557,6352,264,1489,3194,1405,1378,2843,663,711,31,1407,123,24492
2021-04-05,367,123924,6418,273,1534,3230,1381,1346,2855,654,705,29,1384,109,24601
2021-04-06,640,124564,7098,421,1774,3482,1421,1394,3057,665,726,26,1427,103,24704
2021-04-07,518,125082,6744,386,1641,3333,1384,1359,2878,634,700,23,1388,114,24818
2021-04-08,433,125515,6265,355,1493,3107,1310,1315,2699,607,668,23,1313,114,24932
2021-04-09,482,125997,5950,355,1507,2853,1235,1235,2431,571,625,24,1237,103,25035
2021-04-10,304,126301,5311,241,1195,2683,1192,1214,2339,556,601,22,1195,96,25131
2021-04-11,283,126584,5264,255,1176,2679,1154,1196,2353,517,600,20,1156,78,25209
2021-04-12,416,127000,5562,347,1389,2678,1148,1184,2348,515,593,21,1151,77,25286
2021-04-13,375,127375,5249,336,1286,2548,1079,1153,2250,480,568,18,1082,80,25366
2021-04-14,390,127765,4945,306,1177,2417,1045,1110,2116,481,535,17,1047,84,25450
2021-04-15,351,128116,4687,314,1162,2227,984,1035,1941,438,518,18,987,78,25528
2021-04-16,343,128459,4435,326,1110,2058,941,1012,1790,414,513,18,944,59,25587
2021-04-17,263,128722,4037,196,931,1999,911,975,1761,408,485,18,914,63,25650
2021-04-18,234,128956,4050,185,973,2002,890,975,1765,388,491,19,893,69,25719
2021-04-19,354,129310,4327,246,1105,2076,900,992,1820,395,488,22,904,68,25787
2021-04-20,330,129640,4164,274,1052,1980,858,942,1721,377,471,18,862,55,25842
2021-04-21,337,129977,4005,258,1016,1874,857,908,1626,376,460,20,860,59,25901
2021-04-22,261,130238,3771,267,902,1804,798,839,1538,353,420,21,802,51,25952
2021-04-23,253,130491,3552,222,900,1670,760,792,1434,336,406,19,762,50,26002
2021-04-24,166,130657,3205,165,752,1556,732,755,1367,329,379,17,734,50,26052
2021-04-25,169,130826,3196,170,759,1547,720,763,1362,328,373,15,722,51,26103
2021-04-26,263,131089,3346,242,899,1512,693,741,1304,315,362,14,694,54,26157
2021-04-27,250,131339,3173,218,818,1473,664,716,1281,282,361,17,666,46,26203
2021-04-28,231,131570,3025,211,774,1430,610,689,1239,261,335,19,612,61,26264
2021-04-29,243,131813,2855,189,715,1387,564,640,1183,239,303,19,565,39,26303
2021-04-30,205,132018,2698,171,700,1313,514,580,1133,216,278,18,515,43,26346
2021-05-01,158,132176,2485,130,586,1275,494,555,1137,219,262,17,494,31,26377
2021-05-02,147,132323,2510,137,611,1276,486,559,1130,208,267,18,486,32,26409
2021-05-03,255,132578,2706,196,707,1311,492,564,1126,215,263,14,492,34,26443
2021-05-04,172,132750,2554,171,662,1239,482,545,1060,215,250,15,483,43,26486
2021-05-05,182,132932,2379,147,614,1186,432,503,1000,184,232,16,433,32,26518
2021-05-06,171,133103,2241,154,587,1103,397,464,929,175,218,17,398,36,26554
2021-05-07,176,133279,2145,171,579,1013,382,439,860,174,199,13,383,25,26579
2021-05-08,92,133371,1900,120,450,963,367,412,818,171,184,12,368,29,26608
2021-05-09,102,133473,1882,117,437,958,370,416,821,170,181,11,371,30,26638
2021-05-10,176,133649,2006,155,564,921,366,424,784,168,184,11,367,29,26667
2021-05-11,139,133788,1852,137,502,866,347,401,736,168,164,10,349,28,26695
2021-05-12,138,133926,1740,155,466,791,328,379,664,163,155,9,330,30,26725
2021-05-13,121,134047,1644,126,452,749,317,369,642,151,153,8,319,19,26744
2021-05-14,105,134152,1556,117,421,729,289,343,622,141,138,8,290,16,26760
2021-05-15,65,134217,1353,87,354,650,262,309,561,127,122,8,262,14,26774
2021-05-16,65,134282,1339,81,357,645,256,306,557,124,122,7,256,12,26786
2021-05-17,103,134385,1418,96,436,648,238,297,529,111,113,6,238,19,26805
2021-05-18,80,134465,1278,87,384,584,223,279,477,105,107,6,223,13,26818
2021-05-19,69,134534,1169,80,342,533,214,251,438,105,100,6,214,16,26834
2021-05-20,68,134602,1081,91,312,491,187,220,407,89,92,5,187,15,26849
2021-05-21,77,134679,1031,88,298,469,176,194,396,91,76,4,177,13,26862
2021-05-22,35,134714,885,56,229,433,167,191,376,87,71,3,168,9,26871
2021-05-23,29,134743,866,64,218,425,159,189,362,84,68,3,160,11,26882
2021-05-24,57,134800,898,83,263,394,158,185,319,82,66,4,159,6,26888
2021-05-25,59,134859,804,77,201,390,136,164,316,67,62,4,137,8,26896
2021-05-26,61,134920,776,77,213,357,129,156,296,58,64,3,130,10,26906
2021-05-27,38,134958,680,60,181,318,121,147,269,57,60,3,123,14,26920
2021-05-28,40,134998,626,56,185,285,100,127,243,43,55,3,102,6,26926
2021-05-29,19,135017,522,40,146,238,98,113,204,47,43,4,100,5,26931
2021-05-30,27,135044,520,46,155,227,92,113,198,45,43,4,95,4,26935
2021-05-31,41,135085,558,66,179,214,99,118,182,46,46,4,102,7,26942
2021-06-01,28,135113,481,51,152,195,83,98,158,33,43,3,85,5,26947
2021-06-02,38,135151,445,41,152,175,77,91,140,33,40,3,80,4,26951
2021-06-03,20,135171,396,43,129,151,73,86,121,34,36,3,75,2,26953
2021-06-04,28,135199,369,41,127,139,62,72,113,27,30,2,64,6,26959
2021-06-05,15,135214,304,27,100,125,52,60,105,25,22,1,53,1,26960
2021-06-06,12,135226,304,26,104,122,52,61,104,24,20,1,53,4,26964
2021-06-07,14,135240,306,32,110,119,45,58,100,22,19,1,46,3,26967
2021-06-08,23,135263,290,32,88,127,43,59,108,20,19,2,44,5,26972
2021-06-09,15,135278,262,24,82,117,39,56,94,19,17,3,40,2,26974
2021-06-10,18,135296,239,27,77,99,36,53,80,17,15,2,37,5,26979
2021-06-11,10,135306,190,23,68,77,22,38,61,10,9,0,22,1,26980
2021-06-12,8,135314,163,15,53,70,25,38,53,11,10,0,25,3,26983
2021-06-13,5,135319,155,13,54,65,23,35,52,10,11,0,23,2,26985
2021-06-14,9,135328,171,19,60,66,26,37,55,11,11,1,26,,26985
2021-06-15,9,135337,144,21,43,61,19,27,47,8,9,1,19,3,26988
2021-06-16,6,135343,123,20,35,53,15,25,42,4,9,1,15,1,26989
2021-06-17,24,135367,122,24,27,54,17,24,41,5,9,1,17,4,26993
2021-06-18,8,135375,114,26,28,42,18,22,31,6,11,0,18,3,26996
2021-06-19,10,135385,91,13,26,39,13,18,31,4,9,0,14,,26996
2021-06-20,2,135387,89,13,26,38,12,20,32,3,9,0,13,1,26997
2021-06-21,8,135395,94,18,28,35,13,18,32,3,10,0,14,,26997
2021-06-22,7,135402,90,18,26,32,14,17,27,4,9,0,15,2,26999
2021-06-23,7,135409,87,19,21,36,11,14,27,4,7,0,12,,26999
2021-06-24,4,135413,84,21,22,28,13,16,22,4,8,1,14,2,27001
2021-06-25,6,135419,70,20,24,16,10,16,9,4,7,0,11,1,27002
2021-06-26,2,135421,58,17,17,14,10,13,9,4,7,0,11,2,27004
2021-06-27,2,135423,59,17,18,16,8,12,11,2,7,0,9,,27004
2021-06-28,7,135430,65,18,21,17,9,14,11,2,8,0,10,,27004
2021-06-29,2,135432,60,16,19,14,11,15,12,4,6,0,11,,27004
2021-06-30,10,135442,60,16,20,14,10,13,9,4,5,0,10,2,27006
2021-07-01,4,135446,50,12,13,17,8,14,11,4,4,0,8,1,27007
2021-07-02,2,135448,41,14,8,13,6,7,10,2,3,0,6,1,27008
2021-07-03,2,135450,30,8,5,12,5,6,9,2,3,0,5,,27008
2021-07-04,3,135453,33,8,9,12,4,7,9,2,2,0,4,2,27010
2021-07-05,2,135455,35,7,10,14,4,11,10,3,1,0,4,,27010
2021-07-06,,135455,34,8,10,12,4,11,6,3,1,0,4,,27010
2021-07-07,8,135463,44,12,9,20,3,12,12,2,1,0,3,1,27011
2021-07-08,4,135467,41,9,12,16,4,11,7,2,2,0,4,,27011
2021-07-09,5,135472,37,8,11,14,4,8,10,2,2,0,4,,27011
2021-07-10,3,135475,26,5,6,12,3,7,10,1,2,0,3,,27011
2021-07-11,5,135480,26,3,6,15,2,8,12,0,2,0,2,,27011
2021-07-12,8,135488,35,3,10,19,3,9,16,1,2,0,3,,27011
2021-07-13,,135488,33,5,10,15,3,8,14,1,2,0,3,,27011
2021-07-14,5,135493,31,6,5,15,5,10,13,2,3,0,5,,27011
2021-07-15,6,135499,32,4,3,19,6,10,16,3,3,0,6,,27011
2021-07-16,6,135505,35,3,6,19,7,10,13,3,3,0,7,2,27013
2021-07-17,4,135509,33,5,6,16,6,9,11,4,2,0,6,,27013
2021-07-18,2,135511,35,5,8,15,7,10,9,4,3,0,7,1,27014
2021-07-19,10,135521,49,10,11,22,6,10,15,3,3,0,6,2,27016
2021-07-20,5,135526,45,5,14,20,6,6,14,3,2,0,6,,27016
2021-07-21,6,135532,47,7,13,22,5,9,17,3,1,0,5,1,27017
2021-07-22,6,135538,46,4,13,23,6,14,15,2,2,0,6,,27017
2021-07-23,5,135543,46,6,17,18,5,12,15,2,2,0,6,,27017
2021-07-24,6,135549,43,5,11,23,4,9,19,3,2,0,5,,27017
2021-07-25,8,135557,50,6,16,24,4,10,21,2,3,0,5,,27017
2021-07-26,14,135571,62,10,20,26,6,9,21,3,3,0,7,,27017
2021-07-27,3,135574,55,8,14,26,7,10,23,3,5,0,8,,27017
2021-07-28,7,135581,55,5,16,27,7,11,24,2,5,0,8,,27017
2021-07-29,11,135592,62,5,16,32,9,14,29,5,5,0,10,,27017
2021-07-30,4,135596,62,5,17,29,11,16,27,7,5,1,11,,27017
2021-07-31,5,135601,58,3,17,26,12,17,23,5,7,1,12,2,27019
2021-08-01,4,135605,52,4,11,26,11,16,24,6,5,1,11,1,27020
2021-08-02,9,135614,61,9,12,27,13,15,27,5,6,1,13,1,27021
2021-08-03,3,135617,57,6,12,27,12,17,25,5,7,1,12,,27021
2021-08-04,12,135629,59,5,12,30,12,18,27,4,8,1,12,,27021
2021-08-05,3,135632,60,8,10,30,12,17,24,4,8,1,12,1,27022
2021-08-06,9,135641,60,4,15,29,12,15,23,4,8,1,12,2,27024
2021-08-07,6,135647,59,5,15,28,11,13,24,5,6,0,11,,27024
2021-08-08,2,135649,58,6,16,22,14,16,19,7,7,0,14,,27024
2021-08-09,7,135656,68,9,15,28,16,18,24,8,7,0,16,1,27025
2021-08-10,7,135663,63,7,17,22,17,18,20,8,8,0,17,,27025
2021-08-11,7,135670,65,7,19,19,20,20,17,9,9,0,20,1,27026
2021-08-12,5,135675,65,4,17,26,18,20,22,8,8,1,18,,27026
2021-08-13,6,135681,56,4,12,24,16,18,17,8,8,0,16,,27026
2021-08-14,9,135690,59,5,11,26,17,19,20,10,7,0,17,,27026
2021-08-15,5,135695,61,6,13,25,17,16,19,10,7,0,17,2,27028
2021-08-16,10,135705,74,9,14,33,18,18,27,11,7,0,18,2,27030
2021-08-17,7,135712,74,4,22,30,18,18,25,10,6,1,18,1,27031
2021-08-18,9,135721,78,5,22,35,16,19,29,10,6,2,16,3,27034
2021-08-19,10,135731,73,4,15,36,18,20,31,9,5,3,18,1,27035
2021-08-20,10,135741,72,6,17,35,14,18,26,9,5,2,14,1,27036
2021-08-21,6,135747,61,4,13,32,12,16,25,8,4,0,12,,27036
2021-08-22,6,135753,66,4,17,33,12,17,27,7,5,0,12,,27036
2021-08-23,8,135761,72,8,21,31,12,19,26,8,5,0,13,,27036
2021-08-24,11,135772,69,6,21,31,11,16,22,8,3,0,11,1,27037
2021-08-25,10,135782,73,6,22,31,14,18,22,11,3,0,14,2,27039
2021-08-26,7,135789,71,6,26,27,12,16,19,10,2,0,12,,27039
2021-08-27,7,135796,62,9,21,22,10,14,17,8,2,0,10,1,27040
2021-08-28,5,135801,56,6,17,23,10,13,18,7,2,0,10,2,27042
2021-08-29,3,135804,55,6,18,23,8,9,16,6,2,0,8,1,27043
2021-08-30,4,135808,61,8,21,23,9,10,19,6,3,0,9,,27043
2021-08-31,9,135817,56,3,17,30,6,10,26,2,4,0,6,,27043
2021-09-01,15,135832,63,8,17,29,9,12,24,4,4,0,9,,27043
2021-09-02,10,135842,66,5,23,27,11,14,23,7,4,0,11,2,27045
2021-09-03,14,135856,64,5,26,22,11,14,18,8,3,0,11,,27045
2021-09-04,7,135863,61,6,21,26,8,16,23,6,2,0,8,,27045
2021-09-05,10,135873,69,4,24,34,7,16,28,5,2,0,7,,27045
2021-09-06,17,135890,92,7,28,45,12,23,38,8,3,2,12,1,27046
2021-09-07,13,135903,97,4,28,49,16,26,41,12,3,2,16,2,27048
2021-09-08,15,135918,102,4,26,57,15,24,46,10,4,1,15,1,27049
2021-09-09,16,135934,113,8,31,59,15,22,47,11,4,1,15,,27049
2021-09-10,13,135947,117,6,39,57,15,24,52,11,4,1,15,,27049
2021-09-11,12,135959,115,5,31,62,17,27,55,11,6,1,17,,27049
2021-09-12,17,135976,127,7,28,72,20,31,64,12,8,1,20,2,27051
2021-09-13,29,136005,157,10,51,74,22,35,67,11,10,1,22,,27051
2021-09-14,25,136030,164,11,46,81,26,41,73,14,12,1,26,3,27054
2021-09-15,17,136047,168,8,56,74,30,38,64,16,12,2,30,3,27057
2021-09-16,19,136066,166,12,50,72,32,43,62,18,14,2,32,,27057
2021-09-17,31,136097,182,21,59,68,34,46,57,20,14,1,34,2,27059
2021-09-18,9,136106,161,17,41,72,31,43,60,16,16,1,32,3,27062
2021-09-19,14,136120,164,18,43,75,28,40,64,13,14,1,28,2,27064
2021-09-20,23,136143,185,19,59,77,30,42,65,11,16,2,30,4,27068
2021-09-21,19,136162,180,23,49,80,28,40,66,11,15,2,28,2,27070
2021-09-22,17,136179,182,19,52,84,27,38,64,10,15,2,27,2,27072
2021-09-23,21,136200,183,22,54,79,28,38,64,10,17,1,28,3,27075
2021-09-24,27,136227,188,24,41,92,31,42,76,13,17,2,31,,27075
2021-09-25,20,136247,188,21,34,98,35,46,79,16,19,2,35,2,27077
2021-09-26,16,136263,197,23,40,102,32,45,81,13,20,1,32,,27077
2021-09-27,34,136297,229,27,45,119,38,49,96,14,23,1,38,,27077
2021-09-28,16,136313,226,25,50,109,42,53,96,15,27,1,42,3,27080
2021-09-29,36,136349,253,30,57,127,39,51,110,12,26,1,39,5,27085
2021-09-30,32,136381,251,40,53,121,37,50,104,12,24,1,37,1,27086
2021-10-01,31,136412,244,33,63,118,30,45,99,6,24,1,30,1,27087
2021-10-02,27,136439,234,14,65,119,36,44,102,10,24,2,36,1,27088
2021-10-03,25,136464,247,15,65,130,37,52,107,10,24,3,37,4,27092
2021-10-04,53,136517,302,36,72,152,42,58,122,15,26,2,42,4,27096
2021-10-05,40,136557,302,21,66,162,53,72,136,24,27,2,53,2,27098
2021-10-06,54,136611,327,29,77,152,69,86,125,40,27,2,69,4,27102
2021-10-07,39,136650,316,24,78,152,62,75,128,31,27,2,62,3,27105
2021-10-08,51,136701,344,28,91,161,64,78,132,32,28,4,64,4,27109
2021-10-09,30,136731,333,25,80,170,58,77,145,27,28,3,58,3,27112
2021-10-10,34,136765,350,23,85,181,61,77,155,29,27,3,61,4,27116
2021-10-11,80,136845,425,32,113,202,78,99,167,37,36,3,78,5,27121
2021-10-12,62,136907,444,35,107,213,89,113,179,42,42,3,89,6,27127
2021-10-13,63,136970,470,30,122,228,90,114,190,44,42,2,90,6,27133
2021-10-14,57,137027,496,30,138,231,97,116,192,48,43,2,97,6,27139
2021-10-15,82,137109,527,44,141,248,94,115,212,43,48,2,94,10,27149
2021-10-16,70,137179,515,26,151,249,89,112,202,37,48,2,89,8,27157
2021-10-17,52,137231,543,32,153,263,95,116,210,40,50,3,95,11,27168
2021-10-18,135,137366,664,48,210,298,108,133,248,46,54,3,108,12,27180
2021-10-19,150,137516,733,63,232,325,113,146,274,55,54,4,113,9,27189
2021-10-20,117,137633,795,64,252,362,117,138,315,53,59,5,117,7,27196
2021-10-21,134,137767,851,67,260,399,125,142,350,55,64,4,125,10,27206
2021-10-22,160,137927,923,67,289,438,129,153,388,60,62,4,129,12,27218
2021-10-23,112,138039,930,70,266,462,132,151,407,64,62,4,133,13,27231
2021-10-24,110,138149,993,74,284,485,150,163,425,75,69,4,151,20,27251
2021-10-25,218,138367,1175,105,401,498,171,171,436,72,80,5,171,20,27271
2021-10-26,262,138629,1296,134,421,559,182,194,488,85,84,3,184,16,27287
2021-10-27,240,138869,1400,117,465,631,187,216,546,90,84,4,188,21,27308
2021-10-28,170,139039,1394,98,473,631,192,210,559,97,79,4,193,26,27334
2021-10-29,270,139309,1580,145,535,700,200,234,616,103,93,4,201,25,27359
2021-10-30,189,139498,1598,121,517,738,222,238,651,113,99,6,223,23,27382
2021-10-31,203,139701,1731,132,541,800,258,267,715,130,118,5,259,28,27410
2021-11-01,413,140114,2106,183,686,946,291,311,822,146,133,8,291,30,27440
2021-11-02,396,140510,2298,205,724,1063,306,318,917,153,136,10,306,33,27473
2021-11-03,385,140895,2498,212,816,1144,326,345,983,165,146,10,326,40,27513
2021-11-04,385,141280,2662,203,902,1216,341,345,1043,163,163,11,341,45,27558
2021-11-05,359,141639,2803,215,933,1273,382,384,1102,181,179,12,382,52,27610
2021-11-06,280,141919,2802,189,913,1308,392,389,1138,193,180,11,393,48,27658
2021-11-07,278,142197,2952,185,964,1385,418,424,1196,200,197,11,420,35,27693
2021-11-08,537,142734,3415,290,1183,1465,477,471,1249,233,214,13,477,46,27739
2021-11-09,547,143281,3621,325,1189,1594,513,487,1340,247,230,13,515,62,27801
2021-11-10,468,143749,3764,377,1211,1623,553,511,1392,278,240,14,555,72,27873
2021-11-11,494,144243,3896,394,1248,1693,561,519,1459,282,252,10,565,70,27943
2021-11-12,532,144775,4059,406,1307,1760,586,527,1527,297,250,11,589,67,28010
2021-11-13,376,145151,3998,383,1182,1838,595,561,1618,285,270,12,597,70,28080
2021-11-14,342,145493,4142,353,1256,1911,622,601,1695,294,290,11,624,60,28140
2021-11-15,739,146232,4802,494,1589,2041,678,644,1803,330,305,12,680,88,28228
2021-11-16,660,146892,4882,487,1657,2049,689,651,1790,338,310,14,691,66,28294
2021-11-17,473,147365,4821,464,1484,2158,715,691,1911,353,323,13,717,82,28376
2021-11-18,642,148007,5192,493,1701,2252,746,716,1976,351,350,14,748,116,28492
2021-11-19,695,148702,5316,506,1760,2281,769,745,2015,363,364,15,770,109,28601
2021-11-20,492,149194,5204,481,1575,2385,763,753,2111,364,356,14,764,92,28693
2021-11-21,497,149691,5421,474,1666,2502,779,782,2231,365,367,16,780,107,28800
2021-11-22,856,150547,6017,590,1969,2639,819,817,2303,384,377,17,820,104,28904
2021-11-23,752,151299,6127,590,2011,2672,854,859,2348,404,402,16,855,106,29010
2021-11-24,721,152020,6232,592,2022,2731,887,869,2398,439,396,16,888,90,29100
2021-11-25,716,152736,6336,568,2060,2780,928,895,2448,470,404,17,929,107,29207
2021-11-26,765,153501,6437,580,2180,2728,949,914,2375,472,432,16,950,114,29321
2021-11-27,529,154030,6217,540,1908,2796,973,929,2487,467,459,17,974,91,29412
2021-11-28,492,154522,6420,524,1968,2917,1011,941,2616,488,475,17,1011,116,29528
2021-11-29,828,155350,7103,696,2337,2969,1101,985,2613,538,498,18,1101,105,29633
2021-11-30,739,156089,7026,644,2253,3012,1117,989,2662,524,515,17,1118,118,29751
2021-12-01,702,156791,6982,646,2190,3039,1107,981,2693,521,517,16,1108,134,29885
2021-12-02,730,157521,7071,688,2162,3132,1089,973,2796,507,504,15,1090,121,30006
2021-12-03,653,158174,7034,649,2232,3078,1075,968,2722,505,509,21,1076,113,30119
2021-12-04,440,158614,6560,604,1899,3020,1037,938,2711,477,505,22,1038,104,30223
2021-12-05,462,159076,6668,613,1898,3110,1047,965,2794,486,507,24,1048,101,30324
2021-12-06,746,159822,7135,732,2254,3085,1064,987,2750,503,500,27,1065,118,30442
2021-12-07,644,160466,6913,671,2195,2993,1054,994,2660,480,514,24,1055,102,30544
2021-12-08,626,161092,6762,607,2135,2935,1085,994,2591,512,514,25,1087,107,30651
2021-12-09,566,161658,6592,610,2011,2882,1089,1005,2545,512,524,23,1091,109,30760
2021-12-10,644,162302,6398,609,1895,2835,1059,975,2467,495,513,23,1061,113,30873
2021-12-11,380,162682,5872,483,1624,2742,1023,956,2434,486,492,26,1025,95,30968
2021-12-12,339,163021,5897,459,1669,2751,1018,972,2448,472,511,31,1020,113,31081
2021-12-13,644,163665,6386,597,2002,2758,1029,991,2419,479,513,30,1030,110,31191
2021-12-14,520,164185,6098,534,1899,2678,987,965,2342,447,499,29,988,104,31295
2021-12-15,482,164667,5849,488,1823,2581,957,931,2245,440,489,27,957,121,31416
2021-12-16,473,165140,5647,466,1779,2493,909,880,2174,423,459,25,909,96,31512
2021-12-17,471,165611,5337,483,1684,2276,894,860,1977,417,453,23,894,80,31592
2021-12-18,240,165851,4817,362,1383,2188,884,803,1954,407,437,23,884,102,31694
2021-12-19,270,166121,4799,355,1404,2191,849,809,1935,392,431,22,849,67,31761
2021-12-20,437,166558,5159,533,1591,2159,876,868,1884,410,428,24,876,76,31837
2021-12-21,411,166969,4910,527,1474,2065,844,855,1816,383,431,22,845,79,31916
2021-12-22,348,167317,4563,468,1369,1918,808,811,1693,364,411,17,809,83,31999
2021-12-23,292,167609,4112,441,1218,1689,764,765,1461,353,400,15,766,56,32055
2021-12-24,182,167791,3501,336,883,1547,735,698,1382,351,368,14,738,72,32127
2021-12-25,190,167981,3334,266,844,1500,724,684,1325,344,368,14,728,66,32193
2021-12-26,226,168207,3390,272,887,1509,722,699,1333,337,366,13,725,76,32269
2021-12-27,381,168588,3748,386,1070,1583,709,727,1398,324,360,12,713,50,32319
2021-12-28,326,168914,3652,388,1018,1553,693,707,1364,318,343,13,696,65,32384
2021-12-29,323,169237,3469,348,966,1484,671,690,1314,302,340,11,674,69,32453
2021-12-30,257,169494,3275,291,926,1447,611,644,1274,279,316,10,615,56,32509
2021-12-31,233,169727,3114,241,893,1384,596,616,1210,275,304,14,599,52,32561
2022-01-01,168,169895,2869,214,735,1337,583,595,1180,267,297,17,586,42,32603
2022-01-02,166,170061,2892,218,747,1354,573,587,1197,255,300,17,576,47,32650
2022-01-03,277,170338,3091,277,860,1390,564,576,1210,246,301,18,567,57,32707
2022-01-04,275,170613,2994,255,841,1369,529,562,1184,224,288,17,533,54,32761
2022-01-05,245,170858,2850,225,793,1328,504,533,1155,225,258,17,507,37,32798
2022-01-06,204,171062,2727,204,749,1271,503,536,1100,228,256,16,506,56,32854
2022-01-07,189,171251,2609,203,712,1223,471,505,1038,215,236,14,473,43,32897
2022-01-08,154,171405,2377,167,623,1136,451,488,977,210,225,14,453,42,32939
2022-01-09,113,171518,2353,183,612,1128,430,474,975,196,222,11,432,22,32961
2022-01-10,176,171694,2477,250,707,1082,438,491,915,196,236,12,442,40,33001
2022-01-11,179,171873,2316,227,629,1038,422,460,862,190,218,11,427,37,33038
2022-01-12,140,172013,2129,197,573,969,390,417,820,176,200,9,391,39,33077
2022-01-13,151,172164,2003,182,553,894,374,386,756,165,190,10,375,30,33107
2022-01-14,131,172295,1850,165,529,810,346,359,670,150,181,10,347,30,33137
2022-01-15,89,172384,1667,138,425,783,321,342,641,140,170,10,322,23,33160
2022-01-16,92,172476,1672,137,451,775,309,336,640,132,166,8,309,25,33185
2022-01-17,194,172670,1824,193,549,783,299,338,639,123,168,8,299,26,33211
2022-01-18,190,172860,1739,198,528,739,274,311,596,111,152,9,274,22,33233
2022-01-19,206,173066,1679,193,505,721,260,302,586,104,144,7,260,25,33258
2022-01-20,227,173293,1648,186,520,708,234,279,571,101,126,5,234,18,33276
2022-01-21,231,173524,1603,186,526,677,214,265,545,85,121,5,214,17,33293
2022-01-22,157,173681,1468,143,462,658,205,276,539,79,116,3,207,20,33313
2022-01-23,177,173858,1537,150,488,702,197,272,575,82,104,3,199,13,33326
2022-01-24,195,174053,1695,194,586,708,207,264,559,86,104,2,207,14,33340
