Kod,NUTS 0,NUTS 1,NUTS 2,NUTS 3,Latitude,Longitude,Population
CZ,Česká republika,,,,0.0,0.0,10693939
CZ0,,Česká republika,,,0.0,0.0,10693939
CZ01,,,Praha,,0.0,0.0,0
CZ010,,,,Hlavní město Praha,50.0874654,14.4212535,1324277
CZ02,,,Střední Čechy,,0.0,0.0,0
CZ020,,,,Středočeský kraj,50.0601579,13.83074794209991,1385141
CZ03,,,Jihozápad,,0.0,0.0,0
CZ031,,,,Jihočeský kraj,49.0864548,14.600172741470452,644083
CZ032,,,,Plzeňský kraj,49.522810199999995,13.206311785137638,589899
CZ04,,,Severozápad,,0.0,0.0,0
CZ041,,,,Karlovarský kraj,50.1753532,12.806086309968043,294664
CZ042,,,,Ústecký kraj,50.5663266,13.820670539566608,820965
CZ05,,,Severovýchod,,0.0,0.0,0
CZ051,,,,Liberecký kraj,50.747603999999995,14.990310290688765,443690
CZ052,,,,Královéhradecký kraj,50.40939265,15.68500539430977,551647
CZ053,,,,Pardubický kraj,49.889818950000006,16.128325371948733,522662
CZ06,,,Jihovýchod,,0.0,0.0,0
CZ063,,,,Kraj Vysočina,49.399409649999996,15.570471215163911,509813
CZ064,,,,Jihomoravský kraj,49.1249179,16.682771628867208,1191981
CZ07,,,Střední Morava,,0.0,0.0,0
CZ071,,,,Olomoucký kraj,49.859105799999995,16.956126746749305,632015
CZ072,,,,Zlínský kraj,49.19692,17.646091635845135,582555
CZ08,,,Moravskoslezsko,,0.0,0.0,0
CZ080,,,,Moravskoslezský kraj,49.860275,18.038654134727693,1200539
CZZ,,Extra-Regio,,,0.0,0.0,0
CZZZ,,,Extra-Regio,,0.0,0.0,0
CZZZZ,,,,Extra-Regio,-23.9840033,-46.3079719,0
