Province/State,Country/Region,Lat,Long,1/22/20,1/23/20,1/24/20,1/25/20,1/26/20,1/27/20,1/28/20,1/29/20,1/30/20,1/31/20,2/1/20,2/2/20,2/3/20,2/4/20,2/5/20,2/6/20,2/7/20,2/8/20,2/9/20,2/10/20,2/11/20,2/12/20,2/13/20,2/14/20,2/15/20,2/16/20,2/17/20,2/18/20,2/19/20,2/20/20,2/21/20,2/22/20,2/23/20,2/24/20,2/25/20,2/26/20,2/27/20,2/28/20,2/29/20,3/1/20,3/2/20,3/3/20,3/4/20,3/5/20,3/6/20,3/7/20,3/8/20,3/9/20,3/10/20,3/11/20,3/12/20,3/13/20,3/14/20,3/15/20,3/16/20,3/17/20,3/18/20,3/19/20,3/20/20,3/21/20,3/22/20,3/23/20,3/24/20,3/25/20,3/26/20,3/27/20,3/28/20,3/29/20,3/30/20,3/31/20,4/1/20,4/2/20,4/3/20,4/4/20,4/5/20,4/6/20,4/7/20,4/8/20,4/9/20,4/10/20,4/11/20,4/12/20,4/13/20,4/14/20,4/15/20,4/16/20,4/17/20,4/18/20,4/19/20,4/20/20,4/21/20,4/22/20,4/23/20,4/24/20,4/25/20,4/26/20,4/27/20,4/28/20,4/29/20,4/30/20,5/1/20,5/2/20,5/3/20,5/4/20,5/5/20,5/6/20,5/7/20,5/8/20,5/9/20,5/10/20,5/11/20,5/12/20,5/13/20,5/14/20,5/15/20,5/16/20,5/17/20,5/18/20,5/19/20,5/20/20,5/21/20,5/22/20,5/23/20,5/24/20,5/25/20,5/26/20,5/27/20,5/28/20,5/29/20,5/30/20,5/31/20,6/1/20,6/2/20,6/3/20,6/4/20,6/5/20,6/6/20,6/7/20,6/8/20,6/9/20,6/10/20,6/11/20,6/12/20,6/13/20,6/14/20,6/15/20,6/16/20,6/17/20,6/18/20,6/19/20,6/20/20,6/21/20,6/22/20,6/23/20,6/24/20,6/25/20,6/26/20,6/27/20,6/28/20,6/29/20,6/30/20,7/1/20,7/2/20,7/3/20,7/4/20,7/5/20,7/6/20,7/7/20,7/8/20,7/9/20,7/10/20,7/11/20,7/12/20,7/13/20,7/14/20,7/15/20,7/16/20,7/17/20,7/18/20,7/19/20,7/20/20,7/21/20,7/22/20,7/23/20,7/24/20,7/25/20,7/26/20,7/27/20,7/28/20,7/29/20,7/30/20,7/31/20,8/1/20,8/2/20,8/3/20,8/4/20,8/5/20,8/6/20,8/7/20,8/8/20,8/9/20,8/10/20,8/11/20,8/12/20,8/13/20,8/14/20,8/15/20,8/16/20,8/17/20,8/18/20,8/19/20,8/20/20,8/21/20,8/22/20,8/23/20,8/24/20,8/25/20,8/26/20,8/27/20,8/28/20,8/29/20,8/30/20,8/31/20,9/1/20,9/2/20,9/3/20,9/4/20,9/5/20,9/6/20,9/7/20,9/8/20,9/9/20,9/10/20,9/11/20,9/12/20,9/13/20,9/14/20,9/15/20,9/16/20,9/17/20,9/18/20,9/19/20,9/20/20,9/21/20,9/22/20,9/23/20,9/24/20,9/25/20,9/26/20,9/27/20,9/28/20,9/29/20,9/30/20,10/1/20,10/2/20,10/3/20,10/4/20,10/5/20,10/6/20,10/7/20,10/8/20,10/9/20,10/10/20,10/11/20,10/12/20,10/13/20,10/14/20,10/15/20,10/16/20,10/17/20,10/18/20,10/19/20,10/20/20,10/21/20,10/22/20,10/23/20,10/24/20,10/25/20,10/26/20,10/27/20,10/28/20,10/29/20,10/30/20,10/31/20,11/1/20,11/2/20,11/3/20,11/4/20,11/5/20,11/6/20,11/7/20,11/8/20,11/9/20,11/10/20,11/11/20,11/12/20,11/13/20,11/14/20,11/15/20,11/16/20,11/17/20,11/18/20,11/19/20,11/20/20,11/21/20,11/22/20,11/23/20,11/24/20,11/25/20,11/26/20,11/27/20,11/28/20,11/29/20,11/30/20,12/1/20,12/2/20,12/3/20,12/4/20,12/5/20,12/6/20,12/7/20,12/8/20,12/9/20,12/10/20,12/11/20,12/12/20,12/13/20,12/14/20,12/15/20,12/16/20,12/17/20,12/18/20,12/19/20,12/20/20,12/21/20,12/22/20,12/23/20,12/24/20,12/25/20,12/26/20,12/27/20,12/28/20,12/29/20,12/30/20,12/31/20,1/1/21,1/2/21,1/3/21,1/4/21,1/5/21,1/6/21,1/7/21,1/8/21,1/9/21,1/10/21,1/11/21,1/12/21,1/13/21,1/14/21,1/15/21,1/16/21,1/17/21,1/18/21,1/19/21,1/20/21,1/21/21,1/22/21,1/23/21,1/24/21,1/25/21,1/26/21,1/27/21,1/28/21,1/29/21,1/30/21,1/31/21,2/1/21,2/2/21,2/3/21,2/4/21,2/5/21,2/6/21,2/7/21,2/8/21,2/9/21,2/10/21,2/11/21,2/12/21,2/13/21,2/14/21
,Czechia,,,0,0,0,0,0,0,0,0,0,0,0,0,0,0,0,0,0,0,0,0,0,0,0,0,0,0,0,0,0,0,0,0,0,0,0,0,0,0,0,0,0,0,0,0,0,0,0,0,0,0,0,0,0,0,0,0,0,0,0,0,0,0,0,0,0,0,0,0,0,0,0,0,0,0,0,0,0,0,0,0,0,0,0,0,0,0,0,0,0,0,0,0,0,0,0,0,0,0,0,0,0,0,0,0,0,0,0,0,0,0,0,0,0,0,0,0,0,0,0,0,0,0,0,0,0,0,0,0,0,0,0,0,0,0,0,0,0,0,0,0,0,0,0,0,0,0,0,0,0,0,0,0,0,0,0,0,0,0,0,0,0,0,0,0,0,0,0,0,0,0,0,0,0,0,0,0,0,0,0,0,0,0,0,0,0,0,0,0,0,0,0,0,0,0,0,0,0,0,0,0,0,0,0,0,0,0,0,0,0,0,0,0,0,0,0,0,0,0,0,0,0,0,0,0,9,11,11,11,12,12,12,12,12,12,12,12,12,12,13,13,13,13,13,13,13,14,14,14,14,15,15,15,15,15,15,16,16,16,16,16,16,16,16,16,16,16,16,16,16,16,16,16,16,16,16,16,16,16,16,16,16,16,16,16,16,16,16,16,16,16,16,16,16,16,16,16,16,16,16,16,16,16,16,16,16,16,16,16,16,16,16,16,16,16,16,16,16,16,16,16,16,16,16,16,16,16,16,16,16,16,16,16,16,16,16,16,16,16,16,16,16,16,16,16,16,16,16,16,16,16,16,16,16,16,16,16,16,16,16,16,16,16,16,16,16,16,16,16,16,16,16,16,16,16,16,16,16,16,16,16,16,16,16,16,16,16,16,16,16,16
Hlavní město Praha,Czechia,50.0596288,14.446459273258009,0,0,0,0,0,0,0,0,0,0,0,0,0,0,0,0,0,0,0,0,0,0,0,0,0,0,0,0,0,0,0,0,0,0,0,0,0,0,0,2,2,2,2,2,10,14,14,18,30,36,48,55,70,109,128,148,179,255,287,350,376,413,472,554,623,734,790,823,860,915,993,1073,1135,1160,1196,1230,1263,1318,1358,1393,1412,1429,1439,1449,1489,1510,1531,1559,1571,1614,1624,1638,1640,1654,1666,1667,1671,1681,1691,1714,1727,1729,1730,1737,1754,1764,1778,1792,1804,1813,1825,1831,1852,1862,1877,1892,1903,1927,1936,1949,1951,1970,1973,1977,1978,1982,1990,2002,2012,2021,2029,2038,2055,2078,2093,2098,2100,2105,2118,2125,2138,2149,2166,2184,2198,2211,2222,2234,2258,2279,2283,2292,2300,2318,2337,2352,2363,2372,2379,2382,2390,2398,2413,2425,2426,2434,2442,2447,2461,2477,2492,2498,2504,2515,2530,2545,2565,2577,2595,2621,2648,2711,2763,2813,2898,2937,2971,3012,3073,3141,3186,3239,3274,3300,3341,3419,3459,3514,3587,3632,3661,3712,3798,3881,3971,4052,4092,4130,4174,4238,4325,4371,4500,4576,4609,4667,4736,4843,4935,5075,5136,5259,5313,5436,5580,5763,5964,6091,6258,6393,6725,7008,7338,7625,8058,8315,8578,8855,9329,10045,10441,10846,11062,11324,11784,12165,12618,13133,13603,13926,14169,14535,15053,15712,16236,16721,17229,17682,18525,19369,20085,21464,22118,22539,23167,24318,25626,26797,28164,29357,30016,31066,32660,34365,36092,37601,38930,39678,40976,42461,43546,44877,46063,46990,47434,48144,49029,49879,50767,51482,51879,52082,52494,53097,53847,54292,54789,55048,55183,55549,55905,56267,56760,57239,57493,57598,57923,58389,58760,59055,59436,59680,59814,60117,60508,60902,61379,61794,62145,62284,62611,63175,63689,64262,64783,65188,65421,65861,66714,67497,68350,69196,70007,70443,71217,72401,73893,74664,74999,75321,75925,77282,79333,81214,83002,83388,83968,84824,86090,88202,90052,91503,92794,93582,94082,94900,95875,96955,97694,98446,98927,99201,99915,100818,101618,102299,103193,103684,103967,104723,105678,106564,107407,108301,108744,109076,109872,110846,111823,112916,113816,114420,114760,115942,117117,118128,119246,120260,121086,121532
Středočeský kraj,Czechia,50.0601579,13.83074794209991,0,0,0,0,0,0,0,0,0,0,0,0,0,0,0,0,0,0,0,0,0,0,0,0,0,0,0,0,0,0,0,0,0,0,0,0,0,0,0,0,0,0,0,0,0,0,2,2,2,16,19,20,24,30,49,62,80,112,139,152,174,189,206,233,272,335,366,373,387,418,444,466,505,539,554,589,611,646,674,700,717,724,732,738,765,786,796,809,814,827,842,844,847,854,865,869,871,881,887,895,898,901,903,906,913,921,927,929,930,932,944,950,959,980,995,1002,1004,1012,1016,1021,1026,1031,1034,1036,1041,1043,1044,1048,1052,1054,1061,1061,1062,1065,1071,1071,1074,1077,1080,1082,1092,1106,1112,1120,1131,1138,1146,1147,1152,1154,1158,1160,1164,1174,1183,1187,1195,1198,1202,1208,1214,1218,1224,1243,1260,1272,1276,1284,1297,1314,1324,1327,1331,1337,1343,1373,1381,1393,1405,1417,1430,1452,1492,1513,1544,1560,1575,1601,1652,1698,1734,1758,1775,1788,1812,1831,1865,1893,1947,1983,2003,2023,2059,2108,2149,2173,2192,2206,2226,2271,2312,2348,2413,2448,2464,2489,2527,2584,2630,2714,2756,2814,2845,2919,3002,3113,3258,3347,3404,3486,3667,3839,4036,4260,4504,4653,4793,4988,5250,5645,5971,6188,6338,6542,6842,7073,7472,7924,8198,8452,8695,8975,9380,9940,10461,10785,11051,11403,11933,12681,13281,14318,15052,15407,15970,17070,18122,19243,20601,21686,22299,23489,24992,26926,28706,30460,32355,33134,34462,36443,38251,39786,41528,43152,44060,45073,46431,48498,50141,51599,52387,52736,53251,54220,55448,56334,57106,57494,57661,58178,58697,59411,60158,60920,61268,61421,61982,62714,63303,63928,64458,64808,64904,65286,66118,66585,67222,67785,68206,68364,68958,69827,70628,71419,72260,72823,72958,73720,74768,75709,76785,77885,78616,78887,79878,81426,83165,83791,84073,84409,84893,86468,88838,91176,93408,93765,94324,95145,96741,99364,101610,103555,105139,106139,106509,107646,109037,110527,111511,112687,113374,113574,114625,115884,117021,118011,119126,119729,119960,120990,122241,123414,124351,125344,125850,126106,127174,128661,129960,131146,132442,133220,133506,134743,136186,137727,139061,140266,141269,141639
Jihočeský kraj,Czechia,49.0864548,14.600172741470452,0,0,0,0,0,0,0,0,0,0,0,0,0,0,0,0,0,0,0,0,0,0,0,0,0,0,0,0,0,0,0,0,0,0,0,0,0,0,0,0,0,0,0,0,0,0,0,0,0,1,1,2,2,6,11,14,17,19,29,30,30,33,35,55,67,76,83,84,92,100,109,116,118,119,119,122,130,136,138,146,149,154,155,155,156,158,158,158,159,161,163,163,167,169,171,171,171,172,172,172,172,172,172,172,172,174,177,177,177,177,177,177,180,180,180,180,180,180,180,180,181,181,181,181,181,181,181,182,185,185,185,185,185,186,186,186,187,189,189,189,190,191,191,191,191,191,191,191,191,191,191,191,192,192,194,199,200,200,200,200,200,200,200,201,201,201,201,202,202,204,206,206,206,207,208,208,210,215,215,215,227,230,234,237,247,252,267,276,282,299,326,344,350,351,353,357,367,374,390,396,400,406,411,425,433,440,445,449,452,468,485,492,522,527,528,548,584,602,615,637,654,654,665,695,737,764,815,849,858,908,944,977,1045,1118,1183,1201,1215,1291,1412,1530,1646,1759,1764,1826,1961,2063,2199,2339,2436,2447,2486,2557,2689,2858,3040,3294,3322,3412,3741,4035,4440,4900,5175,5258,5393,5951,6517,7125,7686,8267,8453,8885,9780,10429,11514,12386,13356,13658,14274,15037,16114,16916,18014,18949,19130,19612,20542,21615,22631,23856,24513,24727,24928,25812,26415,27007,27557,27831,27890,28258,28446,28852,29301,29585,29673,29709,30057,30601,30823,31081,31283,31354,31367,31524,31879,32129,32380,32650,32808,32827,33001,33309,33677,33929,34218,34416,34433,34620,34966,35419,35676,36072,36269,36308,36625,37212,37923,38151,38277,38372,38490,38987,39888,40757,41380,41455,41592,41695,42285,43280,44082,44998,45810,46111,46152,46554,47207,47835,48307,48950,49151,49170,49510,50027,50431,50922,51388,51523,51569,51864,52391,52857,53279,53698,53821,53901,54264,54727,55185,55643,56100,56219,56291,56625,57072,57549,58158,58564,58719,58774
Plzeňský kraj,Czechia,49.522810199999995,13.20631211667286,0,0,0,0,0,0,0,0,0,0,0,0,0,0,0,0,0,0,0,0,0,0,0,0,0,0,0,0,0,0,0,0,0,0,0,0,0,0,0,0,0,0,0,0,0,0,0,0,1,2,2,2,2,11,11,11,14,19,19,20,20,22,33,43,76,94,119,121,143,168,179,189,219,255,266,287,317,363,381,403,430,441,466,478,493,502,519,523,548,550,560,563,571,576,577,579,587,593,596,603,604,608,611,612,613,623,625,631,631,631,634,636,636,641,645,647,647,649,650,652,654,655,655,655,656,657,657,659,659,659,659,659,660,660,660,661,661,661,661,661,661,661,661,661,661,661,662,662,662,665,665,669,669,669,670,670,670,671,673,673,673,676,676,677,677,677,677,678,678,678,680,680,680,681,681,681,683,685,688,688,688,690,693,698,703,706,709,712,715,722,724,730,734,735,744,750,757,765,796,811,812,814,825,842,859,880,884,903,926,934,950,956,965,986,993,1001,1015,1036,1048,1064,1077,1083,1096,1130,1167,1190,1214,1243,1250,1301,1349,1410,1503,1572,1665,1713,1765,1839,1968,2125,2245,2317,2365,2441,2586,2721,2855,3028,3118,3171,3223,3349,3496,3665,3858,3994,4098,4364,4563,4831,5133,5486,5749,5927,6230,6772,7320,7963,8794,9490,9936,10400,11189,12129,13123,13996,14820,15237,15845,16788,17421,18118,18618,19108,19261,20243,20889,21565,22122,22641,22835,23059,23383,23761,24125,24507,24856,25125,25254,25552,25785,26051,26398,26673,26841,26887,27108,27441,27702,27898,28086,28192,28219,28411,28642,28895,29128,29367,29480,29535,29785,29987,30251,30519,30794,30996,31044,31376,31750,32123,32568,33033,33298,33373,33870,34387,35068,35185,35430,35609,35769,36333,36965,37644,38259,38375,38653,38806,39361,40015,40803,41414,42060,42311,42443,42988,43565,44076,44402,44971,45116,45228,45691,46265,46759,47214,47781,47944,48014,48413,48891,49525,50026,50675,50794,50918,51427,52082,52854,53627,54381,54589,54682,55307,56159,56832,57639,58479,58774,58917
Karlovarský kraj,Czechia,50.1753532,12.806086309968043,0,0,0,0,0,0,0,0,0,0,0,0,0,0,0,0,0,0,0,0,0,0,0,0,0,0,0,0,0,0,0,0,0,0,0,0,0,0,0,0,0,0,0,0,0,0,0,0,1,1,1,1,8,13,13,17,18,28,37,39,41,47,55,65,65,77,89,93,99,105,113,123,137,151,154,167,170,174,185,187,194,196,198,211,213,220,222,233,247,260,272,287,289,300,328,346,348,352,356,358,368,372,378,383,405,409,413,417,418,421,426,427,428,430,431,431,431,434,435,441,441,443,445,449,449,449,450,450,450,450,450,450,451,453,459,462,466,466,467,467,467,468,468,469,469,469,469,469,469,469,469,469,469,470,470,470,470,470,471,471,471,471,471,471,471,471,471,471,471,471,471,471,471,471,471,471,471,471,471,471,471,472,473,473,473,473,473,473,474,478,479,483,485,485,489,493,493,498,498,499,500,500,501,501,502,504,504,504,504,506,510,515,524,524,525,528,529,538,547,556,559,559,559,572,596,608,625,630,630,633,683,715,742,759,796,801,818,910,979,1013,1077,1114,1150,1186,1228,1299,1355,1397,1422,1425,1461,1487,1540,1594,1647,1680,1722,1773,1844,1978,2029,2113,2152,2208,2291,2426,2551,2686,2905,3015,3162,3371,3657,3879,4058,4275,4603,4904,4966,5229,5498,5812,5981,6347,6535,6585,6964,7225,7534,7642,8025,8052,8087,8462,8520,8780,8927,8985,8994,9165,9172,9257,9475,9634,9760,9808,9942,9961,10162,10179,10319,10356,10365,10397,10472,10689,10775,10881,11001,11015,11137,11152,11315,11507,11545,11650,11711,11757,11878,12080,12351,12571,12649,12678,12912,13205,13286,13501,13534,13550,13563,13808,14033,14515,14885,15131,15197,15250,15432,15843,16394,16754,17152,17628,17672,17754,18051,18477,18861,19155,19535,19544,19657,20479,20613,21035,21514,21827,21962,22142,22640,23162,23960,24424,24829,25115,25461,25999,26829,27159,27743,28331,28486,28628,29395,30089,30519,31165,31399,31426
Ústecký kraj,Czechia,50.5663266,13.820670539566608,0,0,0,0,0,0,0,0,0,0,0,0,0,0,0,0,0,0,0,0,0,0,0,0,0,0,0,0,0,0,0,0,0,0,0,0,0,0,0,1,1,2,2,5,8,10,12,12,16,16,16,17,17,20,23,25,26,35,38,40,45,48,53,68,78,87,96,121,151,206,218,264,290,293,307,331,336,346,357,367,381,383,383,389,397,409,418,424,436,453,465,467,471,475,477,479,479,483,489,492,492,493,493,493,494,495,497,497,497,500,501,503,506,510,513,515,516,526,527,527,528,528,530,531,532,532,533,538,542,542,542,542,548,555,555,556,556,556,556,556,556,556,556,556,556,556,558,558,558,559,559,559,559,559,560,560,560,560,560,561,561,561,561,561,561,561,561,562,562,562,562,562,562,562,562,564,565,566,566,566,567,574,586,597,605,606,608,615,629,632,637,645,648,648,656,664,671,678,686,688,710,710,722,737,744,754,754,756,758,766,773,779,799,803,803,808,818,839,855,867,894,903,904,914,940,972,980,990,1013,1033,1057,1093,1141,1191,1239,1257,1316,1414,1494,1692,1808,1869,1917,2019,2123,2273,2420,2615,2715,2808,2839,2928,3074,3253,3504,3698,3780,3911,4087,4408,4739,5153,5487,5659,5842,6276,6893,7494,8083,8365,8942,9208,9986,11068,11936,13043,13923,14505,15311,16369,17181,18526,19576,20620,21180,21815,22623,23739,24596,25556,26268,26523,26909,27638,28246,28905,29427,29772,29933,30313,30651,31154,31612,32123,32405,32571,32840,33190,33631,33854,34190,34412,34500,34724,35064,35442,35824,36139,36585,36597,36868,37246,37711,38209,38562,38873,39033,39338,39899,40524,41127,41630,42024,42214,42671,43433,44191,44486,44680,44870,45144,45772,46924,47819,48805,49201,49466,49871,50560,51675,52707,53658,54519,55051,55263,55705,56349,56990,57448,57946,58244,58369,58771,59224,59723,60229,60670,60872,61044,61468,61959,62459,62890,63367,63584,63742,64186,64745,65328,65860,66333,66706,66859,67272,67959,68578,69136,69662,70122,70360
Liberecký kraj,Czechia,50.7476169,14.990302569053862,0,0,0,0,0,0,0,0,0,0,0,0,0,0,0,0,0,0,0,0,0,0,0,0,0,0,0,0,0,0,0,0,0,0,0,0,0,0,0,0,0,0,0,0,0,0,0,0,0,1,1,2,2,3,3,4,5,7,9,12,14,15,22,34,45,53,69,86,91,113,130,136,144,149,156,158,166,168,171,172,177,178,179,182,186,186,187,189,191,191,191,192,193,193,194,194,194,194,194,194,194,195,196,196,196,197,197,198,198,198,199,199,199,199,199,200,200,201,201,201,201,201,201,201,201,201,201,201,201,201,201,201,201,202,203,203,203,203,203,203,203,203,203,203,203,203,204,205,206,219,219,229,243,245,249,251,253,253,253,257,263,276,283,288,296,296,296,297,299,300,302,303,303,305,307,313,322,334,334,335,344,347,352,355,363,364,364,370,388,397,405,414,415,418,425,427,429,442,450,452,454,458,465,471,476,480,480,480,485,489,492,496,502,504,507,514,526,533,552,564,566,570,587,601,622,635,656,659,668,690,718,752,781,820,864,869,914,997,1079,1181,1281,1400,1436,1473,1565,1668,1748,1840,1920,1961,2011,2066,2179,2279,2414,2576,2691,2774,3028,3226,3420,3748,3980,4157,4321,4733,5119,5589,5978,6379,6569,6969,7471,7953,8597,9388,9810,10198,10618,11346,11764,12326,13003,13636,13892,14278,14943,15617,16268,16895,17256,17500,17855,18276,18486,19102,19427,19747,19840,20124,20281,20577,20937,21217,21375,21429,21653,21874,22055,22238,22453,22605,22649,22841,23076,23239,23515,23779,23924,23967,24216,24514,24813,25104,25385,25565,25650,25951,26389,26869,27247,27620,27846,27983,28416,28953,29617,29659,29821,29995,30118,30651,31296,31956,32418,32441,32905,33278,33918,34534,35284,36009,36662,37113,37406,38006,38596,39231,39727,40186,40399,40555,41087,41570,41986,42391,42715,42917,43036,43485,43980,44400,44812,45205,45376,45508,45966,46424,46864,47319,47753,47946,48078,48593,49081,49564,50047,50559,50782,50914
Královéhradecký kraj,Czechia,50.40930255,15.6850269825579,0,0,0,0,0,0,0,0,0,0,0,0,0,0,0,0,0,0,0,0,0,0,0,0,0,0,0,0,0,0,0,0,0,0,0,0,0,0,0,0,0,0,0,0,0,0,1,3,3,3,6,7,7,8,8,10,14,14,15,17,18,19,33,42,49,59,78,83,90,101,104,114,126,134,138,144,151,155,160,164,166,168,168,170,171,174,175,175,175,175,176,176,176,176,177,178,178,179,179,179,180,180,180,182,183,185,186,187,187,189,190,191,191,192,193,193,193,193,194,195,195,195,195,195,195,196,196,197,197,197,197,198,198,198,200,200,201,201,201,201,201,202,204,204,204,204,204,205,205,206,206,206,209,210,213,215,216,216,216,217,218,218,220,222,222,222,222,226,228,230,230,230,232,233,234,234,237,241,241,242,244,244,246,251,259,260,260,270,274,281,294,300,300,302,311,326,338,345,348,349,353,363,373,377,390,405,416,417,422,432,445,457,468,474,483,493,507,519,529,545,549,554,565,585,605,619,657,670,678,694,750,802,852,932,952,990,1018,1117,1198,1311,1349,1425,1457,1509,1606,1676,1735,1801,1872,1986,2002,2084,2193,2287,2402,2427,2454,2744,2962,3125,3338,3634,3925,4055,4254,4701,5180,5617,6310,6974,7212,7700,8289,9326,10037,10963,11970,12780,13367,14145,14773,15873,16576,17299,17915,18564,19168,20222,20933,21520,21960,22226,22628,23102,23664,24062,24398,24701,24792,25044,25350,25609,25863,26134,26358,26446,26801,27127,27410,27672,27896,28050,28154,28353,28594,28829,29046,29269,29484,29573,29733,30086,30434,30813,31105,31316,31459,31812,32186,32657,33092,33461,33835,34122,34592,35244,36244,36504,36636,36866,37176,38155,39126,40296,41072,41511,41893,42530,43579,44522,46057,47155,47994,48743,49449,50454,51034,51899,52738,53396,53986,54341,55236,56118,57004,57806,58583,59288,59668,60304,61221,62034,63053,63814,64416,64948,65457,66333,67685,68617,69428,69984,70492,71191,72207,73247,74232,74896,75567,75978
Pardubický kraj,Czechia,49.889818950000006,16.128325371948733,0,0,0,0,0,0,0,0,0,0,0,0,0,0,0,0,0,0,0,0,0,0,0,0,0,0,0,0,0,0,0,0,0,0,0,0,0,0,0,0,0,0,0,0,0,0,0,0,1,2,2,2,2,4,12,13,15,18,22,27,30,41,43,55,58,64,72,76,81,106,120,128,159,175,177,179,183,203,204,216,218,224,226,226,236,242,245,247,250,251,253,258,258,259,262,265,267,268,269,270,272,272,272,272,272,275,275,276,276,276,277,277,277,278,278,279,279,279,280,280,281,283,283,283,283,283,283,284,284,284,284,284,284,284,284,285,285,285,285,285,288,288,288,288,289,290,290,290,291,291,295,302,305,305,306,306,312,312,312,314,314,315,315,315,315,315,315,318,318,321,322,322,324,326,329,329,331,335,335,336,338,343,344,350,363,370,370,385,397,406,417,425,425,426,438,444,459,468,475,478,478,478,489,500,515,533,550,551,554,574,587,616,641,643,643,656,678,690,713,729,737,737,747,774,817,860,893,916,926,947,996,1052,1126,1189,1301,1333,1392,1465,1532,1641,1725,1796,1805,1880,1989,2082,2186,2304,2380,2402,2469,2559,2665,2802,2961,3021,3051,3206,3299,3474,3751,4096,4243,4341,4521,4974,5353,5762,6266,6564,6668,7076,7607,8357,9095,9758,10276,10500,11063,11870,12548,13338,14200,14860,15196,15602,16276,17243,18056,18758,19111,19211,19560,20132,20724,21222,21824,22041,22111,22531,22822,23265,23765,24088,24227,24290,24651,24996,25366,25599,25863,25962,25986,26258,26533,26703,26919,27200,27315,27362,27592,27930,28269,28680,29071,29197,29278,29566,29970,30440,30829,31259,31518,31647,32014,32562,33243,33457,33527,33674,33904,34519,35356,36237,37046,37178,37439,37870,38733,39666,40764,41501,42209,42636,42904,43570,44125,44758,45275,45846,46092,46236,46681,47174,47782,48172,48664,48822,48913,49354,50120,50563,51011,51578,51889,51984,52482,53056,53647,54057,54550,54851,54983,55605,56250,56874,57423,58020,58356,58564
Kraj Vysočina,Czechia,49.399409649999996,15.570471215163911,0,0,0,0,0,0,0,0,0,0,0,0,0,0,0,0,0,0,0,0,0,0,0,0,0,0,0,0,0,0,0,0,0,0,0,0,0,0,0,0,0,0,0,0,0,0,0,0,1,1,2,2,2,6,8,8,9,12,16,23,23,24,29,37,45,78,99,100,105,112,121,125,128,131,131,135,140,149,152,156,156,160,162,162,162,162,163,163,163,166,169,169,172,173,173,174,175,175,176,176,176,177,177,177,178,178,178,179,180,180,180,180,180,181,181,181,181,181,181,181,182,184,185,185,185,185,185,185,185,186,186,186,187,187,187,187,187,187,187,187,187,187,187,187,187,187,187,187,187,189,189,189,191,191,191,191,192,192,192,192,193,194,194,196,196,197,197,210,210,212,221,222,225,225,228,231,237,237,238,242,247,252,266,294,335,351,356,358,374,377,389,399,399,404,408,419,425,429,436,438,439,440,452,456,482,496,500,506,513,525,537,549,574,592,606,638,653,664,673,694,712,714,732,761,784,822,846,889,930,968,986,1040,1083,1138,1189,1205,1255,1312,1398,1534,1610,1670,1710,1797,1867,1987,2122,2266,2352,2414,2505,2611,2750,2920,3093,3186,3270,3392,3572,3795,4109,4555,4750,4900,5293,5632,6141,6312,6904,7465,7763,8106,8601,9247,9962,10535,10835,11216,11901,12615,13336,13934,14711,15150,15514,16349,16969,17836,18857,19582,20272,20442,21057,21825,22447,23075,23825,24137,24224,24666,24989,25418,25904,26335,26569,26682,26886,27413,27611,27982,28301,28538,28610,28850,29050,29367,29609,29936,30087,30190,30336,30654,31002,31209,31535,31643,31823,32025,32374,32675,32966,33498,33741,33879,34207,34741,35386,35546,35687,35907,36000,36449,37061,37909,38321,38469,38702,39012,39676,40479,41269,41832,42620,42933,43131,43486,43971,44406,44707,45196,45419,45503,45828,46206,46461,46706,46964,47151,47218,47506,47758,48051,48312,48595,48768,48793,49021,49392,49621,49844,50144,50295,50334,50638,50994,51297,51542,51822,51978,52056
Jihomoravský kraj,Czechia,49.1249179,16.682771628867208,0,0,0,0,0,0,0,0,0,0,0,0,0,0,0,0,0,0,0,0,0,0,0,0,0,0,0,0,0,0,0,0,0,0,0,0,0,0,0,0,0,0,0,0,0,0,0,0,0,3,3,4,9,16,22,33,39,51,59,78,85,89,99,109,116,137,147,164,175,184,219,238,253,275,284,292,308,317,323,334,342,347,348,350,361,374,380,384,386,392,398,408,414,423,428,428,432,435,440,444,445,445,448,453,455,461,469,474,475,481,489,494,494,502,504,505,506,510,510,512,512,515,516,516,521,521,528,532,542,548,551,555,565,565,569,572,575,583,583,585,587,590,593,599,599,603,608,615,617,624,625,626,628,631,648,651,653,655,655,655,656,656,664,667,671,672,672,674,680,683,687,690,690,691,702,707,725,748,755,755,772,793,801,829,840,845,848,865,891,924,963,980,989,1000,1005,1033,1043,1067,1096,1109,1116,1129,1156,1165,1185,1211,1240,1242,1263,1281,1314,1350,1398,1421,1426,1445,1493,1523,1562,1618,1663,1682,1714,1771,1849,1929,2041,2091,2116,2160,2280,2401,2495,2703,2801,2855,2934,3150,3265,3479,3643,3926,4031,4136,4425,4626,4993,5281,5460,5554,5624,5832,6178,6568,7003,7224,7372,7596,8150,8721,9221,10186,10633,10896,11177,12244,13121,14134,15269,16104,16314,16900,18251,19673,20804,22805,23929,24311,25067,26925,28226,29467,30783,31525,31928,32567,33892,36199,37581,38735,39525,39732,40310,41361,42146,42894,43679,44018,44190,44686,45186,45626,46319,46891,47232,47361,47779,48421,48873,49231,49723,49963,50098,50464,51031,51463,51924,52353,52589,52686,53207,53649,54437,55010,55673,55990,56164,56631,57324,58015,58462,59657,59940,60319,61036,61977,63830,64020,64243,64406,64586,65340,66821,68508,69646,70055,70424,70732,71809,73631,75482,76937,78454,79091,79398,80158,81276,82232,83061,84087,84656,84905,85514,86308,87151,87866,88720,89064,89250,89816,90602,91466,92116,92868,93130,93300,93930,94659,95500,96039,96758,97132,97331,97983,98897,99632,100320,101191,101344,101665
Olomoucký kraj,Czechia,49.859105799999995,16.956126746749305,0,0,0,0,0,0,0,0,0,0,0,0,0,0,0,0,0,0,0,0,0,0,0,0,0,0,0,0,0,0,0,0,0,0,0,0,0,0,0,0,0,0,0,0,0,0,1,1,4,5,5,7,21,32,38,38,46,60,65,75,97,110,129,153,177,212,240,260,279,298,329,353,381,413,419,447,461,494,551,560,580,583,585,586,595,603,609,615,617,630,646,657,661,664,665,666,668,673,673,674,675,676,676,676,681,690,691,693,693,693,693,701,704,710,712,714,714,714,714,714,714,716,719,719,719,720,720,720,721,724,724,728,733,733,735,742,753,768,786,795,810,813,819,819,819,821,826,828,833,839,839,841,842,851,862,863,874,877,879,884,886,890,892,894,894,894,894,894,896,902,907,908,909,914,919,920,927,931,931,932,933,941,948,955,960,960,960,966,976,995,1011,1017,1022,1027,1045,1052,1059,1062,1069,1071,1071,1079,1083,1090,1097,1107,1109,1109,1123,1127,1138,1142,1159,1161,1172,1185,1217,1227,1246,1260,1271,1276,1289,1296,1315,1332,1345,1355,1358,1363,1431,1456,1521,1544,1590,1623,1684,1747,1823,1948,2047,2098,2120,2214,2299,2412,2568,2831,2952,2966,3046,3227,3396,3631,3929,4001,4016,4292,4538,4839,5202,5875,6052,6130,6503,6808,7437,8299,9109,9665,9888,10560,11429,12730,13613,14542,15092,15612,16074,17579,18358,19125,20067,20564,21058,21732,22561,23440,24197,25019,25422,25762,26314,26640,27452,27863,28265,28468,28520,28993,29159,29516,29856,30202,30396,30435,30696,30908,31314,31499,31768,31954,31967,32290,32654,32901,33137,33472,33622,33646,33956,34284,34836,35080,35556,35641,35774,36160,36637,37155,37644,38059,38233,38420,38948,39345,40461,40560,40724,40834,41022,41403,42634,43600,44138,44237,44317,44557,45388,45991,47263,48028,48404,49144,49300,49925,50596,51241,51523,52035,52146,52280,52999,53498,53980,54367,54783,54911,55039,55499,56008,56459,56831,57239,57315,57394,57879,58388,58784,59107,59492,59575,59657,60035,60513,60930,61298,61702,61787,61884
Zlínský kraj,Czechia,49.19692,17.646091635845135,0,0,0,0,0,0,0,0,0,0,0,0,0,0,0,0,0,0,0,0,0,0,0,0,0,0,0,0,0,0,0,0,0,0,0,0,0,0,0,0,0,0,0,0,0,1,1,1,3,4,5,13,13,22,24,26,38,48,48,57,64,72,79,89,94,103,113,127,129,145,155,158,189,193,195,201,204,224,241,242,257,258,260,260,263,265,266,275,280,291,293,312,315,317,320,325,326,326,327,327,327,327,327,328,328,331,332,333,333,334,336,338,339,340,340,340,341,342,342,343,351,351,356,356,358,363,363,367,367,367,367,367,367,368,368,369,369,369,369,369,370,370,370,370,370,371,371,371,371,371,372,372,372,375,377,377,377,377,377,377,377,378,378,379,380,380,380,383,385,386,389,390,391,392,407,412,420,430,432,442,443,449,452,459,464,469,471,479,484,492,499,508,514,522,526,533,537,541,548,552,553,560,576,587,605,621,635,638,641,672,675,682,701,708,708,715,727,750,761,772,792,795,800,818,831,847,875,889,891,904,939,977,1058,1131,1219,1239,1262,1365,1522,1720,1807,1892,1964,2017,2088,2208,2352,2537,2656,2721,2868,3012,3210,3434,3750,3952,4047,4274,4543,4906,5324,5980,6264,6594,6877,7354,8126,8907,9707,10404,10835,11424,12258,13413,14398,15589,16697,17289,17910,19060,20050,20831,21847,22742,23252,23825,24800,25900,26869,27576,28036,28399,28863,29412,30026,30505,30877,31158,31324,31669,32074,32335,32767,33125,33380,33540,33789,34195,34496,34795,35109,35325,35439,35628,35951,36257,36465,36768,37034,37128,37402,37832,38210,38583,39057,39331,39556,39839,40476,41040,41497,42040,42418,42719,43145,43856,44711,44961,45221,45518,45769,46270,47304,48377,49220,49504,49891,50232,50973,52228,53147,54166,54973,55427,55756,56241,56969,57555,57947,58428,58739,58866,59135,59631,60086,60301,60741,60967,61099,61390,61771,62099,62319,62580,62778,62865,63098,63365,63612,63903,64127,64301,64362,64491,64762,65002,65184,65405,65533,65602
Moravskoslezský kraj,Czechia,49.860275,18.03865187130863,0,0,0,0,0,0,0,0,0,0,0,0,0,0,0,0,0,0,0,0,0,0,0,0,0,0,0,0,0,0,0,0,0,0,0,0,0,0,0,0,0,0,0,0,0,0,0,0,0,2,4,6,8,14,25,31,49,72,88,106,124,144,163,201,231,261,271,280,293,306,325,340,369,439,446,493,524,558,610,624,654,676,683,707,734,757,790,810,819,841,882,897,910,931,940,952,967,981,1003,1029,1050,1050,1060,1067,1083,1100,1112,1119,1121,1123,1129,1134,1139,1158,1169,1179,1181,1235,1268,1306,1318,1335,1391,1442,1471,1504,1516,1532,1551,1559,1566,1574,1589,1613,1630,1634,1646,1670,1703,1735,1757,1774,1787,1804,1809,1817,1825,1848,1918,1978,2002,2015,2034,2074,2127,2179,2283,2467,2694,2850,2951,2999,3082,3161,3248,3299,3337,3410,3475,3517,3581,3617,3653,3683,3719,3776,3824,3855,3911,3940,4003,4052,4125,4168,4200,4226,4252,4284,4320,4352,4379,4415,4442,4465,4509,4584,4662,4692,4744,4776,4799,4810,4845,4881,4925,4948,4974,4993,5020,5038,5071,5093,5150,5167,5189,5211,5238,5264,5278,5313,5353,5372,5393,5415,5449,5474,5508,5532,5551,5590,5634,5698,5788,5863,5909,5960,6029,6095,6279,6468,6562,6683,6719,6796,6959,7105,7264,7451,7594,7717,7802,7898,8169,8471,8848,9096,9335,9642,10019,10561,11096,11988,12449,12975,13319,13900,14891,15777,16689,17276,17942,18737,19492,20890,22330,23846,24947,25730,26972,28261,29731,30734,32084,33399,34491,35583,36881,38628,40204,41371,42431,43057,43883,44788,45852,46668,47577,48189,48682,49204,49626,50285,50933,51638,51998,52293,52703,53404,54017,54516,55043,55347,55524,55973,56648,57315,57951,58566,58946,59137,59708,60657,61373,62128,63045,63555,63855,64624,65752,67019,68128,69432,70257,71019,72289,73908,75663,76525,76811,77340,78062,79853,82096,84603,86238,86551,87432,88610,90725,93094,95259,97441,99194,100463,101178,102575,104046,105363,106358,107444,108197,108822,109519,110492,111226,111987,112850,113203,113532,114238,115077,115732,116373,117028,117443,117645,118246,118884,119434,119957,120699,120987,121162,121647,122322,122930,123533,124098,124454,124608
