{
  "name": "accountSetting",
  "table": "vw_account_settings",
  "guardedBy": "account",
  "idProp": ["accountId","key"],
  "belongsTo": ["account"],
  "fields": ["key", "usesDefault", {
    "value": {
      "type": "json"
    }
  }]
}