{
  "name": "invoice",
  "guardedBy": ["account"],
  "fields": ["invoiceNumber", "kind", "url", {
    "createdAt": {"type": "date"},
    "total": {"type": "int"},
    "subtotal": {"type": "int"},
    "includesTaxPercent": {"type": "int"}
  }],
  "belongsTo": ["account"]
}