{
  "name": "user",
  "guardedBy": ["self", "account", "project"],
  "fields": ["name", "fullName"],
  "belongsTo": [{
    "profileImage": {
      "model": "file"
    },
    "lastSeenRelease": {
      "model": "release"
    }
  }],
  "hasMany": ["unseenCardDiffs", "undismissedNonParticipatingResolvables", "deckOrders", {
    "handCards": {
      "model": "card",
      "via": {"table": "hand_cards", "fk1": "cardId", "fk2": "cardId"},
      "where": "visibility = 'default'",
      "deps": ["visibility"]
    },
    "archivedHandCards": {
      "model": "card",
      "via": {"table": "hand_cards", "fk1": "cardId", "fk2": "cardId"},
      "where": "visibility = 'archived'",
      "deps": ["visibility"]
    },
    "anyHandCards": {
      "model": "card",
      "via": {"table": "hand_cards", "fk1": "cardId", "fk2": "cardId"}
    },
    "subscribedDecks": {
      "model": "deck",
      "where": "not [table.]is_deleted",
      "deps": ["isDeleted"],
      "via": {"table": "deck_subscriptions", "fk1": "deckId", "fk2": "id", "order": "created_at desc"}
    },
    "savedSearches": {
      "model": "savedSearch",
      "fk": "ownerId"
    },
    "undismissedResolvables": {
      "model": "undismissedResolvable",
      "fk": "participantId"
    },
    "preferredParticipants": {
      "model": "preferredParticipant"
    },
    "emails": {
      "model": "userEmail",
      "order": "created_at"
    },
    "tags": {
      "model": "userTag"
    },
    "unverifiedEmails": {
      "model": "userEmail",
      "where": "not [table.]is_verified",
      "order": "created_at",
      "deps": ["isVerified"]
    },
    "primaryEmail": {
      "model": "userEmail",
      "where": "is_primary",
      "isSingleton": true,
      "deps": ["isPrimary"]
    },
    "pinnedMilestone": {
      "model": "milestone",
      "via": {"table": "pinned_milestones", "fk1": "milestoneId", "fk2": "id"},
      "where": "not [table.]is_deleted",
      "deps": ["date", "isDeleted"],
      "isSingleton": true
    },
    "snoozingResolvables": {
      "model": "resolvable",
      "via": {"table": "vw_snoozing_resolvables", "fk1": "resolvableId", "fk2": "id"}
    },
    "guestAccessibleProjects": {
      "model": "project",
      "via": {"table": "project_users", "fk1": "projectId", "fk2": "id", "where": "[table.]is_current and [table.]has_access"},
      "where": "visibility != 'deleted'",
      "deps": ["visibility"]
    },
    "newsletterSetting": {
      "model": "userSetting",
      "where": "key = 'wantsNewsletter'",
      "isSingleton": true
    },
    "dailyDigestMailSetting": {
      "model": "userSetting",
      "where": "key = 'notiDailyDigestMail'",
      "isSingleton": true
    },
    "convoDigestMailSetting": {
      "model": "userSetting",
      "where": "key = 'notiConvoDigestMail'",
      "isSingleton": true
    }
  }]
}
