{
  "name": "_root",
  "fields": [],
  "hasMany": [
    {
      "account": {
        "where": "id = $currentAccountId",
        "fk": null,
        "isSingleton": true
      },
      "loggedInUser": {
        "model": "user",
        "where": "id = $currentUserId",
        "fk": null,
        "isSingleton": true
      },
      "assigneeHistory": {
        "model": "$raw",
        "sql": "select * from f_assignee_history($currentUserId, $projectId)"
      },
      "deckHistory": {
        "model": "$raw",
        "sql": "select * from f_deck_history($currentUserId, $projectId)"
      },
      "releases" : {
        "order": "createdAt desc"
      },
      "currentRelease" : {
        "model": "release",
        "where": "is_live = true",
        "isSingleton": true
      },
      "cardsStatusHistory": {
        "model": "$raw",
        "sql": "select * from f_card_status_history($interval, $cardIds)"
      },
      "cardsEffortHistory": {
        "model": "$raw",
        "sql": "select * from f_card_effort_history($interval, $cardIds)"
      },
      "cardsFinishedHistory": {
        "model": "$raw",
        "sql": "select * from f_card_finished_history($interval, $projectId)"
      },
      "cardsTimeToFinished": {
        "model": "$raw",
        "sql": "select * from f_card_time_to_finished($cardIds)"
      }
    }
  ]
}