{
  "name": "resolvable",
  "guardedBy": "card",
  "fields": ["isClosed", "context", {
    "closedAt": {"deps": ["isClosed"], "type": "date"},
    "createdAt": {"type": "date"}
  }],
  "hasMany": [{
    "participants": {
      "model": "resolvableParticipant"
    },
    "activeParticipants": {
      "model": "resolvableParticipant",
      "where": "not [table.]done",
      "deps": ["done"]
    },
    "participantHistories": {
      "model": "resolvableParticipantHistory",
      "order": "lastChangedAt"
    },
    "entries": {
      "model": "resolvableEntry",
      "order": "createdAt"
    },
    "unseenEntries": {
      "model": "resolvableEntry",
      "via": {"table": "vw_unseen_resolvable_entries", "fk1": "resolvableEntryId", "fk2": "entryId"}
    }
  }],
  "belongsTo": ["card", {
    "creator": {"model":"user"},
    "closedBy": {
      "model": "user",
      "fk": "closedBy",
      "deps": ["isClosed"]
    }
  }]
}