{
  "name": "accountRole",
  "idProp": ["accountId", "userId"],
  "table": "account_users",
  "guardedBy": "account",
  "fields": ["role", "isBillingContact", {
    "createdAt": {"type": "date"},
    "lastChangedAt": {"type": "date"}
  }],
  "belongsTo": ["user", "account"],
  "defaultScope": "[table.]is_current and [table.]role != 'deleted'"
}