{
  "name": "preferredParticipant",
  "guardedBy": "project",
  "table": "vw_preferred_participants",
  "idProp": ["userId","targetUserId","projectId"],
  "fields": [],
  "belongsTo": ["user", "project", {
    "targetUser": {
      "model": "user",
      "fk": "targetUserId"
    }
  }]
}