{
  "name": "balance",
  "guardedBy": ["account"],
  "idProp": ["accountId"],
  "fields": [{
    "gift": {"type": "int"},
    "actual": {"type": "int"},
    "bonus": {"type": "int"},
    "includesTaxPercent": {"type": "int"}
  }],
  "belongsTo": ["account"],
  "defaultScope": "is_current"
}